########################
######### SPEX #########
########################
Version 05.00  (Sep  5, 2019)
Execution time: Jan 18, 2020  15:17:15
Hostname: login18-1.hpc.itc.rwth-aachen.de
MPI: 1,1


### subroutine: getinput ###

Basic parameters:
  Number of spins            =  1
            centers          =  4
            types            =  2
            equivalent atoms =  2  2
  Lattice parameter =      1.00000
  Lattice vectors   =      3.01411  -5.22060   0.00000
                           3.01411   5.22060   0.00000
                           0.00000   0.00000   9.80579
  Unit-cell volume  =    308.59778
  Reciprocal cutoff =      4.60000

Unit-cell geometry:
  # Ty  El              Coord.
  1  1  Ga   0.33333  -0.33333   0.00000
  2  1  Ga  -0.33333   0.33333   0.50000
  3  2  N    0.33333  -0.33333  -0.37700
  4  2  N   -0.33333   0.33333   0.12300

Symmetry information:
  Number of symmetry operations = 24
   #  Det           Axis           Angle   Syp  Inv
   1    1     --     --     --      --     Yes   1
   2   -1    1.00  -0.58   0.00   180.00   No    2
   3   -1    1.00   0.58   0.00   180.00   No    3
   4    1    0.00   0.00   1.00   120.00   Yes   9
   5    1    0.00   0.00   1.00   180.00   No    5
   6   -1    0.58   1.00   0.00   180.00   Yes   6
   7   -1    1.00   0.00   0.00   180.00   Yes   7
   8    1    0.00   0.00   1.00    60.00   No   11
   9    1    0.00   0.00  -1.00   120.00   Yes   4
  10   -1    0.00   1.00   0.00   180.00   No   10
  11    1    0.00   0.00  -1.00    60.00   No    8
  12   -1   -0.58   1.00   0.00   180.00   Yes  12
  13 - 24  Time reversal symmetries

##################
### Input file ###
##################
BZ       4 4 4
JOB      GW +:(1-30)
NBAND    200
RESTART  
KPT      +=(0,.57692,0)
 

Info: Simpson and Lagrange integration is used.

Radial mesh and basis functions:
  Number of radial grid points:       759  429
  Number of radial basis functions:    19   18
  Angular momentum quantum number:      8    6
  Maximal index:                        3

Core states:
  Atom type  1  (Ga)
  nl      Energy
  1s  -375.34991
  2s   -45.88297
  3s    -4.96076
  2p   -39.88207
  3p    -3.15226
  Atom type  2  (N )
  nl      Energy
  1s   -13.54409
  Number of valence electrons:   36

Average Coulomb potential: -0.35487  ( -9.65657 eV )

Read wavefunctions from harddisc... done   ( Timing:    0.22 )

Maximal energy difference in deg. subspaces: 1.9E-12
Minimal energy difference between subspaces: 1.4E-05

Wave functions:
  Number of bands:             198 -  200  (  200 )
            k points (IBZ):     64  (  12 /  30 )
            G vectors:         726
  k points of IBZ:
    1  (0.00000,0.00000,0.00000)  [ 0.00000, 0.00000, 0.00000 ]
    2  (0.00000,0.00000,0.25000)  [ 0.00000, 0.00000, 0.02550 ]
    3  (0.00000,0.00000,0.50000)  [ 0.00000, 0.00000, 0.05099 ]
    4  (0.00000,0.25000,0.00000)  [ 0.04147, 0.02394, 0.00000 ]
    5  (0.00000,0.25000,0.25000)  [ 0.04147, 0.02394, 0.02550 ]
    6  (0.00000,0.25000,0.50000)  [ 0.04147, 0.02394, 0.05099 ]
    7  (0.00000,0.50000,0.00000)  [ 0.08294, 0.04789, 0.00000 ]
    8  (0.00000,0.50000,0.25000)  [ 0.08294, 0.04789, 0.02550 ]
    9  (0.00000,0.50000,0.50000)  [ 0.08294, 0.04789, 0.05099 ]
   10  (0.25000,0.25000,0.00000)  [ 0.08294, 0.00000, 0.00000 ]
   11  (0.25000,0.25000,0.25000)  [ 0.08294, 0.00000, 0.02550 ]
   12  (0.25000,0.25000,0.50000)  [ 0.08294, 0.00000, 0.05099 ]
  k points of EIBZ (shifted set):
   65  (0.00000,0.57692,0.00000)  [ 0.09570, 0.05525, 0.00000 ]
   66  (0.00000,0.57692,0.25000)  [ 0.09570, 0.05525, 0.02550 ]
   67  (0.00000,0.57692,0.50000)  [ 0.09570, 0.05525, 0.05099 ]
   68  (0.00000,0.82692,0.00000)  [ 0.13717, 0.07920, 0.00000 ]
   69  (0.00000,0.82692,0.25000)  [ 0.13717, 0.07920, 0.02550 ]
   70  (0.00000,0.82692,0.50000)  [ 0.13717, 0.07920, 0.05099 ]
   71  (0.00000,0.07692,0.00000)  [ 0.01276, 0.00737, 0.00000 ]
   72  (0.00000,0.07692,0.25000)  [ 0.01276, 0.00737, 0.02550 ]
   73  (0.00000,0.07692,0.50000)  [ 0.01276, 0.00737, 0.05099 ]
   74  (0.00000,0.32692,0.00000)  [ 0.05423, 0.03131, 0.00000 ]
   75  (0.00000,0.32692,0.25000)  [ 0.05423, 0.03131, 0.02550 ]
   76  (0.00000,0.32692,0.50000)  [ 0.05423, 0.03131, 0.05099 ]
   77  (0.25000,0.57692,0.00000)  [ 0.13717, 0.03131, 0.00000 ]
   78  (0.25000,0.57692,0.25000)  [ 0.13717, 0.03131, 0.02550 ]
   79  (0.25000,0.57692,0.50000)  [ 0.13717, 0.03131, 0.05099 ]
   80  (0.25000,0.82692,0.00000)  [ 0.17865, 0.05525, 0.00000 ]
   81  (0.25000,0.82692,0.25000)  [ 0.17865, 0.05525, 0.02550 ]
   82  (0.25000,0.82692,0.50000)  [ 0.17865, 0.05525, 0.05099 ]
   83  (0.25000,0.07692,0.00000)  [ 0.05423,-0.01658, 0.00000 ]
   84  (0.25000,0.07692,0.25000)  [ 0.05423,-0.01658, 0.02550 ]
   85  (0.25000,0.07692,0.50000)  [ 0.05423,-0.01658, 0.05099 ]
   86  (0.25000,0.32692,0.00000)  [ 0.09570, 0.00737, 0.00000 ]
   87  (0.25000,0.32692,0.25000)  [ 0.09570, 0.00737, 0.02550 ]
   88  (0.25000,0.32692,0.50000)  [ 0.09570, 0.00737, 0.05099 ]
   89  (0.50000,0.57692,0.00000)  [ 0.17865, 0.00737, 0.00000 ]
   90  (0.50000,0.57692,0.25000)  [ 0.17865, 0.00737, 0.02550 ]
   91  (0.50000,0.57692,0.50000)  [ 0.17865, 0.00737, 0.05099 ]
   92  (0.50000,0.82692,0.00000)  [ 0.22012, 0.03131, 0.00000 ]
   93  (0.50000,0.82692,0.25000)  [ 0.22012, 0.03131, 0.02550 ]
   94  (0.50000,0.82692,0.50000)  [ 0.22012, 0.03131, 0.05099 ]

Generate wavefunctions at equivalent k points... done   ( Timing:   0.33 )

Size of array cpw:   209.8 MB
Size of array cmt:   260.9 MB

The system is not a metal.
The Fermi energy is placed in the center of the band gap.
KS energy gap:    0.07059528 Ha   (  1.92099521 eV )
Fermi energy:     0.29316457 Ha   (  7.97741378 eV )
Maximal energy:   5.57248232 Ha
Electron count error of the shifted k-point set:  0.0000000000000000

Wave-function checksum:  1.851721564246E-02


### subroutine: checkinput ###

Overlap <core|core>
Atom type  1
1s  1.000000 
2s -0.000000  1.000000 
3s  0.000000 -0.000001  0.999961 
2p  0.999418 
3p -0.000329  0.999458 
Atom type  2
1s  0.999983 

Overlap <core|basis>
Atom type  1
         u(s)    udot(s)
1s  0.000000  0.000000 
2s  0.000001  0.000000 
3s  0.004767 -0.007551 
         u(p)    udot(p)
2p -0.000106 -0.000031 
3p  0.017150 -0.021254 
Atom type  2
         u(s)    udot(s)
1s  0.003209 -0.002046 

Average overlap <core|val>
Atom type  1
1s  0.000000
2s  0.000000
3s  0.000679
2p  0.000010  0.000010  0.000010
3p  0.002208  0.002205  0.002208
Atom type  2
1s  0.000234

Maximum overlap <core|val> at (band/kpoint)
Atom type  1
1s  0.000000 (033/ 001)
2s  0.000001 (033/ 001)
3s  0.003697 (156/ 003)
2p  0.000055 (026/ 082)  0.000064 (024/ 001)  0.000057 (023/ 003)
3p  0.011526 (121/ 003)  0.014817 (111/ 001)  0.011787 (124/ 003)
Atom type  2
1s  0.001635 (002/ 073)

Overlap <basis|basis>
Atom type  1
   u(s)  1.000000 
udot(s) -0.000000  0.129862 
   u(p)  1.000000 
udot(p) -0.000000  0.075237 
   u(d)  1.000000 
udot(d) -0.000000  0.733838 
 ulo(d)  0.410292 -0.767526  1.000000 
   u(f)  1.000000 
udot(f) -0.000000  0.020278 
   u(g)  1.000000 
udot(g) -0.000000  0.006703 
   u(h)  1.000000 
udot(h)  0.000000  0.003149 
   u(i)  1.000000 
udot(i) -0.000000  0.001726 
   u(j)  1.000000 
udot(j) -0.000000  0.001039 
   u(k)  1.000000 
udot(k)  0.000000  0.000667 
Atom type  2
   u(s)  1.000000 
udot(s)  0.000000  0.023146 
   u(p)  1.000000 
udot(p)  0.000000  0.036192 
   u(d)  1.000000 
udot(d)  0.000000  0.003612 
   u(f)  1.000000 
udot(f)  0.000000  0.001183 
   u(g)  1.000000 
udot(g) -0.000000  0.000520 
   u(h)  1.000000 
udot(h) -0.000000  0.000271 
   u(i)  1.000000 
udot(i)  0.000000  0.000157 


### subroutine: mixedbasis ( Mode: vv ) ###

Mixed basis
  Plane-wave basis:
    Number of unique G vectors:   344
    Maximal number of G vectors:  233

  MT basis read in from spex.mb (mode: vv).
    Total number of product-basis functions:  264



##### Job index:  1 #####


### subroutine: correlation ###

< GW self-energy >
Calculate periodic function...done   ( Timing:    0.08 )

=========

K point (   1 ):   0.00000   0.00000   0.00000

Coulomb matrix read from spex.cor
Inverse dielectric matrices read from spex.cor 
Invert dielectric tensor... done   ( Timing:    0.02 )
Hermiticity of transformed Coulomb matrix: 6.8E-11

Add contribution to self-energy... done
                               Timings
  MT wave-func. products:      0.33733
  PW wave-func. products:      0.72863
  Matrix-vector products:      1.04139
  Transformations:             0.25315
  Exchange self-energy:        0.10842
  Frequency integration:       0.05380
  Tetrahedron weights:         0.00000
  Gamma-point correction:      1.36331
  MPI idle time:               0.00006      0.00006
  Other:                       0.13763
  ------------------------------------
  Total:                       4.02369

=========

K point (   2 ):   0.00000   0.00000   0.25000

Coulomb matrix read from spex.cor
Inverse dielectric matrices read from spex.cor 
Hermiticity of transformed Coulomb matrix: 8.7E-10

Add contribution to self-energy... done
                               Timings
  MT wave-func. products:      0.33777
  PW wave-func. products:      0.71085
  Matrix-vector products:      0.95144
  Transformations:             0.24289
  Exchange self-energy:        0.09308
  Frequency integration:       0.05295
  Tetrahedron weights:         0.00000
  MPI idle time:               0.00003      0.00003
  Other:                       0.13116
  ------------------------------------
  Total:                       2.52016

=========

K point (   3 ):   0.00000   0.00000   0.50000

Coulomb matrix read from spex.cor
Inverse dielectric matrices read from spex.cor 
Hermiticity of transformed Coulomb matrix: 2.4E-10

Add contribution to self-energy... done
                               Timings
  MT wave-func. products:      0.33919
  PW wave-func. products:      0.70499
  Matrix-vector products:      1.60427
  Transformations:             0.23092
  Exchange self-energy:        0.08804
  Frequency integration:       0.05430
  Tetrahedron weights:         0.00000
  MPI idle time:               0.00003      0.00003
  Other:                       0.13490
  ------------------------------------
  Total:                       3.15663

=========

K point (   4 ):   0.00000   0.25000   0.00000

Coulomb matrix read from spex.cor
Inverse dielectric matrices read from spex.cor 
Hermiticity of transformed Coulomb matrix: 1.5E-10

Add contribution to self-energy... done
                               Timings
  MT wave-func. products:      1.05746
  PW wave-func. products:      2.36472
  Matrix-vector products:      6.68136
  Transformations:             0.99820
  Exchange self-energy:        0.25381
  Frequency integration:       0.22204
  Tetrahedron weights:         0.00000
  MPI idle time:               0.00004      0.00004
  Other:                       0.53014
  ------------------------------------
  Total:                      12.10778

=========

K point (   5 ):   0.00000   0.25000   0.25000

Coulomb matrix read from spex.cor
Inverse dielectric matrices read from spex.cor 
Hermiticity of transformed Coulomb matrix: 1.5E-10

Add contribution to self-energy... done
                               Timings
  MT wave-func. products:      1.02241
  PW wave-func. products:      2.40238
  Matrix-vector products:      6.77703
  Transformations:             0.99759
  Exchange self-energy:        0.25392
  Frequency integration:       0.21891
  Tetrahedron weights:         0.00000
  MPI idle time:               0.00006      0.00006
  Other:                       0.52617
  ------------------------------------
  Total:                      12.19848

=========

K point (   6 ):   0.00000   0.25000   0.50000

Coulomb matrix read from spex.cor
Inverse dielectric matrices read from spex.cor 
Hermiticity of transformed Coulomb matrix: 1.4E-10

Add contribution to self-energy... done
                               Timings
  MT wave-func. products:      1.04116
  PW wave-func. products:      2.46082
  Matrix-vector products:      6.84247
  Transformations:             1.03383
  Exchange self-energy:        0.25808
  Frequency integration:       0.22013
  Tetrahedron weights:         0.00000
  MPI idle time:               0.00004      0.00004
  Other:                       0.52638
  ------------------------------------
  Total:                      12.38290

=========

K point (   7 ):   0.00000   0.50000   0.00000

Coulomb matrix read from spex.cor
Inverse dielectric matrices read from spex.cor 
Hermiticity of transformed Coulomb matrix: 1.3E-10

Add contribution to self-energy... done
                               Timings
  MT wave-func. products:      0.57407
  PW wave-func. products:      1.32491
  Matrix-vector products:      2.05330
  Transformations:             0.50525
  Exchange self-energy:        0.15226
  Frequency integration:       0.10878
  Tetrahedron weights:         0.00000
  MPI idle time:               0.00011      0.00011
  Other:                       0.26214
  ------------------------------------
  Total:                       4.98081

=========

K point (   8 ):   0.00000   0.50000   0.25000

Coulomb matrix read from spex.cor
Inverse dielectric matrices read from spex.cor 
Hermiticity of transformed Coulomb matrix: 7.9E-11

Add contribution to self-energy... done
                               Timings
  MT wave-func. products:      0.56937
  PW wave-func. products:      1.26300
  Matrix-vector products:      1.98585
  Transformations:             0.50500
  Exchange self-energy:        0.14416
  Frequency integration:       0.10822
  Tetrahedron weights:         0.00000
  MPI idle time:               0.00004      0.00004
  Other:                       0.26058
  ------------------------------------
  Total:                       4.83621

=========

K point (   9 ):   0.00000   0.50000   0.50000

Coulomb matrix read from spex.cor
Inverse dielectric matrices read from spex.cor 
Hermiticity of transformed Coulomb matrix: 5.5E-11

Add contribution to self-energy... done
                               Timings
  MT wave-func. products:      0.57530
  PW wave-func. products:      1.21598
  Matrix-vector products:      3.22497
  Transformations:             0.48085
  Exchange self-energy:        0.13643
  Frequency integration:       0.10844
  Tetrahedron weights:         0.00000
  MPI idle time:               0.00002      0.00002
  Other:                       0.26327
  ------------------------------------
  Total:                       6.00526

=========

K point (  10 ):   0.25000   0.25000   0.00000

Coulomb matrix read from spex.cor
Inverse dielectric matrices read from spex.cor 
Hermiticity of transformed Coulomb matrix: 5.5E-11

Add contribution to self-energy... done
                               Timings
  MT wave-func. products:      0.81223
  PW wave-func. products:      1.74488
  Matrix-vector products:      4.49569
  Transformations:             0.74714
  Exchange self-energy:        0.18760
  Frequency integration:       0.16292
  Tetrahedron weights:         0.00000
  MPI idle time:               0.00004      0.00004
  Other:                       0.38843
  ------------------------------------
  Total:                       8.53892

=========

K point (  11 ):   0.25000   0.25000   0.25000

Coulomb matrix read from spex.cor
Inverse dielectric matrices read from spex.cor 
Hermiticity of transformed Coulomb matrix: 8.0E-11

Add contribution to self-energy... done
                               Timings
  MT wave-func. products:      0.79058
  PW wave-func. products:      1.80799
  Matrix-vector products:      4.77091
  Transformations:             0.74876
  Exchange self-energy:        0.19422
  Frequency integration:       0.16463
  Tetrahedron weights:         0.00000
  MPI idle time:               0.00004      0.00004
  Other:                       0.38986
  ------------------------------------
  Total:                       8.86700

=========

K point (  12 ):   0.25000   0.25000   0.50000

Coulomb matrix read from spex.cor
Inverse dielectric matrices read from spex.cor 
Hermiticity of transformed Coulomb matrix: 9.9E-11

Add contribution to self-energy... done
                               Timings
  MT wave-func. products:      0.79154
  PW wave-func. products:      1.80665
  Matrix-vector products:      8.87891
  Transformations:             0.76670
  Exchange self-energy:        0.19489
  Frequency integration:       0.16991
  Tetrahedron weights:         0.00000
  MPI idle time:               0.00005      0.00005
  Other:                       0.40343
  ------------------------------------
  Total:                      13.01208


### subroutine: exchange_core ###

        k point       band      exchange (core contribution)
  (0.000,0.577,0.000)   1     -6.8306537
  (0.000,0.577,0.000)   2     -9.4075069
  (0.000,0.577,0.000)   3    -17.7902559
  (0.000,0.577,0.000)   4    -17.9533405
  (0.000,0.577,0.000)   5    -18.1457465
  (0.000,0.577,0.000)   6    -18.1912570
  (0.000,0.577,0.000)   7    -18.3967418
  (0.000,0.577,0.000)   8    -18.4655485
  (0.000,0.577,0.000)   9    -18.6116329
  (0.000,0.577,0.000)  10    -18.7037677
  (0.000,0.577,0.000)  11    -13.0890203
  (0.000,0.577,0.000)  12    -11.0685065
  (0.000,0.577,0.000)  13     -1.8240762
  (0.000,0.577,0.000)  14     -1.8958529
  (0.000,0.577,0.000)  15     -1.5922644
  (0.000,0.577,0.000)  16     -1.3402877
  (0.000,0.577,0.000)  17     -1.7522263
  (0.000,0.577,0.000)  18     -1.8367609
  (0.000,0.577,0.000)  19     -1.9713811
  (0.000,0.577,0.000)  20     -2.1667070
  (0.000,0.577,0.000)  21     -1.5945899
  (0.000,0.577,0.000)  22     -1.7756758
  (0.000,0.577,0.000)  23     -1.6552729
  (0.000,0.577,0.000)  24     -1.9213825
  (0.000,0.577,0.000)  25     -1.1927506
  (0.000,0.577,0.000)  26     -2.2654747
  (0.000,0.577,0.000)  27     -1.8649701
  (0.000,0.577,0.000)  28     -1.6000614
  (0.000,0.577,0.000)  29     -2.0516573
  (0.000,0.577,0.000)  30     -1.7200113
Timing:   0.40




### subroutine: quasiparticle ###

Number of mesh points even: No constraint will be used.

List of k points
    0   0.00000   0.57692   0.00000  (additional) 



#####################
### K POINT:    0 ###
#####################


--- DIAGONAL ELEMENTS [eV] ---

 Bd       vxc    sigmax    sigmac         Z        KS        HF          GW lin/dir 
  1 -25.58504 -36.51679   8.64524   0.72907  -8.10231 -19.03406  -9.73392   0.65083 
                          0.74326  -0.04765                      -9.69531   0.61966 
  2 -29.77558 -41.35927   8.92068   0.72229  -7.89440 -19.47809  -9.80212   0.46325 
                          0.53234  -0.02957                      -9.73370   0.44811 
  3 -42.28569 -55.54524   9.44672   0.73816  -6.36809 -19.62764  -9.18160   0.10564 
                          0.06626  -0.01488                      -9.08082   0.13098 
  4 -42.58063 -55.89617   9.49104   0.73797  -6.34612 -19.66167  -9.16757   0.10170 
                          0.06283  -0.01447                      -9.06590   0.12738 
  5 -42.83832 -56.16984   9.46803   0.74020  -6.25335 -19.58488  -9.11248   0.08482 
                          0.04994  -0.01239                      -9.00817   0.11019 
  6 -42.90701 -56.20618   9.42390   0.74153  -6.20633 -19.50549  -9.07950   0.07153 
                          0.04051  -0.01071                      -8.97371   0.09627 
  7 -43.36407 -56.78961   9.57060   0.73926  -6.17397 -19.59952  -9.02290   0.10032 
                          0.06168  -0.01419                      -8.92061   0.12595 
  8 -43.43942 -56.87352   9.55541   0.74013  -6.16267 -19.59677  -9.03273   0.08768 
                          0.05168  -0.01274                      -8.92841   0.11342 
  9 -43.66057 -57.08054   9.50946   0.74212  -6.09136 -19.51133  -8.99311   0.06362 
                          0.03420  -0.00978                      -8.88534   0.08874 
 10 -43.80648 -57.22339   9.49365   0.74293  -6.04846 -19.46537  -8.96295   0.05383 
                          0.02721  -0.00857                      -8.85357   0.07881 
 11 -35.11706 -46.81604   8.78312   0.72527  -5.24182 -16.94080  -7.33964   0.38364 
                          0.30558  -0.05556                      -7.29394   0.42272 
 12 -32.61546 -43.59123   8.44318   0.73263  -4.29380 -15.26956  -6.12725   0.41964 
                          0.36373  -0.06048                      -6.10786   0.42359 
 13 -15.87596 -21.28000   4.17467   0.73829   0.75831  -4.64573  -0.14804   0.07153 
                          0.06301  -0.02034                      -0.13656   0.07482 
 14 -16.64657 -21.70079   3.87812   0.74704   1.96970  -3.08451   1.09147   0.03667 
                          0.03003  -0.01210                       1.10174   0.03913 
 15 -16.12439 -21.00158   3.67179   0.75246   2.69637  -2.18081   1.78950   0.02200 
                          0.01679  -0.00777                       1.80061   0.02395 
 16 -16.89898 -21.34907   3.38220   0.76321   4.39031  -0.05978   3.57529   0.00510 
                          0.00325  -0.00246                       3.58332   0.00596 
 17 -17.54806 -21.57409   3.05777   0.77079   5.13742   1.11139   4.39110   0.00183 
                          0.00089  -0.00118                       4.39743   0.00240 
 18 -18.94716 -22.90488   3.11843   0.77152   6.09884   2.14113   5.45132   0.00093 
                          0.00056  -0.00059                       5.45563   0.00115 
 19 -13.61664  -8.66771  -4.23316   0.81557  12.11456  17.06349  12.69833  -0.00104 
                          0.00065  -0.00218                      12.69532  -0.00179 
 20 -15.43825  -9.99380  -4.39936   0.80207  12.63897  18.08342  13.47720  -0.00539 
                         -0.00113  -0.00429                      13.47117  -0.00749 
 21 -14.07029  -9.04205  -4.24985   0.80219  13.26779  18.29603  13.89219  -0.00650 
                         -0.00350  -0.00474                      13.88874  -0.00751 
 22 -17.00371 -10.18780  -5.27458   0.76609  15.62248  22.43839  16.80292  -0.04092 
                         -0.02695  -0.01316                      16.78784  -0.04666 
 23 -15.68197  -9.04017  -5.45090   0.76826  17.44488  24.08667  18.35878  -0.06348 
                         -0.05305  -0.01908                      18.34946  -0.06678 
 24 -13.64801  -7.76442  -4.96862   0.80428  17.52426  23.40785  18.25956  -0.04509 
                         -0.03903  -0.01497                      18.25457  -0.04667 
 25 -13.31800  -6.93758  -5.53204   0.77880  19.29364  25.67407  19.95216  -0.08948 
                         -0.08738  -0.02525                      19.94737  -0.09077 
 26 -14.88553  -7.77768  -6.01147   0.76797  20.36832  27.47617  21.20473  -0.15576 
                         -0.14951  -0.03734                      21.19595  -0.15832 
 27 -15.75111  -8.02598  -6.51114   0.74347  20.97858  28.70371  21.87237  -0.20160 
                         -0.19918  -0.04408                      21.86090  -0.20438 
 28 -12.75025  -5.85285  -6.14402   0.77609  23.74055  30.63795  24.30865  -0.27392 
                         -0.29914  -0.05543                      24.30405  -0.27346 
 29 -14.15827  -6.93634  -6.41701   0.76986  24.82424  32.04617  25.41482  -0.37908 
                         -0.41997  -0.06927                      25.40921  -0.37780 
 30 -13.80064  -6.59113  -6.38646   0.76736  25.62654  32.83605  26.23270  -0.35418 
                         -0.39206  -0.06480                      26.22686  -0.35294 

Timing (quasiparticle equation):   0.31862

Timing:        95
