########################
######### SPEX #########
########################
Version 05.00  (Sep  5, 2019)
Execution time: Jan 16, 2020  16:46:05
Hostname: login18-1.hpc.itc.rwth-aachen.de
MPI: 1,1


### subroutine: getinput ###

Basic parameters:
  Number of spins            =  1
            centers          =  4
            types            =  2
            equivalent atoms =  2  2
  Lattice parameter =      1.00000
  Lattice vectors   =      3.01411  -5.22060   0.00000
                           3.01411   5.22060   0.00000
                           0.00000   0.00000   9.80579
  Unit-cell volume  =    308.59778
  Reciprocal cutoff =      4.60000

Unit-cell geometry:
  # Ty  El              Coord.
  1  1  Ga   0.33333  -0.33333   0.00000
  2  1  Ga  -0.33333   0.33333   0.50000
  3  2  N    0.33333  -0.33333  -0.37700
  4  2  N   -0.33333   0.33333   0.12300

Symmetry information:
  Number of symmetry operations = 24
   #  Det           Axis           Angle   Syp  Inv
   1    1     --     --     --      --     Yes   1
   2   -1    1.00  -0.58   0.00   180.00   No    2
   3   -1    1.00   0.58   0.00   180.00   No    3
   4    1    0.00   0.00   1.00   120.00   Yes   9
   5    1    0.00   0.00   1.00   180.00   No    5
   6   -1    0.58   1.00   0.00   180.00   Yes   6
   7   -1    1.00   0.00   0.00   180.00   Yes   7
   8    1    0.00   0.00   1.00    60.00   No   11
   9    1    0.00   0.00  -1.00   120.00   Yes   4
  10   -1    0.00   1.00   0.00   180.00   No   10
  11    1    0.00   0.00  -1.00    60.00   No    8
  12   -1   -0.58   1.00   0.00   180.00   Yes  12
  13 - 24  Time reversal symmetries

##################
### Input file ###
##################
BZ       4 4 4
JOB      GW +:(1-10)
NBAND    200
RESTART  
KPT      +=(0,.34615,0)
 

Info: Simpson and Lagrange integration is used.

Radial mesh and basis functions:
  Number of radial grid points:       759  429
  Number of radial basis functions:    19   18
  Angular momentum quantum number:      8    6
  Maximal index:                        3

Core states:
  Atom type  1  (Ga)
  nl      Energy
  1s  -375.34991
  2s   -45.88297
  3s    -4.96076
  2p   -39.88207
  3p    -3.15226
  Atom type  2  (N )
  nl      Energy
  1s   -13.54409
  Number of valence electrons:   36

Average Coulomb potential: -0.35487  ( -9.65657 eV )

Read wavefunctions from harddisc... done   ( Timing:    0.23 )

Maximal energy difference in deg. subspaces: 1.6E-13
Minimal energy difference between subspaces: 9.9E-06

Wave functions:
  Number of bands:             198 -  200  (  200 )
            k points (IBZ):     64  (  12 /  30 )
            G vectors:         733
  k points of IBZ:
    1  (0.00000,0.00000,0.00000)  [ 0.00000, 0.00000, 0.00000 ]
    2  (0.00000,0.00000,0.25000)  [ 0.00000, 0.00000, 0.02550 ]
    3  (0.00000,0.00000,0.50000)  [ 0.00000, 0.00000, 0.05099 ]
    4  (0.00000,0.25000,0.00000)  [ 0.04147, 0.02394, 0.00000 ]
    5  (0.00000,0.25000,0.25000)  [ 0.04147, 0.02394, 0.02550 ]
    6  (0.00000,0.25000,0.50000)  [ 0.04147, 0.02394, 0.05099 ]
    7  (0.00000,0.50000,0.00000)  [ 0.08294, 0.04789, 0.00000 ]
    8  (0.00000,0.50000,0.25000)  [ 0.08294, 0.04789, 0.02550 ]
    9  (0.00000,0.50000,0.50000)  [ 0.08294, 0.04789, 0.05099 ]
   10  (0.25000,0.25000,0.00000)  [ 0.08294, 0.00000, 0.00000 ]
   11  (0.25000,0.25000,0.25000)  [ 0.08294, 0.00000, 0.02550 ]
   12  (0.25000,0.25000,0.50000)  [ 0.08294, 0.00000, 0.05099 ]
  k points of EIBZ (shifted set):
   65  (0.00000,0.34615,0.00000)  [ 0.05742, 0.03315, 0.00000 ]
   66  (0.00000,0.34615,0.25000)  [ 0.05742, 0.03315, 0.02550 ]
   67  (0.00000,0.34615,0.50000)  [ 0.05742, 0.03315, 0.05099 ]
   68  (0.00000,0.59615,0.00000)  [ 0.09889, 0.05710, 0.00000 ]
   69  (0.00000,0.59615,0.25000)  [ 0.09889, 0.05710, 0.02550 ]
   70  (0.00000,0.59615,0.50000)  [ 0.09889, 0.05710, 0.05099 ]
   71  (0.00000,0.84615,0.00000)  [ 0.14036, 0.08104, 0.00000 ]
   72  (0.00000,0.84615,0.25000)  [ 0.14036, 0.08104, 0.02550 ]
   73  (0.00000,0.84615,0.50000)  [ 0.14036, 0.08104, 0.05099 ]
   74  (0.00000,0.09615,0.00000)  [ 0.01595, 0.00921, 0.00000 ]
   75  (0.00000,0.09615,0.25000)  [ 0.01595, 0.00921, 0.02550 ]
   76  (0.00000,0.09615,0.50000)  [ 0.01595, 0.00921, 0.05099 ]
   77  (0.25000,0.34615,0.00000)  [ 0.09889, 0.00921, 0.00000 ]
   78  (0.25000,0.34615,0.25000)  [ 0.09889, 0.00921, 0.02550 ]
   79  (0.25000,0.34615,0.50000)  [ 0.09889, 0.00921, 0.05099 ]
   80  (0.25000,0.59615,0.00000)  [ 0.14036, 0.03315, 0.00000 ]
   81  (0.25000,0.59615,0.25000)  [ 0.14036, 0.03315, 0.02550 ]
   82  (0.25000,0.59615,0.50000)  [ 0.14036, 0.03315, 0.05099 ]
   83  (0.25000,0.84615,0.00000)  [ 0.18184, 0.05710, 0.00000 ]
   84  (0.25000,0.84615,0.25000)  [ 0.18184, 0.05710, 0.02550 ]
   85  (0.25000,0.84615,0.50000)  [ 0.18184, 0.05710, 0.05099 ]
   86  (0.25000,0.09615,0.00000)  [ 0.05742,-0.01473, 0.00000 ]
   87  (0.25000,0.09615,0.25000)  [ 0.05742,-0.01473, 0.02550 ]
   88  (0.25000,0.09615,0.50000)  [ 0.05742,-0.01473, 0.05099 ]
   89  (0.50000,0.34615,0.00000)  [ 0.14036,-0.01473, 0.00000 ]
   90  (0.50000,0.34615,0.25000)  [ 0.14036,-0.01473, 0.02550 ]
   91  (0.50000,0.34615,0.50000)  [ 0.14036,-0.01473, 0.05099 ]
   92  (0.50000,0.59615,0.00000)  [ 0.18184, 0.00921, 0.00000 ]
   93  (0.50000,0.59615,0.25000)  [ 0.18184, 0.00921, 0.02550 ]
   94  (0.50000,0.59615,0.50000)  [ 0.18184, 0.00921, 0.05099 ]

Generate wavefunctions at equivalent k points... done   ( Timing:   0.33 )

Size of array cpw:   209.8 MB
Size of array cmt:   260.9 MB

The system is not a metal.
The Fermi energy is placed in the center of the band gap.
KS energy gap:    0.07059528 Ha   (  1.92099521 eV )
Fermi energy:     0.29316457 Ha   (  7.97741378 eV )
Maximal energy:   5.57740095 Ha
Electron count error of the shifted k-point set:  0.0000000000000000

Wave-function checksum:  1.502355891085E-03


### subroutine: checkinput ###

Overlap <core|core>
Atom type  1
1s  1.000000 
2s -0.000000  1.000000 
3s  0.000000 -0.000001  0.999961 
2p  0.999418 
3p -0.000329  0.999458 
Atom type  2
1s  0.999983 

Overlap <core|basis>
Atom type  1
         u(s)    udot(s)
1s  0.000000  0.000000 
2s  0.000001  0.000000 
3s  0.004767 -0.007551 
         u(p)    udot(p)
2p -0.000106 -0.000031 
3p  0.017150 -0.021254 
Atom type  2
         u(s)    udot(s)
1s  0.003209 -0.002046 

Average overlap <core|val>
Atom type  1
1s  0.000000
2s  0.000000
3s  0.000679
2p  0.000010  0.000010  0.000010
3p  0.002209  0.002206  0.002209
Atom type  2
1s  0.000234

Maximum overlap <core|val> at (band/kpoint)
Atom type  1
1s  0.000000 (022/ 009)
2s  0.000001 (022/ 009)
3s  0.003767 (156/ 003)
2p  0.000060 (025/ 003)  0.000064 (024/ 001)  0.000067 (026/ 003)
3p  0.012494 (122/ 003)  0.014817 (111/ 001)  0.013262 (124/ 003)
Atom type  2
1s  0.001621 (002/ 085)

Overlap <basis|basis>
Atom type  1
   u(s)  1.000000 
udot(s)  0.000000  0.129862 
   u(p)  1.000000 
udot(p) -0.000000  0.075237 
   u(d)  1.000000 
udot(d) -0.000000  0.733838 
 ulo(d)  0.410292 -0.767526  1.000000 
   u(f)  1.000000 
udot(f) -0.000000  0.020278 
   u(g)  1.000000 
udot(g) -0.000000  0.006703 
   u(h)  1.000000 
udot(h)  0.000000  0.003149 
   u(i)  1.000000 
udot(i) -0.000000  0.001726 
   u(j)  1.000000 
udot(j)  0.000000  0.001039 
   u(k)  1.000000 
udot(k) -0.000000  0.000667 
Atom type  2
   u(s)  1.000000 
udot(s)  0.000000  0.023146 
   u(p)  1.000000 
udot(p)  0.000000  0.036192 
   u(d)  1.000000 
udot(d)  0.000000  0.003612 
   u(f)  1.000000 
udot(f)  0.000000  0.001183 
   u(g)  1.000000 
udot(g)  0.000000  0.000520 
   u(h)  1.000000 
udot(h) -0.000000  0.000271 
   u(i)  1.000000 
udot(i)  0.000000  0.000157 


### subroutine: mixedbasis ( Mode: vv ) ###

Mixed basis
  Plane-wave basis:
    Number of unique G vectors:   346
    Maximal number of G vectors:  233

  MT basis read in from spex.mb (mode: vv).
    Total number of product-basis functions:  264



##### Job index:  1 #####


### subroutine: correlation ###

< GW self-energy >
Calculate periodic function...done   ( Timing:    0.09 )

=========

K point (   1 ):   0.00000   0.00000   0.00000

Coulomb matrix read from spex.cor
Inverse dielectric matrices read from spex.cor 
Invert dielectric tensor... done   ( Timing:    0.02 )
Hermiticity of transformed Coulomb matrix: 6.8E-11

Add contribution to self-energy... done
                               Timings
  MT wave-func. products:      0.13022
  PW wave-func. products:      0.27838
  Matrix-vector products:      0.37959
  Transformations:             0.09404
  Exchange self-energy:        0.07257
  Frequency integration:       0.01965
  Tetrahedron weights:         0.00000
  Gamma-point correction:      1.47891
  MPI idle time:               0.00008      0.00008
  Other:                       0.05718
  ------------------------------------
  Total:                       2.51063

=========

K point (   2 ):   0.00000   0.00000   0.25000

Coulomb matrix read from spex.cor
Inverse dielectric matrices read from spex.cor 
Hermiticity of transformed Coulomb matrix: 8.7E-10

Add contribution to self-energy... done
                               Timings
  MT wave-func. products:      0.12687
  PW wave-func. products:      0.26332
  Matrix-vector products:      0.34456
  Transformations:             0.08878
  Exchange self-energy:        0.05585
  Frequency integration:       0.01951
  Tetrahedron weights:         0.00000
  MPI idle time:               0.00003      0.00003
  Other:                       0.05309
  ------------------------------------
  Total:                       0.95200

=========

K point (   3 ):   0.00000   0.00000   0.50000

Coulomb matrix read from spex.cor
Inverse dielectric matrices read from spex.cor 
Hermiticity of transformed Coulomb matrix: 2.4E-10

Add contribution to self-energy... done
                               Timings
  MT wave-func. products:      0.12848
  PW wave-func. products:      0.25594
  Matrix-vector products:      0.55922
  Transformations:             0.08445
  Exchange self-energy:        0.05271
  Frequency integration:       0.01950
  Tetrahedron weights:         0.00000
  MPI idle time:               0.00004      0.00004
  Other:                       0.05424
  ------------------------------------
  Total:                       1.15458

=========

K point (   4 ):   0.00000   0.25000   0.00000

Coulomb matrix read from spex.cor
Inverse dielectric matrices read from spex.cor 
Hermiticity of transformed Coulomb matrix: 1.5E-10

Add contribution to self-energy... done
                               Timings
  MT wave-func. products:      0.38086
  PW wave-func. products:      0.84416
  Matrix-vector products:      2.29183
  Transformations:             0.34629
  Exchange self-energy:        0.10836
  Frequency integration:       0.07734
  Tetrahedron weights:         0.00000
  MPI idle time:               0.00004      0.00004
  Other:                       0.18918
  ------------------------------------
  Total:                       4.23806

=========

K point (   5 ):   0.00000   0.25000   0.25000

Coulomb matrix read from spex.cor
Inverse dielectric matrices read from spex.cor 
Hermiticity of transformed Coulomb matrix: 1.5E-10

Add contribution to self-energy... done
                               Timings
  MT wave-func. products:      0.37238
  PW wave-func. products:      0.85386
  Matrix-vector products:      2.28913
  Transformations:             0.35352
  Exchange self-energy:        0.10972
  Frequency integration:       0.07680
  Tetrahedron weights:         0.00000
  MPI idle time:               0.00004      0.00004
  Other:                       0.19038
  ------------------------------------
  Total:                       4.24582

=========

K point (   6 ):   0.00000   0.25000   0.50000

Coulomb matrix read from spex.cor
Inverse dielectric matrices read from spex.cor 
Hermiticity of transformed Coulomb matrix: 1.4E-10

Add contribution to self-energy... done
                               Timings
  MT wave-func. products:      0.37687
  PW wave-func. products:      0.86557
  Matrix-vector products:      2.38056
  Transformations:             0.35179
  Exchange self-energy:        0.10880
  Frequency integration:       0.07618
  Tetrahedron weights:         0.00000
  MPI idle time:               0.00002      0.00002
  Other:                       0.18701
  ------------------------------------
  Total:                       4.34678

=========

K point (   7 ):   0.00000   0.50000   0.00000

Coulomb matrix read from spex.cor
Inverse dielectric matrices read from spex.cor 
Hermiticity of transformed Coulomb matrix: 1.3E-10

Add contribution to self-energy... done
                               Timings
  MT wave-func. products:      0.20866
  PW wave-func. products:      0.48189
  Matrix-vector products:      0.69984
  Transformations:             0.18211
  Exchange self-energy:        0.07697
  Frequency integration:       0.03864
  Tetrahedron weights:         0.00000
  MPI idle time:               0.00004      0.00004
  Other:                       0.09846
  ------------------------------------
  Total:                       1.78662

=========

K point (   8 ):   0.00000   0.50000   0.25000

Coulomb matrix read from spex.cor
Inverse dielectric matrices read from spex.cor 
Hermiticity of transformed Coulomb matrix: 7.9E-11

Add contribution to self-energy... done
                               Timings
  MT wave-func. products:      0.21021
  PW wave-func. products:      0.47494
  Matrix-vector products:      0.73079
  Transformations:             0.18146
  Exchange self-energy:        0.07611
  Frequency integration:       0.03928
  Tetrahedron weights:         0.00000
  MPI idle time:               0.00002      0.00002
  Other:                       0.09859
  ------------------------------------
  Total:                       1.81139

=========

K point (   9 ):   0.00000   0.50000   0.50000

Coulomb matrix read from spex.cor
Inverse dielectric matrices read from spex.cor 
Hermiticity of transformed Coulomb matrix: 5.5E-11

Add contribution to self-energy... done
                               Timings
  MT wave-func. products:      0.21232
  PW wave-func. products:      0.45344
  Matrix-vector products:      1.14888
  Transformations:             0.17767
  Exchange self-energy:        0.07135
  Frequency integration:       0.03893
  Tetrahedron weights:         0.00000
  MPI idle time:               0.00002      0.00002
  Other:                       0.09903
  ------------------------------------
  Total:                       2.20163

=========

K point (  10 ):   0.25000   0.25000   0.00000

Coulomb matrix read from spex.cor
Inverse dielectric matrices read from spex.cor 
Hermiticity of transformed Coulomb matrix: 5.5E-11

Add contribution to self-energy... done
                               Timings
  MT wave-func. products:      0.28930
  PW wave-func. products:      0.62865
  Matrix-vector products:      1.56984
  Transformations:             0.26791
  Exchange self-energy:        0.08710
  Frequency integration:       0.05810
  Tetrahedron weights:         0.00000
  MPI idle time:               0.00002      0.00002
  Other:                       0.14423
  ------------------------------------
  Total:                       3.04515

=========

K point (  11 ):   0.25000   0.25000   0.25000

Coulomb matrix read from spex.cor
Inverse dielectric matrices read from spex.cor 
Hermiticity of transformed Coulomb matrix: 8.0E-11

Add contribution to self-energy... done
                               Timings
  MT wave-func. products:      0.29994
  PW wave-func. products:      0.65504
  Matrix-vector products:      1.67659
  Transformations:             0.27750
  Exchange self-energy:        0.09292
  Frequency integration:       0.05908
  Tetrahedron weights:         0.00000
  MPI idle time:               0.00004      0.00004
  Other:                       0.14755
  ------------------------------------
  Total:                       3.20868

=========

K point (  12 ):   0.25000   0.25000   0.50000

Coulomb matrix read from spex.cor
Inverse dielectric matrices read from spex.cor 
Hermiticity of transformed Coulomb matrix: 9.9E-11

Add contribution to self-energy... done
                               Timings
  MT wave-func. products:      0.29879
  PW wave-func. products:      0.66124
  Matrix-vector products:      3.09508
  Transformations:             0.28166
  Exchange self-energy:        0.09321
  Frequency integration:       0.05928
  Tetrahedron weights:         0.00000
  MPI idle time:               0.00002      0.00002
  Other:                       0.14032
  ------------------------------------
  Total:                       4.62960


### subroutine: exchange_core ###

        k point       band      exchange (core contribution)
  (0.000,0.346,0.000)   1     -5.3900558
  (0.000,0.346,0.000)   2     -9.2418072
  (0.000,0.346,0.000)   3    -17.8219579
  (0.000,0.346,0.000)   4    -17.9434944
  (0.000,0.346,0.000)   5    -18.0458725
  (0.000,0.346,0.000)   6    -18.2620308
  (0.000,0.346,0.000)   7    -18.3186253
  (0.000,0.346,0.000)   8    -18.3609010
  (0.000,0.346,0.000)   9    -18.5492033
  (0.000,0.346,0.000)  10    -18.6931296
Timing:   0.15




### subroutine: quasiparticle ###

Number of mesh points even: No constraint will be used.

List of k points
    0   0.00000   0.34615   0.00000  (additional) 



#####################
### K POINT:    0 ###
#####################


--- DIAGONAL ELEMENTS [eV] ---

 Bd       vxc    sigmax    sigmac         Z        KS        HF          GW lin/dir 
  1 -23.22163 -33.78422   8.49388   0.73168  -8.21789 -18.78048  -9.67983   0.75709 
                          0.86602  -0.05967                      -9.65824   0.72500 
  2 -29.50681 -41.04836   8.90963   0.72270  -7.90875 -19.45030  -9.79316   0.48097 
                          0.54811  -0.03224                      -9.72849   0.46439 
  3 -42.36061 -55.64297   9.47233   0.73772  -6.36662 -19.64898  -9.17631   0.10893 
                          0.06869  -0.01529                      -9.07584   0.13443 
  4 -42.57611 -55.89615   9.50057   0.73763  -6.34791 -19.66795  -9.16431   0.10476 
                          0.06514  -0.01485                      -9.06305   0.13051 
  5 -42.68482 -55.99004   9.45908   0.73962  -6.26399 -19.56921  -9.10793   0.09164 
                          0.05514  -0.01322                      -9.00490   0.11710 
  6 -43.04088 -56.37591   9.45573   0.74125  -6.20574 -19.54077  -9.08080   0.07361 
                          0.04183  -0.01098                      -8.97505   0.09854 
  7 -43.23051 -56.63934   9.56040   0.73895  -6.20238 -19.61120  -9.04527   0.10181 
                          0.06282  -0.01439                      -8.94325   0.12748 
  8 -43.22339 -56.60179   9.49768   0.74093  -6.17466 -19.55306  -9.04945   0.07943 
                          0.04594  -0.01170                      -8.94428   0.10466 
  9 -43.54057 -56.94174   9.49019   0.74222  -6.11873 -19.51990  -9.02124   0.06129 
                          0.03262  -0.00948                      -8.91308   0.08625 
 10 -43.78833 -57.20415   9.49332   0.74291  -6.05419 -19.47001  -8.96803   0.05474 
                          0.02791  -0.00867                      -8.85880   0.07967 

Timing (quasiparticle equation):   0.12351

Timing:        36
