########################
######### SPEX #########
########################
Version 05.00  (Sep  5, 2019)
Execution time: Jan 18, 2020  15:51:50
Hostname: Ontology
MPI: 3,1


### subroutine: getinput ###

Basic parameters:
  Number of spins            =  1
            centers          =  4
            types            =  2
            equivalent atoms =  2  2
  Lattice parameter =      1.00000
  Lattice vectors   =      3.01411  -5.22060   0.00000
                           3.01411   5.22060   0.00000
                           0.00000   0.00000   9.80579
  Unit-cell volume  =    308.59778
  Reciprocal cutoff =      4.60000

Unit-cell geometry:
  # Ty  El              Coord.
  1  1  Ga   0.33333  -0.33333   0.00000
  2  1  Ga  -0.33333   0.33333   0.50000
  3  2  N    0.33333  -0.33333  -0.37700
  4  2  N   -0.33333   0.33333   0.12300

Symmetry information:
  Number of symmetry operations = 24
   #  Det           Axis           Angle   Syp  Inv
   1    1     --     --     --      --     Yes   1
   2   -1    1.00  -0.58  -0.00   180.00   No    2
   3   -1    1.00   0.58  -0.00   180.00   No    3
   4    1    0.00   0.00   1.00   120.00   Yes   9
   5    1    0.00   0.00   1.00   180.00   No    5
   6   -1    0.58   1.00  -0.00   180.00   Yes   6
   7   -1    1.00  -0.00  -0.00   180.00   Yes   7
   8    1    0.00   0.00   1.00    60.00   No   11
   9    1   -0.00  -0.00  -1.00   120.00   Yes   4
  10   -1   -0.00   1.00  -0.00   180.00   No   10
  11    1   -0.00  -0.00  -1.00    60.00   No    8
  12   -1   -0.58   1.00  -0.00   180.00   Yes  12
  13 - 24  Time reversal symmetries

##################
### Input file ###
##################
BZ       4 4 4
JOB      GW +:(1-30)
NBAND    200
RESTART  
KPT      +=(0,.94230,0)


Info: Simpson and Lagrange integration is used.

Radial mesh and basis functions:
  Number of radial grid points:       759  429
  Number of radial basis functions:    19   18
  Angular momentum quantum number:      8    6
  Maximal index:                        3

Core states:
  Atom type  1  (Ga)
  nl      Energy
  1s  -375.34991
  2s   -45.88297
  3s    -4.96076
  2p   -39.88207
  3p    -3.15226
  Atom type  2  (N )
  nl      Energy
  1s   -13.54409
  Number of valence electrons:   36

Average Coulomb potential: -0.35487  ( -9.65657 eV )

Read wavefunctions from harddisc... done   ( Timing:    0.27 )

Maximal energy difference in deg. subspaces: 1.3E-12
Minimal energy difference between subspaces: 5.7E-07

Wave functions:
  Number of bands:             198 -  200  (  200 )
            k points (IBZ):     64  (  12 /  30 )
            G vectors:         743
  k points of IBZ:
    1  (0.00000,0.00000,0.00000)  [ 0.00000, 0.00000, 0.00000 ]
    2  (0.00000,0.00000,0.25000)  [ 0.00000, 0.00000, 0.02550 ]
    3  (0.00000,0.00000,0.50000)  [ 0.00000, 0.00000, 0.05099 ]
    4  (0.00000,0.25000,0.00000)  [ 0.04147, 0.02394, 0.00000 ]
    5  (0.00000,0.25000,0.25000)  [ 0.04147, 0.02394, 0.02550 ]
    6  (0.00000,0.25000,0.50000)  [ 0.04147, 0.02394, 0.05099 ]
    7  (0.00000,0.50000,0.00000)  [ 0.08294, 0.04789, 0.00000 ]
    8  (0.00000,0.50000,0.25000)  [ 0.08294, 0.04789, 0.02550 ]
    9  (0.00000,0.50000,0.50000)  [ 0.08294, 0.04789, 0.05099 ]
   10  (0.25000,0.25000,0.00000)  [ 0.08294, 0.00000, 0.00000 ]
   11  (0.25000,0.25000,0.25000)  [ 0.08294, 0.00000, 0.02550 ]
   12  (0.25000,0.25000,0.50000)  [ 0.08294, 0.00000, 0.05099 ]
  k points of EIBZ (shifted set):
   65  (0.00000,0.94230,0.00000)  [ 0.15631, 0.09025, 0.00000 ]
   66  (0.00000,0.94230,0.25000)  [ 0.15631, 0.09025, 0.02550 ]
   67  (0.00000,0.94230,0.50000)  [ 0.15631, 0.09025, 0.05099 ]
   68  (0.00000,0.19230,0.00000)  [ 0.03190, 0.01842, 0.00000 ]
   69  (0.00000,0.19230,0.25000)  [ 0.03190, 0.01842, 0.02550 ]
   70  (0.00000,0.19230,0.50000)  [ 0.03190, 0.01842, 0.05099 ]
   71  (0.00000,0.44230,0.00000)  [ 0.07337, 0.04236, 0.00000 ]
   72  (0.00000,0.44230,0.25000)  [ 0.07337, 0.04236, 0.02550 ]
   73  (0.00000,0.44230,0.50000)  [ 0.07337, 0.04236, 0.05099 ]
   74  (0.00000,0.69230,0.00000)  [ 0.11484, 0.06630, 0.00000 ]
   75  (0.00000,0.69230,0.25000)  [ 0.11484, 0.06630, 0.02550 ]
   76  (0.00000,0.69230,0.50000)  [ 0.11484, 0.06630, 0.05099 ]
   77  (0.25000,0.94230,0.00000)  [ 0.19779, 0.06630, 0.00000 ]
   78  (0.25000,0.94230,0.25000)  [ 0.19779, 0.06630, 0.02550 ]
   79  (0.25000,0.94230,0.50000)  [ 0.19779, 0.06630, 0.05099 ]
   80  (0.25000,0.19230,0.00000)  [ 0.07337,-0.00553, 0.00000 ]
   81  (0.25000,0.19230,0.25000)  [ 0.07337,-0.00553, 0.02550 ]
   82  (0.25000,0.19230,0.50000)  [ 0.07337,-0.00553, 0.05099 ]
   83  (0.25000,0.44230,0.00000)  [ 0.11484, 0.01842, 0.00000 ]
   84  (0.25000,0.44230,0.25000)  [ 0.11484, 0.01842, 0.02550 ]
   85  (0.25000,0.44230,0.50000)  [ 0.11484, 0.01842, 0.05099 ]
   86  (0.25000,0.69230,0.00000)  [ 0.15631, 0.04236, 0.00000 ]
   87  (0.25000,0.69230,0.25000)  [ 0.15631, 0.04236, 0.02550 ]
   88  (0.25000,0.69230,0.50000)  [ 0.15631, 0.04236, 0.05099 ]
   89  (0.50000,0.94230,0.00000)  [ 0.23926, 0.04236, 0.00000 ]
   90  (0.50000,0.94230,0.25000)  [ 0.23926, 0.04236, 0.02550 ]
   91  (0.50000,0.94230,0.50000)  [ 0.23926, 0.04236, 0.05099 ]
   92  (0.50000,0.19230,0.00000)  [ 0.11484,-0.02947, 0.00000 ]
   93  (0.50000,0.19230,0.25000)  [ 0.11484,-0.02947, 0.02550 ]
   94  (0.50000,0.19230,0.50000)  [ 0.11484,-0.02947, 0.05099 ]

Generate wavefunctions at equivalent k points... done   ( Timing:   0.28 )

Size of array cpw:   209.8 MB
Size of array cmt:   260.9 MB

The system is not a metal.
The Fermi energy is placed in the center of the band gap.
KS energy gap:    0.07059528 Ha   (  1.92099521 eV )
Fermi energy:     0.29316457 Ha   (  7.97741378 eV )
Maximal energy:   5.57248232 Ha
Electron count error of the shifted k-point set:  0.0000000000000000

Wave-function checksum: -3.436688074954E-02


### subroutine: checkinput ###

Overlap <core|core>
Atom type  1
1s  1.000000
2s -0.000000  1.000000
3s  0.000000 -0.000001  0.999961
2p  0.999418
3p -0.000329  0.999458
Atom type  2
1s  0.999983

Overlap <core|basis>
Atom type  1
         u(s)    udot(s)
1s  0.000000  0.000000
2s  0.000001  0.000000
3s  0.004767 -0.007551
         u(p)    udot(p)
2p -0.000106 -0.000031
3p  0.017150 -0.021254
Atom type  2
         u(s)    udot(s)
1s  0.003209 -0.002046

Average overlap <core|val>
Atom type  1
1s  0.000000
2s  0.000000
3s  0.000679
2p  0.000010  0.000010  0.000010
3p  0.002209  0.002205  0.002209
Atom type  2
1s  0.000234

Maximum overlap <core|val> at (band/kpoint)
Atom type  1
1s  0.000000 (033/ 001)
2s  0.000001 (033/ 001)
3s  0.004286 (156/ 003)
2p  0.000059 (023/ 001)  0.000065 (037/ 003)  0.000059 (022/ 001)
3p  0.011865 (121/ 003)  0.014817 (111/ 001)  0.012017 (121/ 003)
Atom type  2
1s  0.001675 (002/ 067)

Overlap <basis|basis>
Atom type  1
   u(s)  1.000000
udot(s) -0.000000  0.129862
   u(p)  1.000000
udot(p) -0.000000  0.075237
   u(d)  1.000000
udot(d)  0.000000  0.733838
 ulo(d)  0.410292 -0.767526  1.000000
   u(f)  1.000000
udot(f)  0.000000  0.020278
   u(g)  1.000000
udot(g)  0.000000  0.006703
   u(h)  1.000000
udot(h) -0.000000  0.003149
   u(i)  1.000000
udot(i) -0.000000  0.001726
   u(j)  1.000000
udot(j) -0.000000  0.001039
   u(k)  1.000000
udot(k)  0.000000  0.000667
Atom type  2
   u(s)  1.000000
udot(s) -0.000000  0.023146
   u(p)  1.000000
udot(p) -0.000000  0.036192
   u(d)  1.000000
udot(d) -0.000000  0.003612
   u(f)  1.000000
udot(f) -0.000000  0.001183
   u(g)  1.000000
udot(g)  0.000000  0.000520
   u(h)  1.000000
udot(h)  0.000000  0.000271
   u(i)  1.000000
udot(i) -0.000000  0.000157


### subroutine: mixedbasis ( Mode: vv ) ###

Mixed basis
  Plane-wave basis:
    Number of unique G vectors:   353
    Maximal number of G vectors:  233

  MT basis read in from spex.mb (mode: vv).
    Total number of product-basis functions:  264



##### Job index:  1 #####


### subroutine: correlation ###

< GW self-energy >
Calculate periodic function...done   ( Timing:    0.05 )

=========

K point (   1 ):   0.00000   0.00000   0.00000

Coulomb matrix read from spex.cor
Inverse dielectric matrices read from spex.cor
Invert dielectric tensor... done   ( Timing:    0.01 )
Hermiticity of transformed Coulomb matrix: 4.8E-11

Add contribution to self-energy... done
                               Timings
  MT wave-func. products:      0.33755
  PW wave-func. products:      0.35062
  Matrix-vector products:      0.59140
  Transformations:             0.14551
  Exchange self-energy:        0.09606
  Frequency integration:       0.01160
  Tetrahedron weights:         0.00000
  Gamma-point correction:      0.40154
  MPI idle time:               0.00003      0.00259
  Other:                       0.03944
  ------------------------------------
  Total:                       1.97376

=========

K point (   2 ):   0.00000   0.00000   0.25000

Coulomb matrix read from spex.cor
Inverse dielectric matrices read from spex.cor
Hermiticity of transformed Coulomb matrix: 6.1E-10

Add contribution to self-energy... done
                               Timings
  MT wave-func. products:      0.30139
  PW wave-func. products:      0.33029
  Matrix-vector products:      0.54431
  Transformations:             0.12966
  Exchange self-energy:        0.08365
  Frequency integration:       0.01073
  Tetrahedron weights:         0.00000
  MPI idle time:               0.00002      0.00088
  Other:                       0.03712
  ------------------------------------
  Total:                       1.43719

=========

K point (   3 ):   0.00000   0.00000   0.50000

Coulomb matrix read from spex.cor
Inverse dielectric matrices read from spex.cor
Hermiticity of transformed Coulomb matrix: 1.9E-10

Add contribution to self-energy... done
                               Timings
  MT wave-func. products:      0.28246
  PW wave-func. products:      0.29835
  Matrix-vector products:      0.79783
  Transformations:             0.12405
  Exchange self-energy:        0.07547
  Frequency integration:       0.01145
  Tetrahedron weights:         0.00000
  MPI idle time:               0.00003      0.00085
  Other:                       0.03660
  ------------------------------------
  Total:                       1.62625

=========

K point (   4 ):   0.00000   0.25000   0.00000

Coulomb matrix read from spex.cor
Inverse dielectric matrices read from spex.cor
Hermiticity of transformed Coulomb matrix: 8.5E-11

Add contribution to self-energy... done
                               Timings
  MT wave-func. products:      0.53291
  PW wave-func. products:      0.89743
  Matrix-vector products:      3.23586
  Transformations:             0.49201
  Exchange self-energy:        0.14362
  Frequency integration:       0.04225
  Tetrahedron weights:         0.00000
  MPI idle time:               0.00003      0.00799
  Other:                       0.12893
  ------------------------------------
  Total:                       5.47303

=========

K point (   5 ):   0.00000   0.25000   0.25000

Coulomb matrix read from spex.cor
Inverse dielectric matrices read from spex.cor
Hermiticity of transformed Coulomb matrix: 9.2E-11

Add contribution to self-energy... done
                               Timings
  MT wave-func. products:      0.69007
  PW wave-func. products:      0.99675
  Matrix-vector products:      3.47832
  Transformations:             0.52556
  Exchange self-energy:        0.15209
  Frequency integration:       0.04756
  Tetrahedron weights:         0.00000
  MPI idle time:               0.00003      0.01266
  Other:                       0.14130
  ------------------------------------
  Total:                       6.03169

=========

K point (   6 ):   0.00000   0.25000   0.50000

Coulomb matrix read from spex.cor
Inverse dielectric matrices read from spex.cor
Hermiticity of transformed Coulomb matrix: 9.5E-11

Add contribution to self-energy... done
                               Timings
  MT wave-func. products:      0.67439
  PW wave-func. products:      1.01039
  Matrix-vector products:      3.51421
  Transformations:             0.53621
  Exchange self-energy:        0.15584
  Frequency integration:       0.04794
  Tetrahedron weights:         0.00000
  MPI idle time:               0.00248      0.00517
  Other:                       0.13971
  ------------------------------------
  Total:                       6.08117

=========

K point (   7 ):   0.00000   0.50000   0.00000

Coulomb matrix read from spex.cor
Inverse dielectric matrices read from spex.cor
Hermiticity of transformed Coulomb matrix: 1.0E-10

Add contribution to self-energy... done
                               Timings
  MT wave-func. products:      0.33552
  PW wave-func. products:      0.49570
  Matrix-vector products:      1.08572
  Transformations:             0.26031
  Exchange self-energy:        0.10748
  Frequency integration:       0.01932
  Tetrahedron weights:         0.00000
  MPI idle time:               0.00002      0.00201
  Other:                       0.06452
  ------------------------------------
  Total:                       2.36860

=========

K point (   8 ):   0.00000   0.50000   0.25000

Coulomb matrix read from spex.cor
Inverse dielectric matrices read from spex.cor
Hermiticity of transformed Coulomb matrix: 5.6E-11

Add contribution to self-energy... done
                               Timings
  MT wave-func. products:      0.36431
  PW wave-func. products:      0.51924
  Matrix-vector products:      1.05872
  Transformations:             0.25419
  Exchange self-energy:        0.10251
  Frequency integration:       0.01948
  Tetrahedron weights:         0.00000
  MPI idle time:               0.00009      0.00106
  Other:                       0.06408
  ------------------------------------
  Total:                       2.38261

=========

K point (   9 ):   0.00000   0.50000   0.50000

Coulomb matrix read from spex.cor
Inverse dielectric matrices read from spex.cor
Hermiticity of transformed Coulomb matrix: 3.8E-11

Add contribution to self-energy... done
                               Timings
  MT wave-func. products:      0.35889
  PW wave-func. products:      0.48498
  Matrix-vector products:      1.61334
  Transformations:             0.24772
  Exchange self-energy:        0.09746
  Frequency integration:       0.02173
  Tetrahedron weights:         0.00000
  MPI idle time:               0.00685      0.00894
  Other:                       0.06866
  ------------------------------------
  Total:                       2.89964

=========

K point (  10 ):   0.25000   0.25000   0.00000

Coulomb matrix read from spex.cor
Inverse dielectric matrices read from spex.cor
Hermiticity of transformed Coulomb matrix: 3.6E-11

Add contribution to self-energy... done
                               Timings
  MT wave-func. products:      0.52014
  PW wave-func. products:      0.70692
  Matrix-vector products:      2.27145
  Transformations:             0.36713
  Exchange self-energy:        0.11782
  Frequency integration:       0.03210
  Tetrahedron weights:         0.00000
  MPI idle time:               0.00079      0.00343
  Other:                       0.09882
  ------------------------------------
  Total:                       4.11516

=========

K point (  11 ):   0.25000   0.25000   0.25000

Coulomb matrix read from spex.cor
Inverse dielectric matrices read from spex.cor
Hermiticity of transformed Coulomb matrix: 5.3E-11

Add contribution to self-energy... done
                               Timings
  MT wave-func. products:      0.44112
  PW wave-func. products:      0.71184
  Matrix-vector products:      2.38903
  Transformations:             0.38800
  Exchange self-energy:        0.12590
  Frequency integration:       0.03267
  Tetrahedron weights:         0.00000
  MPI idle time:               0.04048      0.04048
  Other:                       0.10073
  ------------------------------------
  Total:                       4.22977

=========

K point (  12 ):   0.25000   0.25000   0.50000

Coulomb matrix read from spex.cor
Inverse dielectric matrices read from spex.cor
Hermiticity of transformed Coulomb matrix: 6.9E-11

Add contribution to self-energy... done
                               Timings
  MT wave-func. products:      0.44007
  PW wave-func. products:      0.74314
  Matrix-vector products:      5.55941
  Transformations:             0.40544
  Exchange self-energy:        0.15586
  Frequency integration:       0.05885
  Tetrahedron weights:         0.00000
  MPI idle time:               0.00003      0.01004
  Other:                       0.13563
  ------------------------------------
  Total:                       7.49843


### subroutine: exchange_core ###

        k point       band      exchange (core contribution)
  (0.000,0.942,0.000)   1     -1.6611659
  (0.000,0.942,0.000)   2     -7.7512069
  (0.000,0.942,0.000)   3    -17.7486708
  (0.000,0.942,0.000)   4    -17.7726320
  (0.000,0.942,0.000)   5    -17.7054842
  (0.000,0.942,0.000)   6    -17.9275428
  (0.000,0.942,0.000)   7    -17.9396352
  (0.000,0.942,0.000)   8    -18.4488343
  (0.000,0.942,0.000)   9    -18.4552331
  (0.000,0.942,0.000)  10    -18.6347333
  (0.000,0.942,0.000)  11    -18.6597818
  (0.000,0.942,0.000)  12    -12.6115082
  (0.000,0.942,0.000)  13     -1.3034087
  (0.000,0.942,0.000)  14     -1.9076979
  (0.000,0.942,0.000)  15     -1.8698600
  (0.000,0.942,0.000)  16     -2.2782890
  (0.000,0.942,0.000)  17     -2.1082090
  (0.000,0.942,0.000)  18     -2.1876196
  (0.000,0.942,0.000)  19     -2.0364155
  (0.000,0.942,0.000)  20     -2.3018677
  (0.000,0.942,0.000)  21     -1.2327875
  (0.000,0.942,0.000)  22     -1.9391479
  (0.000,0.942,0.000)  23     -1.9981564
  (0.000,0.942,0.000)  24     -2.0182399
  (0.000,0.942,0.000)  25     -1.9551473
  (0.000,0.942,0.000)  26     -1.9995948
  (0.000,0.942,0.000)  27     -1.2330739
  (0.000,0.942,0.000)  28     -1.5632200
  (0.000,0.942,0.000)  29     -1.3361851
  (0.000,0.942,0.000)  30     -1.1747831
Timing:   0.09




### subroutine: quasiparticle ###

Number of mesh points even: No constraint will be used.

List of k points
    0   0.00000   0.94230   0.00000  (additional)



#####################
### K POINT:    0 ###
#####################


--- DIAGONAL ELEMENTS [eV] ---

 Bd       vxc    sigmax    sigmac         Z        KS        HF          GW lin/dir
  1 -16.74690 -26.45566   8.14785   0.73618  -8.92316 -18.63192  -9.95174   1.06600
                          1.24233  -0.09701                      -9.95806   1.05293
  2 -27.06899 -38.24091   8.74869   0.72790  -8.04602 -19.21794  -9.78098   0.59411
                          0.67327  -0.04293                      -9.73388   0.56599
  3 -42.26262 -55.56456   9.50524   0.73643  -6.43191 -19.73385  -9.22672   0.11601
                          0.07420  -0.01616                      -9.12693   0.14168
  4 -42.31374 -55.62196   9.51331   0.73612  -6.41468 -19.72290  -9.20700   0.11532
                          0.07336  -0.01616                      -9.10716   0.14125
  5 -42.19664 -55.47978   9.49850   0.73604  -6.40787 -19.69101  -9.19227   0.11845
                          0.07594  -0.01653                      -9.09312   0.14431
  6 -42.55328 -55.87432   9.50284   0.73769  -6.35533 -19.67637  -9.17094   0.10744
                          0.06742  -0.01511                      -9.07004   0.13301
  7 -42.57684 -55.90434   9.50823   0.73769  -6.35228 -19.67978  -9.16867   0.10809
                          0.06796  -0.01517                      -9.06779   0.13364
  8 -43.33875 -56.69470   9.44089   0.74292  -6.17229 -19.52824  -9.08062   0.05293
                          0.02695  -0.00841                      -8.97135   0.07721
  9 -43.35012 -56.70879   9.44240   0.74294  -6.16998 -19.52864  -9.07928   0.05284
                          0.02690  -0.00839                      -8.96993   0.07711
 10 -43.68673 -57.09174   9.48994   0.74279  -6.07783 -19.48284  -8.98560   0.05909
                          0.03119  -0.00918                      -8.87729   0.08383
 11 -43.73229 -57.14453   9.49451   0.74285  -6.07126 -19.48351  -8.98128   0.05847
                          0.03077  -0.00909                      -8.87278   0.08317
 12 -34.71812 -46.22990   8.70759   0.73729  -4.81260 -16.32438  -6.85767   0.43735
                          0.34817  -0.06442                      -6.86962   0.45195
 13 -14.54963 -20.14773   4.32093   0.73000   0.05624  -5.54187  -0.87341   0.10624
                          0.09694  -0.02778                      -0.86050   0.11014
 14 -18.68909 -22.71248   3.14195   0.77083   5.73422   1.71082   5.05477   0.00129
                          0.00069  -0.00086                       5.05968   0.00165
 15 -18.85733 -22.91114   3.18387   0.77035   5.91933   1.86552   5.24917   0.00108
                          0.00059  -0.00072                       5.25394   0.00139
 16 -19.75630 -23.25126   2.79593   0.77535   6.67613   3.18117   6.13414   0.00069
                          0.00044  -0.00050                       6.13685   0.00085
 17 -19.98989 -23.41900   2.78275   0.77514   6.95263   3.52351   6.45160   0.00065
                          0.00053  -0.00038                       6.45379   0.00069
 18 -20.17529 -23.89373   3.01046   0.77346   6.98781   3.26938   6.44022   0.00071
                          0.00049  -0.00047                       6.44301   0.00081
 19 -16.06399 -11.82755  -3.43425   0.79132   9.25427  13.49071   9.88908   0.00773
                          0.01126  -0.00147                       9.88870   0.00356
 20 -15.36255 -10.06691  -4.26056   0.80799  11.51046  16.80610  12.34681   0.00056
                          0.00272  -0.00158                      12.34067  -0.00144
 21 -15.55628  -8.86146  -5.45889   0.75938  16.20225  22.89706  17.14014  -0.05014
                         -0.03894  -0.01664                      17.12988  -0.05397
 22 -13.49574  -7.61404  -4.92424   0.80809  16.67253  22.55422  17.44591  -0.03313
                         -0.02672  -0.01205                      17.44047  -0.03485
 23 -13.63733  -7.69163  -4.95914   0.80768  17.03875  22.98445  17.83521  -0.03580
                         -0.02890  -0.01263                      17.82941  -0.03765
 24 -13.89596  -7.70672  -5.12033   0.80277  17.86919  24.05843  18.72670  -0.04691
                         -0.03806  -0.01530                      18.71971  -0.04932
 25 -14.36377  -7.87637  -5.35106   0.79134  18.57415  25.06155  19.47230  -0.06633
                         -0.05618  -0.01925                      19.46412  -0.06915
 26 -14.51695  -7.96483  -5.39157   0.78978  18.84224  25.39436  19.75763  -0.07031
                         -0.05962  -0.02001                      19.74903  -0.07329
 27 -11.35296  -5.39046  -5.47397   0.79590  21.28508  27.24757  21.66853  -0.13969
                         -0.15414  -0.03482                      21.66683  -0.13956
 28 -12.85141  -6.85682  -5.28664   0.80011  22.45490  28.44949  23.01690  -0.13363
                         -0.13875  -0.03194                      23.01370  -0.13407
 29 -11.67094  -5.49872  -5.63849   0.79228  23.05129  29.22351  23.46464  -0.19609
                         -0.21814  -0.04359                      23.46249  -0.19569
 30 -11.06399  -4.65278  -5.99165   0.78385  24.78845  31.19965  25.09742  -0.28907
                         -0.33721  -0.05900                      25.09586  -0.28781

Timing (quasiparticle equation):   0.44242

Timing:        48
