########################
######### SPEX #########
########################
Version 05.00  (Sep  5, 2019)
Execution time: Jan 17, 2020  23:51:38
Hostname: login18-1.hpc.itc.rwth-aachen.de
MPI: 1,1


### subroutine: getinput ###

Basic parameters:
  Number of spins            =  1
            centers          =  4
            types            =  2
            equivalent atoms =  2  2
  Lattice parameter =      1.00000
  Lattice vectors   =      3.01411  -5.22060   0.00000
                           3.01411   5.22060   0.00000
                           0.00000   0.00000   9.80579
  Unit-cell volume  =    308.59778
  Reciprocal cutoff =      4.60000

Unit-cell geometry:
  # Ty  El              Coord.
  1  1  Ga   0.33333  -0.33333   0.00000
  2  1  Ga  -0.33333   0.33333   0.50000
  3  2  N    0.33333  -0.33333  -0.37700
  4  2  N   -0.33333   0.33333   0.12300

Symmetry information:
  Number of symmetry operations = 24
   #  Det           Axis           Angle   Syp  Inv
   1    1     --     --     --      --     Yes   1
   2   -1    1.00  -0.58   0.00   180.00   No    2
   3   -1    1.00   0.58   0.00   180.00   No    3
   4    1    0.00   0.00   1.00   120.00   Yes   9
   5    1    0.00   0.00   1.00   180.00   No    5
   6   -1    0.58   1.00   0.00   180.00   Yes   6
   7   -1    1.00   0.00   0.00   180.00   Yes   7
   8    1    0.00   0.00   1.00    60.00   No   11
   9    1    0.00   0.00  -1.00   120.00   Yes   4
  10   -1    0.00   1.00   0.00   180.00   No   10
  11    1    0.00   0.00  -1.00    60.00   No    8
  12   -1   -0.58   1.00   0.00   180.00   Yes  12
  13 - 24  Time reversal symmetries

##################
### Input file ###
##################
BZ       4 4 4
JOB      GW +:(1-10)
NBAND    200
RESTART  
KPT      +=(.42222,.42222,0)
 

Info: Simpson and Lagrange integration is used.

Radial mesh and basis functions:
  Number of radial grid points:       759  429
  Number of radial basis functions:    19   18
  Angular momentum quantum number:      8    6
  Maximal index:                        3

Core states:
  Atom type  1  (Ga)
  nl      Energy
  1s  -375.34991
  2s   -45.88297
  3s    -4.96076
  2p   -39.88207
  3p    -3.15226
  Atom type  2  (N )
  nl      Energy
  1s   -13.54409
  Number of valence electrons:   36

Average Coulomb potential: -0.35487  ( -9.65657 eV )

Read wavefunctions from harddisc... done   ( Timing:    0.22 )

Maximal energy difference in deg. subspaces: 7.0E-14
Minimal energy difference between subspaces: 1.5E-05

Wave functions:
  Number of bands:             198 -  200  (  200 )
            k points (IBZ):     64  (  12 /  30 )
            G vectors:         765
  k points of IBZ:
    1  (0.00000,0.00000,0.00000)  [ 0.00000, 0.00000, 0.00000 ]
    2  (0.00000,0.00000,0.25000)  [ 0.00000, 0.00000, 0.02550 ]
    3  (0.00000,0.00000,0.50000)  [ 0.00000, 0.00000, 0.05099 ]
    4  (0.00000,0.25000,0.00000)  [ 0.04147, 0.02394, 0.00000 ]
    5  (0.00000,0.25000,0.25000)  [ 0.04147, 0.02394, 0.02550 ]
    6  (0.00000,0.25000,0.50000)  [ 0.04147, 0.02394, 0.05099 ]
    7  (0.00000,0.50000,0.00000)  [ 0.08294, 0.04789, 0.00000 ]
    8  (0.00000,0.50000,0.25000)  [ 0.08294, 0.04789, 0.02550 ]
    9  (0.00000,0.50000,0.50000)  [ 0.08294, 0.04789, 0.05099 ]
   10  (0.25000,0.25000,0.00000)  [ 0.08294, 0.00000, 0.00000 ]
   11  (0.25000,0.25000,0.25000)  [ 0.08294, 0.00000, 0.02550 ]
   12  (0.25000,0.25000,0.50000)  [ 0.08294, 0.00000, 0.05099 ]
  k points of EIBZ (shifted set):
   65  (0.42222,0.42222,0.00000)  [ 0.14008, 0.00000, 0.00000 ]
   66  (0.42222,0.42222,0.25000)  [ 0.14008, 0.00000, 0.02550 ]
   67  (0.42222,0.42222,0.50000)  [ 0.14008, 0.00000, 0.05099 ]
   68  (0.42222,0.67222,0.00000)  [ 0.18155, 0.02394, 0.00000 ]
   69  (0.42222,0.67222,0.25000)  [ 0.18155, 0.02394, 0.02550 ]
   70  (0.42222,0.67222,0.50000)  [ 0.18155, 0.02394, 0.05099 ]
   71  (0.42222,0.92222,0.00000)  [ 0.22302, 0.04789, 0.00000 ]
   72  (0.42222,0.92222,0.25000)  [ 0.22302, 0.04789, 0.02550 ]
   73  (0.42222,0.92222,0.50000)  [ 0.22302, 0.04789, 0.05099 ]
   74  (0.42222,0.17222,0.00000)  [ 0.09861,-0.02394, 0.00000 ]
   75  (0.42222,0.17222,0.25000)  [ 0.09861,-0.02394, 0.02550 ]
   76  (0.42222,0.17222,0.50000)  [ 0.09861,-0.02394, 0.05099 ]
   77  (0.67222,0.67222,0.00000)  [ 0.22302, 0.00000, 0.00000 ]
   78  (0.67222,0.67222,0.25000)  [ 0.22302, 0.00000, 0.02550 ]
   79  (0.67222,0.67222,0.50000)  [ 0.22302, 0.00000, 0.05099 ]
   80  (0.67222,0.92222,0.00000)  [ 0.26450, 0.02394, 0.00000 ]
   81  (0.67222,0.92222,0.25000)  [ 0.26450, 0.02394, 0.02550 ]
   82  (0.67222,0.92222,0.50000)  [ 0.26450, 0.02394, 0.05099 ]
   83  (0.67222,0.17222,0.00000)  [ 0.14008,-0.04789, 0.00000 ]
   84  (0.67222,0.17222,0.25000)  [ 0.14008,-0.04789, 0.02550 ]
   85  (0.67222,0.17222,0.50000)  [ 0.14008,-0.04789, 0.05099 ]
   86  (0.92222,0.92222,0.00000)  [ 0.30597, 0.00000, 0.00000 ]
   87  (0.92222,0.92222,0.25000)  [ 0.30597, 0.00000, 0.02550 ]
   88  (0.92222,0.92222,0.50000)  [ 0.30597, 0.00000, 0.05099 ]
   89  (0.92222,0.17222,0.00000)  [ 0.18155,-0.07183, 0.00000 ]
   90  (0.92222,0.17222,0.25000)  [ 0.18155,-0.07183, 0.02550 ]
   91  (0.92222,0.17222,0.50000)  [ 0.18155,-0.07183, 0.05099 ]
   92  (0.17222,0.17222,0.00000)  [ 0.05714, 0.00000, 0.00000 ]
   93  (0.17222,0.17222,0.25000)  [ 0.05714, 0.00000, 0.02550 ]
   94  (0.17222,0.17222,0.50000)  [ 0.05714, 0.00000, 0.05099 ]

Generate wavefunctions at equivalent k points... done   ( Timing:   0.42 )

Size of array cpw:   209.8 MB
Size of array cmt:   260.9 MB

The system is not a metal.
The Fermi energy is placed in the center of the band gap.
KS energy gap:    0.07059528 Ha   (  1.92099521 eV )
Fermi energy:     0.29316457 Ha   (  7.97741378 eV )
Maximal energy:   5.58161318 Ha
Electron count error of the shifted k-point set:  0.0000000000000000

Wave-function checksum: -6.080236907668E-02


### subroutine: checkinput ###

Overlap <core|core>
Atom type  1
1s  1.000000 
2s -0.000000  1.000000 
3s  0.000000 -0.000001  0.999961 
2p  0.999418 
3p -0.000329  0.999458 
Atom type  2
1s  0.999983 

Overlap <core|basis>
Atom type  1
         u(s)    udot(s)
1s  0.000000  0.000000 
2s  0.000001  0.000000 
3s  0.004767 -0.007551 
         u(p)    udot(p)
2p -0.000106 -0.000031 
3p  0.017150 -0.021254 
Atom type  2
         u(s)    udot(s)
1s  0.003209 -0.002046 

Average overlap <core|val>
Atom type  1
1s  0.000000
2s  0.000000
3s  0.000679
2p  0.000010  0.000010  0.000010
3p  0.002206  0.002204  0.002208
Atom type  2
1s  0.000234

Maximum overlap <core|val> at (band/kpoint)
Atom type  1
1s  0.000000 (022/ 009)
2s  0.000001 (022/ 009)
3s  0.003767 (156/ 003)
2p  0.000064 (027/ 079)  0.000064 (024/ 001)  0.000067 (026/ 003)
3p  0.012494 (122/ 003)  0.014817 (111/ 001)  0.013262 (124/ 003)
Atom type  2
1s  0.001657 (001/ 088)

Overlap <basis|basis>
Atom type  1
   u(s)  1.000000 
udot(s)  0.000000  0.129862 
   u(p)  1.000000 
udot(p) -0.000000  0.075237 
   u(d)  1.000000 
udot(d) -0.000000  0.733838 
 ulo(d)  0.410292 -0.767526  1.000000 
   u(f)  1.000000 
udot(f) -0.000000  0.020278 
   u(g)  1.000000 
udot(g) -0.000000  0.006703 
   u(h)  1.000000 
udot(h)  0.000000  0.003149 
   u(i)  1.000000 
udot(i) -0.000000  0.001726 
   u(j)  1.000000 
udot(j)  0.000000  0.001039 
   u(k)  1.000000 
udot(k) -0.000000  0.000667 
Atom type  2
   u(s)  1.000000 
udot(s)  0.000000  0.023146 
   u(p)  1.000000 
udot(p)  0.000000  0.036192 
   u(d)  1.000000 
udot(d)  0.000000  0.003612 
   u(f)  1.000000 
udot(f)  0.000000  0.001183 
   u(g)  1.000000 
udot(g)  0.000000  0.000520 
   u(h)  1.000000 
udot(h) -0.000000  0.000271 
   u(i)  1.000000 
udot(i)  0.000000  0.000157 


### subroutine: mixedbasis ( Mode: vv ) ###

Mixed basis
  Plane-wave basis:
    Number of unique G vectors:   369
    Maximal number of G vectors:  233

  MT basis read in from spex.mb (mode: vv).
    Total number of product-basis functions:  264



##### Job index:  1 #####


### subroutine: correlation ###

< GW self-energy >
Calculate periodic function...done   ( Timing:    0.09 )

=========

K point (   1 ):   0.00000   0.00000   0.00000

Coulomb matrix read from spex.cor
Inverse dielectric matrices read from spex.cor 
Invert dielectric tensor... done   ( Timing:    0.02 )
Hermiticity of transformed Coulomb matrix: 6.8E-11

Add contribution to self-energy... done
                               Timings
  MT wave-func. products:      0.11357
  PW wave-func. products:      0.25468
  Matrix-vector products:      0.33572
  Transformations:             0.08358
  Exchange self-energy:        0.06646
  Frequency integration:       0.01767
  Tetrahedron weights:         0.00000
  Gamma-point correction:      1.38859
  MPI idle time:               0.00004      0.00004
  Other:                       0.05115
  ------------------------------------
  Total:                       2.31145

=========

K point (   2 ):   0.00000   0.00000   0.25000

Coulomb matrix read from spex.cor
Inverse dielectric matrices read from spex.cor 
Hermiticity of transformed Coulomb matrix: 8.7E-10

Add contribution to self-energy... done
                               Timings
  MT wave-func. products:      0.11575
  PW wave-func. products:      0.24548
  Matrix-vector products:      0.32732
  Transformations:             0.08153
  Exchange self-energy:        0.05347
  Frequency integration:       0.01799
  Tetrahedron weights:         0.00000
  MPI idle time:               0.00002      0.00002
  Other:                       0.04996
  ------------------------------------
  Total:                       0.89152

=========

K point (   3 ):   0.00000   0.00000   0.50000

Coulomb matrix read from spex.cor
Inverse dielectric matrices read from spex.cor 
Hermiticity of transformed Coulomb matrix: 2.4E-10

Add contribution to self-energy... done
                               Timings
  MT wave-func. products:      0.11551
  PW wave-func. products:      0.23319
  Matrix-vector products:      0.52151
  Transformations:             0.07488
  Exchange self-energy:        0.04730
  Frequency integration:       0.01777
  Tetrahedron weights:         0.00000
  MPI idle time:               0.00003      0.00003
  Other:                       0.05009
  ------------------------------------
  Total:                       1.06027

=========

K point (   4 ):   0.00000   0.25000   0.00000

Coulomb matrix read from spex.cor
Inverse dielectric matrices read from spex.cor 
Hermiticity of transformed Coulomb matrix: 1.5E-10

Add contribution to self-energy... done
                               Timings
  MT wave-func. products:      0.27688
  PW wave-func. products:      0.60756
  Matrix-vector products:      1.58511
  Transformations:             0.24270
  Exchange self-energy:        0.08328
  Frequency integration:       0.05330
  Tetrahedron weights:         0.00000
  MPI idle time:               0.00004      0.00004
  Other:                       0.13329
  ------------------------------------
  Total:                       2.98216

=========

K point (   5 ):   0.00000   0.25000   0.25000

Coulomb matrix read from spex.cor
Inverse dielectric matrices read from spex.cor 
Hermiticity of transformed Coulomb matrix: 1.5E-10

Add contribution to self-energy... done
                               Timings
  MT wave-func. products:      0.27850
  PW wave-func. products:      0.61627
  Matrix-vector products:      1.65298
  Transformations:             0.25305
  Exchange self-energy:        0.08254
  Frequency integration:       0.05444
  Tetrahedron weights:         0.00000
  MPI idle time:               0.00004      0.00004
  Other:                       0.13628
  ------------------------------------
  Total:                       3.07410

=========

K point (   6 ):   0.00000   0.25000   0.50000

Coulomb matrix read from spex.cor
Inverse dielectric matrices read from spex.cor 
Hermiticity of transformed Coulomb matrix: 1.4E-10

Add contribution to self-energy... done
                               Timings
  MT wave-func. products:      0.27774
  PW wave-func. products:      0.62980
  Matrix-vector products:      1.67929
  Transformations:             0.25751
  Exchange self-energy:        0.08776
  Frequency integration:       0.05422
  Tetrahedron weights:         0.00000
  MPI idle time:               0.00006      0.00006
  Other:                       0.13836
  ------------------------------------
  Total:                       3.12475

=========

K point (   7 ):   0.00000   0.50000   0.00000

Coulomb matrix read from spex.cor
Inverse dielectric matrices read from spex.cor 
Hermiticity of transformed Coulomb matrix: 1.3E-10

Add contribution to self-energy... done
                               Timings
  MT wave-func. products:      0.19216
  PW wave-func. products:      0.44872
  Matrix-vector products:      0.70458
  Transformations:             0.16601
  Exchange self-energy:        0.07399
  Frequency integration:       0.03563
  Tetrahedron weights:         0.00000
  MPI idle time:               0.00002      0.00002
  Other:                       0.09185
  ------------------------------------
  Total:                       1.71297

=========

K point (   8 ):   0.00000   0.50000   0.25000

Coulomb matrix read from spex.cor
Inverse dielectric matrices read from spex.cor 
Hermiticity of transformed Coulomb matrix: 7.9E-11

Add contribution to self-energy... done
                               Timings
  MT wave-func. products:      0.19314
  PW wave-func. products:      0.45214
  Matrix-vector products:      0.69571
  Transformations:             0.16971
  Exchange self-energy:        0.06953
  Frequency integration:       0.03658
  Tetrahedron weights:         0.00000
  MPI idle time:               0.00004      0.00004
  Other:                       0.09399
  ------------------------------------
  Total:                       1.71084

=========

K point (   9 ):   0.00000   0.50000   0.50000

Coulomb matrix read from spex.cor
Inverse dielectric matrices read from spex.cor 
Hermiticity of transformed Coulomb matrix: 5.5E-11

Add contribution to self-energy... done
                               Timings
  MT wave-func. products:      0.19821
  PW wave-func. products:      0.41995
  Matrix-vector products:      1.07760
  Transformations:             0.16381
  Exchange self-energy:        0.06651
  Frequency integration:       0.03678
  Tetrahedron weights:         0.00000
  MPI idle time:               0.00002      0.00002
  Other:                       0.09405
  ------------------------------------
  Total:                       2.05693

=========

K point (  10 ):   0.25000   0.25000   0.00000

Coulomb matrix read from spex.cor
Inverse dielectric matrices read from spex.cor 
Hermiticity of transformed Coulomb matrix: 5.5E-11

Add contribution to self-energy... done
                               Timings
  MT wave-func. products:      0.34758
  PW wave-func. products:      0.78453
  Matrix-vector products:      1.98866
  Transformations:             0.31836
  Exchange self-energy:        0.09745
  Frequency integration:       0.07190
  Tetrahedron weights:         0.00000
  MPI idle time:               0.00004      0.00004
  Other:                       0.17660
  ------------------------------------
  Total:                       3.78510

=========

K point (  11 ):   0.25000   0.25000   0.25000

Coulomb matrix read from spex.cor
Inverse dielectric matrices read from spex.cor 
Hermiticity of transformed Coulomb matrix: 8.0E-11

Add contribution to self-energy... done
                               Timings
  MT wave-func. products:      0.35670
  PW wave-func. products:      0.82611
  Matrix-vector products:      2.09425
  Transformations:             0.32682
  Exchange self-energy:        0.10413
  Frequency integration:       0.07125
  Tetrahedron weights:         0.00000
  MPI idle time:               0.00004      0.00004
  Other:                       0.17630
  ------------------------------------
  Total:                       3.95559

=========

K point (  12 ):   0.25000   0.25000   0.50000

Coulomb matrix read from spex.cor
Inverse dielectric matrices read from spex.cor 
Hermiticity of transformed Coulomb matrix: 9.9E-11

Add contribution to self-energy... done
                               Timings
  MT wave-func. products:      0.35522
  PW wave-func. products:      0.81563
  Matrix-vector products:      3.80908
  Transformations:             0.32797
  Exchange self-energy:        0.10155
  Frequency integration:       0.07202
  Tetrahedron weights:         0.00000
  MPI idle time:               0.00006      0.00006
  Other:                       0.17086
  ------------------------------------
  Total:                       5.65240


### subroutine: exchange_core ###

        k point       band      exchange (core contribution)
  (0.422,0.422,0.000)   1     -7.7946300
  (0.422,0.422,0.000)   2     -9.3399846
  (0.422,0.422,0.000)   3    -17.7790393
  (0.422,0.422,0.000)   4    -17.9879865
  (0.422,0.422,0.000)   5    -18.2815165
  (0.422,0.422,0.000)   6    -18.2623097
  (0.422,0.422,0.000)   7    -18.3708212
  (0.422,0.422,0.000)   8    -18.4650328
  (0.422,0.422,0.000)   9    -18.5811538
  (0.422,0.422,0.000)  10    -18.6308439
Timing:   0.13




### subroutine: quasiparticle ###

Number of mesh points even: No constraint will be used.

List of k points
    0   0.42222   0.42222   0.00000  (additional) 



#####################
### K POINT:    0 ###
#####################


--- DIAGONAL ELEMENTS [eV] ---

 Bd       vxc    sigmax    sigmac         Z        KS        HF          GW lin/dir 
  1 -27.16247 -38.33540   8.75117   0.72683  -8.02023 -19.19316  -9.75314   0.58276 
                          0.66504  -0.04104                      -9.70360   0.55569 
  2 -29.67220 -41.23599   8.91600   0.72293  -7.89427 -19.45806  -9.79198   0.47161 
                          0.54099  -0.03041                      -9.72482   0.45530 
  3 -42.24545 -55.50395   9.44396   0.73797  -6.39357 -19.65207  -9.20766   0.10304 
                          0.06402  -0.01463                      -9.10635   0.12861 
  4 -42.64069 -55.96062   9.49181   0.73833  -6.31452 -19.63445  -9.14001   0.10280 
                          0.06372  -0.01456                      -9.03848   0.12841 
  5 -43.06290 -56.42029   9.47277   0.74103  -6.21823 -19.57561  -9.09636   0.07536 
                          0.04287  -0.01122                      -8.99043   0.10056 
  6 -43.03391 -56.37494   9.45883   0.74128  -6.20630 -19.54733  -9.08362   0.07454 
                          0.04261  -0.01106                      -8.97778   0.09942 
  7 -43.29386 -56.68903   9.53376   0.73986  -6.17238 -19.56755  -9.02855   0.09164 
                          0.05505  -0.01319                      -8.92527   0.11717 
  8 -43.44523 -56.88292   9.56041   0.73998  -6.16432 -19.60200  -9.03276   0.08915 
                          0.05276  -0.01292                      -8.92860   0.11496 
  9 -43.60597 -57.02355   9.50959   0.74196  -6.10184 -19.51942  -9.00105   0.06565 
                          0.03564  -0.01003                      -8.89358   0.09082 
 10 -43.67950 -57.07918   9.48487   0.74262  -6.06785 -19.46752  -8.97479   0.05710 
                          0.02949  -0.00899                      -8.86608   0.08222 

Timing (quasiparticle equation):   0.10702

Timing:        34
