########################
######### SPEX #########
########################
Version 05.00  (Sep  5, 2019)
Execution time: Jan 18, 2020  17:34:56
Hostname: Ontology
MPI: 3,1


### subroutine: getinput ###

Basic parameters:
  Number of spins            =  1
            centers          =  4
            types            =  2
            equivalent atoms =  2  2
  Lattice parameter =      1.00000
  Lattice vectors   =      3.01411  -5.22060   0.00000
                           3.01411   5.22060   0.00000
                           0.00000   0.00000   9.80579
  Unit-cell volume  =    308.59778
  Reciprocal cutoff =      4.60000

Unit-cell geometry:
  # Ty  El              Coord.
  1  1  Ga   0.33333  -0.33333   0.00000
  2  1  Ga  -0.33333   0.33333   0.50000
  3  2  N    0.33333  -0.33333  -0.37700
  4  2  N   -0.33333   0.33333   0.12300

Symmetry information:
  Number of symmetry operations = 24
   #  Det           Axis           Angle   Syp  Inv
   1    1     --     --     --      --     Yes   1
   2   -1    1.00  -0.58  -0.00   180.00   No    2
   3   -1    1.00   0.58  -0.00   180.00   No    3
   4    1    0.00   0.00   1.00   120.00   Yes   9
   5    1    0.00   0.00   1.00   180.00   No    5
   6   -1    0.58   1.00  -0.00   180.00   Yes   6
   7   -1    1.00  -0.00  -0.00   180.00   Yes   7
   8    1    0.00   0.00   1.00    60.00   No   11
   9    1   -0.00  -0.00  -1.00   120.00   Yes   4
  10   -1   -0.00   1.00  -0.00   180.00   No   10
  11    1   -0.00  -0.00  -1.00    60.00   No    8
  12   -1   -0.58   1.00  -0.00   180.00   Yes  12
  13 - 24  Time reversal symmetries

##################
### Input file ###
##################
BZ       4 4 4
JOB      GW +:(1-30)
MPIKPT   
RESTART  
NBAND    200
KPT      +=(.44444,.44444,0)


Info: Simpson and Lagrange integration is used.

Radial mesh and basis functions:
  Number of radial grid points:       759  429
  Number of radial basis functions:    19   18
  Angular momentum quantum number:      8    6
  Maximal index:                        3

Core states:
  Atom type  1  (Ga)
  nl      Energy
  1s  -375.34991
  2s   -45.88297
  3s    -4.96076
  2p   -39.88207
  3p    -3.15226
  Atom type  2  (N )
  nl      Energy
  1s   -13.54409
  Number of valence electrons:   36

Average Coulomb potential: -0.35487  ( -9.65657 eV )

Read wavefunctions from harddisc... done   ( Timing:    0.28 )

Maximal energy difference in deg. subspaces: 1.0E-13
Minimal energy difference between subspaces: 8.0E-07

Wave functions:
  Number of bands:             198 -  200  (  200 )
            k points (IBZ):     64  (  12 /  30 )
            G vectors:         769
  k points of IBZ:
    1  (0.00000,0.00000,0.00000)  [ 0.00000, 0.00000, 0.00000 ]
    2  (0.00000,0.00000,0.25000)  [ 0.00000, 0.00000, 0.02550 ]
    3  (0.00000,0.00000,0.50000)  [ 0.00000, 0.00000, 0.05099 ]
    4  (0.00000,0.25000,0.00000)  [ 0.04147, 0.02394, 0.00000 ]
    5  (0.00000,0.25000,0.25000)  [ 0.04147, 0.02394, 0.02550 ]
    6  (0.00000,0.25000,0.50000)  [ 0.04147, 0.02394, 0.05099 ]
    7  (0.00000,0.50000,0.00000)  [ 0.08294, 0.04789, 0.00000 ]
    8  (0.00000,0.50000,0.25000)  [ 0.08294, 0.04789, 0.02550 ]
    9  (0.00000,0.50000,0.50000)  [ 0.08294, 0.04789, 0.05099 ]
   10  (0.25000,0.25000,0.00000)  [ 0.08294, 0.00000, 0.00000 ]
   11  (0.25000,0.25000,0.25000)  [ 0.08294, 0.00000, 0.02550 ]
   12  (0.25000,0.25000,0.50000)  [ 0.08294, 0.00000, 0.05099 ]
  k points of EIBZ (shifted set):
   65  (0.44444,0.44444,0.00000)  [ 0.14745, 0.00000, 0.00000 ]
   66  (0.44444,0.44444,0.25000)  [ 0.14745, 0.00000, 0.02550 ]
   67  (0.44444,0.44444,0.50000)  [ 0.14745, 0.00000, 0.05099 ]
   68  (0.44444,0.69444,0.00000)  [ 0.18892, 0.02394, 0.00000 ]
   69  (0.44444,0.69444,0.25000)  [ 0.18892, 0.02394, 0.02550 ]
   70  (0.44444,0.69444,0.50000)  [ 0.18892, 0.02394, 0.05099 ]
   71  (0.44444,0.94444,0.00000)  [ 0.23040, 0.04789, 0.00000 ]
   72  (0.44444,0.94444,0.25000)  [ 0.23040, 0.04789, 0.02550 ]
   73  (0.44444,0.94444,0.50000)  [ 0.23040, 0.04789, 0.05099 ]
   74  (0.44444,0.19444,0.00000)  [ 0.10598,-0.02394, 0.00000 ]
   75  (0.44444,0.19444,0.25000)  [ 0.10598,-0.02394, 0.02550 ]
   76  (0.44444,0.19444,0.50000)  [ 0.10598,-0.02394, 0.05099 ]
   77  (0.69444,0.69444,0.00000)  [ 0.23040, 0.00000, 0.00000 ]
   78  (0.69444,0.69444,0.25000)  [ 0.23040, 0.00000, 0.02550 ]
   79  (0.69444,0.69444,0.50000)  [ 0.23040, 0.00000, 0.05099 ]
   80  (0.69444,0.94444,0.00000)  [ 0.27187, 0.02394, 0.00000 ]
   81  (0.69444,0.94444,0.25000)  [ 0.27187, 0.02394, 0.02550 ]
   82  (0.69444,0.94444,0.50000)  [ 0.27187, 0.02394, 0.05099 ]
   83  (0.69444,0.19444,0.00000)  [ 0.14745,-0.04789, 0.00000 ]
   84  (0.69444,0.19444,0.25000)  [ 0.14745,-0.04789, 0.02550 ]
   85  (0.69444,0.19444,0.50000)  [ 0.14745,-0.04789, 0.05099 ]
   86  (0.94444,0.94444,0.00000)  [ 0.31334, 0.00000, 0.00000 ]
   87  (0.94444,0.94444,0.25000)  [ 0.31334, 0.00000, 0.02550 ]
   88  (0.94444,0.94444,0.50000)  [ 0.31334, 0.00000, 0.05099 ]
   89  (0.94444,0.19444,0.00000)  [ 0.18892,-0.07183, 0.00000 ]
   90  (0.94444,0.19444,0.25000)  [ 0.18892,-0.07183, 0.02550 ]
   91  (0.94444,0.19444,0.50000)  [ 0.18892,-0.07183, 0.05099 ]
   92  (0.19444,0.19444,0.00000)  [ 0.06451, 0.00000, 0.00000 ]
   93  (0.19444,0.19444,0.25000)  [ 0.06451, 0.00000, 0.02550 ]
   94  (0.19444,0.19444,0.50000)  [ 0.06451, 0.00000, 0.05099 ]

Generate wavefunctions at equivalent k points... done   ( Timing:   0.27 )

Size of array cpw:   209.8 MB
Size of array cmt:   260.9 MB

The system is not a metal.
The Fermi energy is placed in the center of the band gap.
KS energy gap:    0.07059528 Ha   (  1.92099521 eV )
Fermi energy:     0.29316457 Ha   (  7.97741378 eV )
Maximal energy:   5.57253105 Ha
Electron count error of the shifted k-point set:  0.0000000000000000

Wave-function checksum: -2.454894827865E-02


### subroutine: checkinput ###

Overlap <core|core>
Atom type  1
1s  1.000000
2s -0.000000  1.000000
3s  0.000000 -0.000001  0.999961
2p  0.999418
3p -0.000329  0.999458
Atom type  2
1s  0.999983

Overlap <core|basis>
Atom type  1
         u(s)    udot(s)
1s  0.000000  0.000000
2s  0.000001  0.000000
3s  0.004767 -0.007551
         u(p)    udot(p)
2p -0.000106 -0.000031
3p  0.017150 -0.021254
Atom type  2
         u(s)    udot(s)
1s  0.003209 -0.002046

Average overlap <core|val>
Atom type  1
1s  0.000000
2s  0.000000
3s  0.000679
2p  0.000010  0.000010  0.000010
3p  0.002208  0.002205  0.002209
Atom type  2
1s  0.000234

Maximum overlap <core|val> at (band/kpoint)
Atom type  1
1s  0.000000 (033/ 001)
2s  0.000001 (033/ 001)
3s  0.004411 (156/ 003)
2p  0.000059 (024/ 003)  0.000064 (024/ 001)  0.000071 (025/ 003)
3p  0.012434 (121/ 003)  0.014817 (111/ 001)  0.011087 (124/ 003)
Atom type  2
1s  0.001657 (001/ 088)

Overlap <basis|basis>
Atom type  1
   u(s)  1.000000
udot(s) -0.000000  0.129862
   u(p)  1.000000
udot(p)  0.000000  0.075237
   u(d)  1.000000
udot(d) -0.000000  0.733838
 ulo(d)  0.410292 -0.767526  1.000000
   u(f)  1.000000
udot(f) -0.000000  0.020278
   u(g)  1.000000
udot(g) -0.000000  0.006703
   u(h)  1.000000
udot(h) -0.000000  0.003149
   u(i)  1.000000
udot(i)  0.000000  0.001726
   u(j)  1.000000
udot(j) -0.000000  0.001039
   u(k)  1.000000
udot(k) -0.000000  0.000667
Atom type  2
   u(s)  1.000000
udot(s)  0.000000  0.023146
   u(p)  1.000000
udot(p)  0.000000  0.036192
   u(d)  1.000000
udot(d) -0.000000  0.003612
   u(f)  1.000000
udot(f)  0.000000  0.001183
   u(g)  1.000000
udot(g) -0.000000  0.000520
   u(h)  1.000000
udot(h) -0.000000  0.000271
   u(i)  1.000000
udot(i) -0.000000  0.000157


### subroutine: mixedbasis ( Mode: vv ) ###

Mixed basis
  Plane-wave basis:
    Number of unique G vectors:   371
    Maximal number of G vectors:  233

  MT basis read in from spex.mb (mode: vv).
    Total number of product-basis functions:  264



##### Job index:  1 #####


### subroutine: correlation ###

< GW self-energy >
Calculate periodic function...done   ( Timing:    0.04 )

=========

K point (   1 ):   0.00000   0.00000   0.00000

Coulomb matrix read from spex.cor
Inverse dielectric matrices read from spex.cor
Invert dielectric tensor... done   ( Timing:    0.02 )
Hermiticity of transformed Coulomb matrix: 5.1E-11

Add contribution to self-energy... done
                               Timings
  MT wave-func. products:      1.87014
  PW wave-func. products:      0.43025
  Matrix-vector products:      2.38274
  Transformations:             0.30255
  Exchange self-energy:        0.17700
  Frequency integration:       0.02612
  Tetrahedron weights:         0.00000
  Gamma-point correction:      0.40770
  MPI idle time:               0.02024      0.02024
  Other:                       0.19302
  ------------------------------------
  Total:                       5.80977

=========

K point (   2 ):   0.00000   0.00000   0.25000

Coulomb matrix read from spex.cor
Inverse dielectric matrices read from spex.cor
Hermiticity of transformed Coulomb matrix: 5.9E-10

Add contribution to self-energy... done
                               Timings
  MT wave-func. products:      1.39895
  PW wave-func. products:      0.41104
  Matrix-vector products:      2.02252
  Transformations:             0.26036
  Exchange self-energy:        0.12462
  Frequency integration:       0.01922
  Tetrahedron weights:         0.00000
  MPI idle time:               0.00791      0.00846
  Other:                       0.16547
  ------------------------------------
  Total:                       4.41009

=========

K point (   3 ):   0.00000   0.00000   0.50000

Coulomb matrix read from spex.cor
Inverse dielectric matrices read from spex.cor
Hermiticity of transformed Coulomb matrix: 1.8E-10

Add contribution to self-energy... done
                               Timings
  MT wave-func. products:      1.68641
  PW wave-func. products:      0.47968
  Matrix-vector products:      2.40442
  Transformations:             0.25598
  Exchange self-energy:        0.17349
  Frequency integration:       0.08027
  Tetrahedron weights:         0.00000
  MPI idle time:               0.01348      0.01348
  Other:                       0.21461
  ------------------------------------
  Total:                       5.30834

=========

K point (   4 ):   0.00000   0.25000   0.00000

Coulomb matrix read from spex.cor
Inverse dielectric matrices read from spex.cor
Hermiticity of transformed Coulomb matrix: 8.5E-11

Add contribution to self-energy... done
                               Timings
  MT wave-func. products:      2.94479
  PW wave-func. products:      0.69380
  Matrix-vector products:      7.26147
  Transformations:             0.88709
  Exchange self-energy:        0.19727
  Frequency integration:       0.11756
  Tetrahedron weights:         0.00000
  MPI idle time:               0.02988      0.02988
  Other:                       0.54535
  ------------------------------------
  Total:                      12.67721

=========

K point (   5 ):   0.00000   0.25000   0.25000

Coulomb matrix read from spex.cor
Inverse dielectric matrices read from spex.cor
Hermiticity of transformed Coulomb matrix: 9.7E-11

Add contribution to self-energy... done
                               Timings
  MT wave-func. products:      2.51821
  PW wave-func. products:      0.69941
  Matrix-vector products:      6.65922
  Transformations:             0.82143
  Exchange self-energy:        0.19186
  Frequency integration:       0.21363
  Tetrahedron weights:         0.00000
  MPI idle time:               0.00002      0.01651
  Other:                       0.42349
  ------------------------------------
  Total:                      11.52725

=========

K point (   6 ):   0.00000   0.25000   0.50000

Coulomb matrix read from spex.cor
Inverse dielectric matrices read from spex.cor
Hermiticity of transformed Coulomb matrix: 9.8E-11

Add contribution to self-energy... done
                               Timings
  MT wave-func. products:      3.38712
  PW wave-func. products:      0.77073
  Matrix-vector products:      7.24850
  Transformations:             0.86248
  Exchange self-energy:        0.25209
  Frequency integration:       0.17450
  Tetrahedron weights:         0.00000
  MPI idle time:               0.00002      0.02293
  Other:                       0.60397
  ------------------------------------
  Total:                      13.29940

=========

K point (   7 ):   0.00000   0.50000   0.00000

Coulomb matrix read from spex.cor
Inverse dielectric matrices read from spex.cor
Hermiticity of transformed Coulomb matrix: 1.0E-10

Add contribution to self-energy... done
                               Timings
  MT wave-func. products:      2.48245
  PW wave-func. products:      0.54182
  Matrix-vector products:      4.33842
  Transformations:             0.56532
  Exchange self-energy:        0.22051
  Frequency integration:       0.08327
  Tetrahedron weights:         0.00000
  MPI idle time:               0.01415      0.03263
  Other:                       0.36509
  ------------------------------------
  Total:                       8.61103

=========

K point (   8 ):   0.00000   0.50000   0.25000

Coulomb matrix read from spex.cor
Inverse dielectric matrices read from spex.cor
Hermiticity of transformed Coulomb matrix: 5.3E-11

Add contribution to self-energy... done
                               Timings
  MT wave-func. products:      2.27543
  PW wave-func. products:      0.51826
  Matrix-vector products:      4.33260
  Transformations:             0.55222
  Exchange self-energy:        0.17995
  Frequency integration:       0.03693
  Tetrahedron weights:         0.00000
  MPI idle time:               0.00002      0.02141
  Other:                       0.31848
  ------------------------------------
  Total:                       8.21389

=========

K point (   9 ):   0.00000   0.50000   0.50000

Coulomb matrix read from spex.cor
Inverse dielectric matrices read from spex.cor
Hermiticity of transformed Coulomb matrix: 4.1E-11

Add contribution to self-energy... done
                               Timings
  MT wave-func. products:      2.13956
  PW wave-func. products:      0.56483
  Matrix-vector products:      4.57459
  Transformations:             0.52947
  Exchange self-energy:        0.18766
  Frequency integration:       0.06905
  Tetrahedron weights:         0.00000
  MPI idle time:               0.00002      0.02218
  Other:                       0.38790
  ------------------------------------
  Total:                       8.45308

=========

K point (  10 ):   0.25000   0.25000   0.00000

Coulomb matrix read from spex.cor
Inverse dielectric matrices read from spex.cor
Hermiticity of transformed Coulomb matrix: 3.6E-11

Add contribution to self-energy... done
                               Timings
  MT wave-func. products:      4.33276
  PW wave-func. products:      1.07116
  Matrix-vector products:      8.99326
  Transformations:             1.08807
  Exchange self-energy:        0.24533
  Frequency integration:       0.15617
  Tetrahedron weights:         0.00000
  MPI idle time:               0.00002      0.02134
  Other:                       0.57182
  ------------------------------------
  Total:                      16.45860

=========

K point (  11 ):   0.25000   0.25000   0.25000

Coulomb matrix read from spex.cor
Inverse dielectric matrices read from spex.cor
Hermiticity of transformed Coulomb matrix: 5.4E-11

Add contribution to self-energy... done
                               Timings
  MT wave-func. products:      3.31340
  PW wave-func. products:      0.96626
  Matrix-vector products:      8.51604
  Transformations:             1.15642
  Exchange self-energy:        0.20522
  Frequency integration:       0.16550
  Tetrahedron weights:         0.00000
  MPI idle time:               0.00048      0.02646
  Other:                       0.63388
  ------------------------------------
  Total:                      14.95721

=========

K point (  12 ):   0.25000   0.25000   0.50000

Coulomb matrix read from spex.cor
Inverse dielectric matrices read from spex.cor
Hermiticity of transformed Coulomb matrix: 6.5E-11

Add contribution to self-energy... done
                               Timings
  MT wave-func. products:      3.48642
  PW wave-func. products:      0.96628
  Matrix-vector products:     14.29155
  Transformations:             1.23013
  Exchange self-energy:        0.23999
  Frequency integration:       0.24210
  Tetrahedron weights:         0.00000
  MPI idle time:               0.02173      0.02173
  Other:                       0.88335
  ------------------------------------
  Total:                      21.36154


### subroutine: exchange_core ###

        k point       band      exchange (core contribution)
  (0.444,0.444,0.000)   1     -7.6070072
  (0.444,0.444,0.000)   2     -9.3859632
  (0.444,0.444,0.000)   3    -17.7937298
  (0.444,0.444,0.000)   4    -17.9490379
  (0.444,0.444,0.000)   5    -18.2422810
  (0.444,0.444,0.000)   6    -18.2249943
  (0.444,0.444,0.000)   7    -18.3998464
  (0.444,0.444,0.000)   8    -18.4696544
  (0.444,0.444,0.000)   9    -18.6065988
  (0.444,0.444,0.000)  10    -18.6633883
  (0.444,0.444,0.000)  11    -12.7474552
  (0.444,0.444,0.000)  12    -10.8147816
  (0.444,0.444,0.000)  13     -1.8180025
  (0.444,0.444,0.000)  14     -1.9362416
  (0.444,0.444,0.000)  15     -1.4109481
  (0.444,0.444,0.000)  16     -1.3268570
  (0.444,0.444,0.000)  17     -1.6991290
  (0.444,0.444,0.000)  18     -1.8378372
  (0.444,0.444,0.000)  19     -1.6853530
  (0.444,0.444,0.000)  20     -2.0042176
  (0.444,0.444,0.000)  21     -1.9407911
  (0.444,0.444,0.000)  22     -1.7944202
  (0.444,0.444,0.000)  23     -1.9032562
  (0.444,0.444,0.000)  24     -1.6374277
  (0.444,0.444,0.000)  25     -1.1559122
  (0.444,0.444,0.000)  26     -1.9589470
  (0.444,0.444,0.000)  27     -2.3736645
  (0.444,0.444,0.000)  28     -1.6416752
  (0.444,0.444,0.000)  29     -2.0573824
  (0.444,0.444,0.000)  30     -1.7074778
Timing:   0.09




### subroutine: quasiparticle ###

Number of mesh points even: No constraint will be used.

List of k points
    0   0.44444   0.44444   0.00000  (additional)



#####################
### K POINT:    0 ###
#####################


--- DIAGONAL ELEMENTS [eV] ---

 Bd       vxc    sigmax    sigmac         Z        KS        HF          GW lin/dir
  1 -26.85203 -37.98011   8.72882   0.72739  -8.04067 -19.16875  -9.75741   0.59467
                          0.67942  -0.04188                      -9.70952   0.56638
  2 -29.74505 -41.32223   8.91833   0.72276  -7.89196 -19.46914  -9.79788   0.46569
                          0.53583  -0.02949                      -9.72941   0.44985
  3 -42.27453 -55.53357   9.44301   0.73815  -6.38152 -19.64057  -9.19739   0.10250
                          0.06370  -0.01454                      -9.09606   0.12796
  4 -42.57197 -55.88366   9.48703   0.73816  -6.33380 -19.64549  -9.15609   0.10328
                          0.06410  -0.01463                      -9.05467   0.12889
  5 -42.99933 -56.35109   9.47379   0.74073  -6.23025 -19.58201  -9.10227   0.07858
                          0.04525  -0.01162                      -8.99688   0.10384
  6 -42.96536 -56.28519   9.44008   0.74143  -6.20755 -19.52738  -9.08368   0.07272
                          0.04133  -0.01084                      -8.97778   0.09751
  7 -43.34984 -56.76005   9.54867   0.73974  -6.16884 -19.57904  -9.02462   0.09374
                          0.05664  -0.01342                      -8.92153   0.11929
  8 -43.46066 -56.90177   9.56667   0.73984  -6.15959 -19.60070  -9.02534   0.09115
                          0.05424  -0.01317                      -8.92149   0.11702
  9 -43.65280 -57.07309   9.51174   0.74203  -6.09200 -19.51229  -8.99192   0.06483
                          0.03503  -0.00994                      -8.88439   0.09000
 10 -43.73587 -57.14177   9.48790   0.74277  -6.05826 -19.46417  -8.96818   0.05540
                          0.02829  -0.00878                      -8.85919   0.08048
 11 -34.87629 -46.41192   8.72174   0.73461  -4.87611 -16.41174  -6.92061   0.43756
                          0.34357  -0.06581                      -6.93613   0.47087
 12 -32.08640 -42.99114   8.39930   0.72946  -4.36677 -15.27151  -6.17115   0.42709
                          0.36926  -0.06296                      -6.15199   0.43674
 13 -15.86950 -21.33654   4.21584   0.73725   0.72461  -4.74243  -0.19649   0.07373
                          0.06467  -0.02082                      -0.18453   0.07722
 14 -16.69425 -21.78077   3.92850   0.74629   1.80986  -3.27665   0.94606   0.03901
                          0.03283  -0.01253                       0.95593   0.04127
 15 -15.95694 -20.67967   3.57274   0.75402   2.91218  -1.81055   2.04516   0.01858
                          0.01419  -0.00685                       2.05519   0.02020
 16 -16.32554 -20.81876   3.37203   0.76194   3.81603  -0.67719   2.96178   0.00891
                          0.00598  -0.00388                       2.97073   0.01016
 17 -17.18219 -21.32528   3.12286   0.76888   4.78532   0.64223   4.00089   0.00306
                          0.00163  -0.00177                       4.00814   0.00386
 18 -18.44479 -22.44164   3.09918   0.77139   5.58018   1.58333   4.88773   0.00123
                          0.00066  -0.00080                       4.89283   0.00157
 19 -13.49972  -8.80909  -4.10622   0.80986  12.87378  17.56441  13.34706  -0.00312
                         -0.00136  -0.00345                      13.34512  -0.00362
 20 -13.94803  -8.90084  -4.27214   0.81364  12.90104  17.94823  13.53165  -0.00440
                         -0.00209  -0.00349                      13.52828  -0.00524
 21 -16.01781 -10.24928  -4.53004   0.79276  13.19144  18.95997  14.17325  -0.00957
                         -0.00353  -0.00546                      14.16478  -0.01257
 22 -17.27922 -10.41063  -5.28870   0.76372  15.61723  22.48582  16.82347  -0.04169
                         -0.02712  -0.01328                      16.80761  -0.04779
 23 -14.05536  -8.10767  -4.98024   0.79959  17.04924  22.99693  17.82231  -0.04145
                         -0.03479  -0.01409                      17.81669  -0.04327
 24 -15.64829  -9.05762  -5.41031   0.76930  17.37271  23.96338  18.27983  -0.06056
                         -0.05039  -0.01846                      18.27072  -0.06377
 25 -13.49643  -6.97103  -5.64650   0.77371  19.61273  26.13812  20.29013  -0.09862
                         -0.09681  -0.02699                      20.28488  -0.10001
 26 -15.62354  -8.01265  -6.45678   0.74648  20.62403  28.23492  21.47710  -0.19491
                         -0.19368  -0.04361                      21.46681  -0.19740
 27 -15.09203  -7.93902  -6.03276   0.76850  20.64842  27.80143  21.50306  -0.16742
                         -0.16107  -0.03895                      21.49392  -0.17006
 28 -12.67344  -5.75646  -6.17874   0.77764  24.65380  31.57079  25.20743  -0.31012
                         -0.34200  -0.05983                      25.20288  -0.30924
 29 -14.49854  -7.14989  -6.45259   0.76496  24.80224  32.15089  25.46211  -0.35653
                         -0.38905  -0.06575                      25.45527  -0.35571
 30 -13.54661  -6.37310  -6.42255   0.76845  25.91618  33.08968  26.46309  -0.38619
                         -0.43477  -0.06937                      26.45803  -0.38439

Timing (quasiparticle equation):   0.43413

Timing:       133
