########################
######### SPEX #########
########################
Version 05.00  (Sep  5, 2019)
Execution time: Jan 18, 2020  14:32:01
Hostname: login18-1.hpc.itc.rwth-aachen.de
MPI: 1,1


### subroutine: getinput ###

Basic parameters:
  Number of spins            =  1
            centers          =  4
            types            =  2
            equivalent atoms =  2  2
  Lattice parameter =      1.00000
  Lattice vectors   =      3.01411  -5.22060   0.00000
                           3.01411   5.22060   0.00000
                           0.00000   0.00000   9.80579
  Unit-cell volume  =    308.59778
  Reciprocal cutoff =      4.60000

Unit-cell geometry:
  # Ty  El              Coord.
  1  1  Ga   0.33333  -0.33333   0.00000
  2  1  Ga  -0.33333   0.33333   0.50000
  3  2  N    0.33333  -0.33333  -0.37700
  4  2  N   -0.33333   0.33333   0.12300

Symmetry information:
  Number of symmetry operations = 24
   #  Det           Axis           Angle   Syp  Inv
   1    1     --     --     --      --     Yes   1
   2   -1    1.00  -0.58   0.00   180.00   No    2
   3   -1    1.00   0.58   0.00   180.00   No    3
   4    1    0.00   0.00   1.00   120.00   Yes   9
   5    1    0.00   0.00   1.00   180.00   No    5
   6   -1    0.58   1.00   0.00   180.00   Yes   6
   7   -1    1.00   0.00   0.00   180.00   Yes   7
   8    1    0.00   0.00   1.00    60.00   No   11
   9    1    0.00   0.00  -1.00   120.00   Yes   4
  10   -1    0.00   1.00   0.00   180.00   No   10
  11    1    0.00   0.00  -1.00    60.00   No    8
  12   -1   -0.58   1.00   0.00   180.00   Yes  12
  13 - 24  Time reversal symmetries

##################
### Input file ###
##################
BZ       4 4 4
JOB      GW +:(1-30)
NBAND    200
RESTART  
KPT      +=(0,.09615,0)
 

Info: Simpson and Lagrange integration is used.

Radial mesh and basis functions:
  Number of radial grid points:       759  429
  Number of radial basis functions:    19   18
  Angular momentum quantum number:      8    6
  Maximal index:                        3

Core states:
  Atom type  1  (Ga)
  nl      Energy
  1s  -375.34991
  2s   -45.88297
  3s    -4.96076
  2p   -39.88207
  3p    -3.15226
  Atom type  2  (N )
  nl      Energy
  1s   -13.54409
  Number of valence electrons:   36

Average Coulomb potential: -0.35487  ( -9.65657 eV )

Read wavefunctions from harddisc... done   ( Timing:    0.23 )

Maximal energy difference in deg. subspaces: 1.6E-13
Minimal energy difference between subspaces: 9.9E-06

Wave functions:
  Number of bands:             198 -  200  (  200 )
            k points (IBZ):     64  (  12 /  30 )
            G vectors:         733
  k points of IBZ:
    1  (0.00000,0.00000,0.00000)  [ 0.00000, 0.00000, 0.00000 ]
    2  (0.00000,0.00000,0.25000)  [ 0.00000, 0.00000, 0.02550 ]
    3  (0.00000,0.00000,0.50000)  [ 0.00000, 0.00000, 0.05099 ]
    4  (0.00000,0.25000,0.00000)  [ 0.04147, 0.02394, 0.00000 ]
    5  (0.00000,0.25000,0.25000)  [ 0.04147, 0.02394, 0.02550 ]
    6  (0.00000,0.25000,0.50000)  [ 0.04147, 0.02394, 0.05099 ]
    7  (0.00000,0.50000,0.00000)  [ 0.08294, 0.04789, 0.00000 ]
    8  (0.00000,0.50000,0.25000)  [ 0.08294, 0.04789, 0.02550 ]
    9  (0.00000,0.50000,0.50000)  [ 0.08294, 0.04789, 0.05099 ]
   10  (0.25000,0.25000,0.00000)  [ 0.08294, 0.00000, 0.00000 ]
   11  (0.25000,0.25000,0.25000)  [ 0.08294, 0.00000, 0.02550 ]
   12  (0.25000,0.25000,0.50000)  [ 0.08294, 0.00000, 0.05099 ]
  k points of EIBZ (shifted set):
   65  (0.00000,0.09615,0.00000)  [ 0.01595, 0.00921, 0.00000 ]
   66  (0.00000,0.09615,0.25000)  [ 0.01595, 0.00921, 0.02550 ]
   67  (0.00000,0.09615,0.50000)  [ 0.01595, 0.00921, 0.05099 ]
   68  (0.00000,0.34615,0.00000)  [ 0.05742, 0.03315, 0.00000 ]
   69  (0.00000,0.34615,0.25000)  [ 0.05742, 0.03315, 0.02550 ]
   70  (0.00000,0.34615,0.50000)  [ 0.05742, 0.03315, 0.05099 ]
   71  (0.00000,0.59615,0.00000)  [ 0.09889, 0.05710, 0.00000 ]
   72  (0.00000,0.59615,0.25000)  [ 0.09889, 0.05710, 0.02550 ]
   73  (0.00000,0.59615,0.50000)  [ 0.09889, 0.05710, 0.05099 ]
   74  (0.00000,0.84615,0.00000)  [ 0.14036, 0.08104, 0.00000 ]
   75  (0.00000,0.84615,0.25000)  [ 0.14036, 0.08104, 0.02550 ]
   76  (0.00000,0.84615,0.50000)  [ 0.14036, 0.08104, 0.05099 ]
   77  (0.25000,0.09615,0.00000)  [ 0.05742,-0.01473, 0.00000 ]
   78  (0.25000,0.09615,0.25000)  [ 0.05742,-0.01473, 0.02550 ]
   79  (0.25000,0.09615,0.50000)  [ 0.05742,-0.01473, 0.05099 ]
   80  (0.25000,0.34615,0.00000)  [ 0.09889, 0.00921, 0.00000 ]
   81  (0.25000,0.34615,0.25000)  [ 0.09889, 0.00921, 0.02550 ]
   82  (0.25000,0.34615,0.50000)  [ 0.09889, 0.00921, 0.05099 ]
   83  (0.25000,0.59615,0.00000)  [ 0.14036, 0.03315, 0.00000 ]
   84  (0.25000,0.59615,0.25000)  [ 0.14036, 0.03315, 0.02550 ]
   85  (0.25000,0.59615,0.50000)  [ 0.14036, 0.03315, 0.05099 ]
   86  (0.25000,0.84615,0.00000)  [ 0.18184, 0.05710, 0.00000 ]
   87  (0.25000,0.84615,0.25000)  [ 0.18184, 0.05710, 0.02550 ]
   88  (0.25000,0.84615,0.50000)  [ 0.18184, 0.05710, 0.05099 ]
   89  (0.50000,0.09615,0.00000)  [ 0.09889,-0.03868, 0.00000 ]
   90  (0.50000,0.09615,0.25000)  [ 0.09889,-0.03868, 0.02550 ]
   91  (0.50000,0.09615,0.50000)  [ 0.09889,-0.03868, 0.05099 ]
   92  (0.50000,0.34615,0.00000)  [ 0.14036,-0.01473, 0.00000 ]
   93  (0.50000,0.34615,0.25000)  [ 0.14036,-0.01473, 0.02550 ]
   94  (0.50000,0.34615,0.50000)  [ 0.14036,-0.01473, 0.05099 ]

Generate wavefunctions at equivalent k points... done   ( Timing:   0.37 )

Size of array cpw:   209.8 MB
Size of array cmt:   260.9 MB

The system is not a metal.
The Fermi energy is placed in the center of the band gap.
KS energy gap:    0.07059528 Ha   (  1.92099521 eV )
Fermi energy:     0.29316457 Ha   (  7.97741378 eV )
Maximal energy:   5.57740095 Ha
Electron count error of the shifted k-point set:  0.0000000000000000

Wave-function checksum:  1.961058244884E-02


### subroutine: checkinput ###

Overlap <core|core>
Atom type  1
1s  1.000000 
2s -0.000000  1.000000 
3s  0.000000 -0.000001  0.999961 
2p  0.999418 
3p -0.000329  0.999458 
Atom type  2
1s  0.999983 

Overlap <core|basis>
Atom type  1
         u(s)    udot(s)
1s  0.000000  0.000000 
2s  0.000001  0.000000 
3s  0.004767 -0.007551 
         u(p)    udot(p)
2p -0.000106 -0.000031 
3p  0.017150 -0.021254 
Atom type  2
         u(s)    udot(s)
1s  0.003209 -0.002046 

Average overlap <core|val>
Atom type  1
1s  0.000000
2s  0.000000
3s  0.000679
2p  0.000010  0.000010  0.000010
3p  0.002209  0.002206  0.002209
Atom type  2
1s  0.000234

Maximum overlap <core|val> at (band/kpoint)
Atom type  1
1s  0.000000 (022/ 009)
2s  0.000001 (022/ 009)
3s  0.003767 (156/ 003)
2p  0.000060 (025/ 003)  0.000064 (024/ 001)  0.000067 (026/ 003)
3p  0.012494 (122/ 003)  0.014817 (111/ 001)  0.013262 (124/ 003)
Atom type  2
1s  0.001621 (002/ 088)

Overlap <basis|basis>
Atom type  1
   u(s)  1.000000 
udot(s)  0.000000  0.129862 
   u(p)  1.000000 
udot(p) -0.000000  0.075237 
   u(d)  1.000000 
udot(d) -0.000000  0.733838 
 ulo(d)  0.410292 -0.767526  1.000000 
   u(f)  1.000000 
udot(f) -0.000000  0.020278 
   u(g)  1.000000 
udot(g) -0.000000  0.006703 
   u(h)  1.000000 
udot(h)  0.000000  0.003149 
   u(i)  1.000000 
udot(i) -0.000000  0.001726 
   u(j)  1.000000 
udot(j)  0.000000  0.001039 
   u(k)  1.000000 
udot(k) -0.000000  0.000667 
Atom type  2
   u(s)  1.000000 
udot(s)  0.000000  0.023146 
   u(p)  1.000000 
udot(p)  0.000000  0.036192 
   u(d)  1.000000 
udot(d)  0.000000  0.003612 
   u(f)  1.000000 
udot(f)  0.000000  0.001183 
   u(g)  1.000000 
udot(g)  0.000000  0.000520 
   u(h)  1.000000 
udot(h) -0.000000  0.000271 
   u(i)  1.000000 
udot(i)  0.000000  0.000157 


### subroutine: mixedbasis ( Mode: vv ) ###

Mixed basis
  Plane-wave basis:
    Number of unique G vectors:   346
    Maximal number of G vectors:  233

  MT basis read in from spex.mb (mode: vv).
    Total number of product-basis functions:  264



##### Job index:  1 #####


### subroutine: correlation ###

< GW self-energy >
Calculate periodic function...done   ( Timing:    0.08 )

=========

K point (   1 ):   0.00000   0.00000   0.00000

Coulomb matrix read from spex.cor
Inverse dielectric matrices read from spex.cor 
Invert dielectric tensor... done   ( Timing:    0.02 )
Hermiticity of transformed Coulomb matrix: 6.8E-11

Add contribution to self-energy... done
                               Timings
  MT wave-func. products:      0.35368
  PW wave-func. products:      0.84147
  Matrix-vector products:      1.06915
  Transformations:             0.26681
  Exchange self-energy:        0.12181
  Frequency integration:       0.05623
  Tetrahedron weights:         0.00000
  Gamma-point correction:      1.40555
  MPI idle time:               0.00014      0.00014
  Other:                       0.15463
  ------------------------------------
  Total:                       4.26948

=========

K point (   2 ):   0.00000   0.00000   0.25000

Coulomb matrix read from spex.cor
Inverse dielectric matrices read from spex.cor 
Hermiticity of transformed Coulomb matrix: 8.7E-10

Add contribution to self-energy... done
                               Timings
  MT wave-func. products:      0.34519
  PW wave-func. products:      0.77070
  Matrix-vector products:      1.00017
  Transformations:             0.24671
  Exchange self-energy:        0.09460
  Frequency integration:       0.05402
  Tetrahedron weights:         0.00000
  MPI idle time:               0.00003      0.00003
  Other:                       0.13466
  ------------------------------------
  Total:                       2.64608

=========

K point (   3 ):   0.00000   0.00000   0.50000

Coulomb matrix read from spex.cor
Inverse dielectric matrices read from spex.cor 
Hermiticity of transformed Coulomb matrix: 2.4E-10

Add contribution to self-energy... done
                               Timings
  MT wave-func. products:      0.35657
  PW wave-func. products:      0.73041
  Matrix-vector products:      1.59707
  Transformations:             0.24057
  Exchange self-energy:        0.09145
  Frequency integration:       0.05469
  Tetrahedron weights:         0.00000
  MPI idle time:               0.00003      0.00003
  Other:                       0.13906
  ------------------------------------
  Total:                       3.20986

=========

K point (   4 ):   0.00000   0.25000   0.00000

Coulomb matrix read from spex.cor
Inverse dielectric matrices read from spex.cor 
Hermiticity of transformed Coulomb matrix: 1.5E-10

Add contribution to self-energy... done
                               Timings
  MT wave-func. products:      1.00519
  PW wave-func. products:      2.42417
  Matrix-vector products:      6.43052
  Transformations:             0.96094
  Exchange self-energy:        0.24483
  Frequency integration:       0.21506
  Tetrahedron weights:         0.00000
  MPI idle time:               0.00004      0.00004
  Other:                       0.51614
  ------------------------------------
  Total:                      11.79690

=========

K point (   5 ):   0.00000   0.25000   0.25000

Coulomb matrix read from spex.cor
Inverse dielectric matrices read from spex.cor 
Hermiticity of transformed Coulomb matrix: 1.5E-10

Add contribution to self-energy... done
                               Timings
  MT wave-func. products:      1.00710
  PW wave-func. products:      2.47584
  Matrix-vector products:      6.72892
  Transformations:             0.97763
  Exchange self-energy:        0.24516
  Frequency integration:       0.21521
  Tetrahedron weights:         0.00000
  MPI idle time:               0.00004      0.00004
  Other:                       0.51462
  ------------------------------------
  Total:                      12.16453

=========

K point (   6 ):   0.00000   0.25000   0.50000

Coulomb matrix read from spex.cor
Inverse dielectric matrices read from spex.cor 
Hermiticity of transformed Coulomb matrix: 1.4E-10

Add contribution to self-energy... done
                               Timings
  MT wave-func. products:      1.02272
  PW wave-func. products:      2.52171
  Matrix-vector products:      6.80851
  Transformations:             1.01229
  Exchange self-energy:        0.24988
  Frequency integration:       0.21775
  Tetrahedron weights:         0.00000
  MPI idle time:               0.00004      0.00004
  Other:                       0.52316
  ------------------------------------
  Total:                      12.35606

=========

K point (   7 ):   0.00000   0.50000   0.00000

Coulomb matrix read from spex.cor
Inverse dielectric matrices read from spex.cor 
Hermiticity of transformed Coulomb matrix: 1.3E-10

Add contribution to self-energy... done
                               Timings
  MT wave-func. products:      0.57167
  PW wave-func. products:      1.31883
  Matrix-vector products:      2.03319
  Transformations:             0.51153
  Exchange self-energy:        0.14964
  Frequency integration:       0.10917
  Tetrahedron weights:         0.00000
  MPI idle time:               0.00002      0.00002
  Other:                       0.26483
  ------------------------------------
  Total:                       4.95888

=========

K point (   8 ):   0.00000   0.50000   0.25000

Coulomb matrix read from spex.cor
Inverse dielectric matrices read from spex.cor 
Hermiticity of transformed Coulomb matrix: 7.9E-11

Add contribution to self-energy... done
                               Timings
  MT wave-func. products:      0.57459
  PW wave-func. products:      1.33494
  Matrix-vector products:      2.07367
  Transformations:             0.51235
  Exchange self-energy:        0.14172
  Frequency integration:       0.11036
  Tetrahedron weights:         0.00000
  MPI idle time:               0.00002      0.00002
  Other:                       0.26632
  ------------------------------------
  Total:                       5.01397

=========

K point (   9 ):   0.00000   0.50000   0.50000

Coulomb matrix read from spex.cor
Inverse dielectric matrices read from spex.cor 
Hermiticity of transformed Coulomb matrix: 5.5E-11

Add contribution to self-energy... done
                               Timings
  MT wave-func. products:      0.57527
  PW wave-func. products:      1.26597
  Matrix-vector products:      3.22260
  Transformations:             0.49099
  Exchange self-energy:        0.13619
  Frequency integration:       0.11006
  Tetrahedron weights:         0.00000
  MPI idle time:               0.00004      0.00004
  Other:                       0.26590
  ------------------------------------
  Total:                       6.06703

=========

K point (  10 ):   0.25000   0.25000   0.00000

Coulomb matrix read from spex.cor
Inverse dielectric matrices read from spex.cor 
Hermiticity of transformed Coulomb matrix: 5.5E-11

Add contribution to self-energy... done
                               Timings
  MT wave-func. products:      0.80635
  PW wave-func. products:      1.83382
  Matrix-vector products:      4.54482
  Transformations:             0.74914
  Exchange self-energy:        0.19013
  Frequency integration:       0.16358
  Tetrahedron weights:         0.00000
  MPI idle time:               0.00002      0.00002
  Other:                       0.39182
  ------------------------------------
  Total:                       8.67969

=========

K point (  11 ):   0.25000   0.25000   0.25000

Coulomb matrix read from spex.cor
Inverse dielectric matrices read from spex.cor 
Hermiticity of transformed Coulomb matrix: 8.0E-11

Add contribution to self-energy... done
                               Timings
  MT wave-func. products:      0.79211
  PW wave-func. products:      1.87208
  Matrix-vector products:      4.76147
  Transformations:             0.76102
  Exchange self-energy:        0.19450
  Frequency integration:       0.16291
  Tetrahedron weights:         0.00000
  MPI idle time:               0.00002      0.00002
  Other:                       0.39458
  ------------------------------------
  Total:                       8.93869

=========

K point (  12 ):   0.25000   0.25000   0.50000

Coulomb matrix read from spex.cor
Inverse dielectric matrices read from spex.cor 
Hermiticity of transformed Coulomb matrix: 9.9E-11

Add contribution to self-energy... done
                               Timings
  MT wave-func. products:      0.79264
  PW wave-func. products:      1.92113
  Matrix-vector products:      9.83869
  Transformations:             0.76151
  Exchange self-energy:        0.19465
  Frequency integration:       0.17208
  Tetrahedron weights:         0.00000
  MPI idle time:               0.00002      0.00002
  Other:                       0.39420
  ------------------------------------
  Total:                      14.07493


### subroutine: exchange_core ###

        k point       band      exchange (core contribution)
  (0.000,0.096,0.000)   1     -1.7847888
  (0.000,0.096,0.000)   2     -7.8749673
  (0.000,0.096,0.000)   3    -17.7432872
  (0.000,0.096,0.000)   4    -17.7914767
  (0.000,0.096,0.000)   5    -17.5994112
  (0.000,0.096,0.000)   6    -17.9291338
  (0.000,0.096,0.000)   7    -17.9668969
  (0.000,0.096,0.000)   8    -18.4349337
  (0.000,0.096,0.000)   9    -18.4531805
  (0.000,0.096,0.000)  10    -18.5981427
  (0.000,0.096,0.000)  11    -18.6627369
  (0.000,0.096,0.000)  12    -12.5161558
  (0.000,0.096,0.000)  13     -1.3171877
  (0.000,0.096,0.000)  14     -1.9295911
  (0.000,0.096,0.000)  15     -1.8407906
  (0.000,0.096,0.000)  16     -2.3564065
  (0.000,0.096,0.000)  17     -2.0900222
  (0.000,0.096,0.000)  18     -2.1650818
  (0.000,0.096,0.000)  19     -1.9579335
  (0.000,0.096,0.000)  20     -2.2565770
  (0.000,0.096,0.000)  21     -1.4045995
  (0.000,0.096,0.000)  22     -1.7546335
  (0.000,0.096,0.000)  23     -2.0045906
  (0.000,0.096,0.000)  24     -2.0334687
  (0.000,0.096,0.000)  25     -1.9158153
  (0.000,0.096,0.000)  26     -1.9946539
  (0.000,0.096,0.000)  27     -1.3424099
  (0.000,0.096,0.000)  28     -1.4980931
  (0.000,0.096,0.000)  29     -1.0918871
  (0.000,0.096,0.000)  30     -1.5141626
Timing:   0.40




### subroutine: quasiparticle ###

Number of mesh points even: No constraint will be used.

List of k points
    0   0.00000   0.09615   0.00000  (additional) 



#####################
### K POINT:    0 ###
#####################


--- DIAGONAL ELEMENTS [eV] ---

 Bd       vxc    sigmax    sigmac         Z        KS        HF          GW lin/dir 
  1 -16.98322 -26.71110   8.15862   0.73593  -8.86674 -18.59462  -9.90390   1.05375 
                          1.22737  -0.09590                      -9.90993   1.03979 
  2 -27.27469 -38.47545   8.76535   0.72755  -8.03173 -19.23249  -9.77532   0.58721 
                          0.66462  -0.04257                      -9.72731   0.55990 
  3 -42.25311 -55.55233   9.50385   0.73642  -6.42540 -19.72462  -9.21918   0.11673 
                          0.07475  -0.01625                      -9.11951   0.14243 
  4 -42.34643 -55.65758   9.51476   0.73619  -6.40646 -19.71761  -9.20013   0.11492 
                          0.07300  -0.01611                      -9.10024   0.14088 
  5 -42.01250 -55.25572   9.47618   0.73585  -6.38921 -19.63243  -9.15982   0.12386 
                          0.08030  -0.01719                      -9.06184   0.14968 
  6 -42.55236 -55.86972   9.49932   0.73773  -6.34812 -19.66549  -9.16381   0.10675 
                          0.06681  -0.01505                      -9.06288   0.13239 
  7 -42.62394 -55.95717   9.51163   0.73777  -6.34083 -19.67406  -9.15925   0.10755 
                          0.06749  -0.01511                      -9.05827   0.13314 
  8 -43.31322 -56.66705   9.43983   0.74285  -6.17705 -19.53089  -9.08436   0.05346 
                          0.02732  -0.00847                      -8.97516   0.07777 
  9 -43.34588 -56.70635   9.44341   0.74291  -6.17035 -19.53082  -9.08014   0.05311 
                          0.02710  -0.00842                      -8.97074   0.07740 
 10 -43.62004 -57.01635   9.48409   0.74268  -6.08709 -19.48340  -8.99234   0.06008 
                          0.03186  -0.00931                      -8.88422   0.08487 
 11 -43.73752 -57.15130   9.49503   0.74285  -6.06996 -19.48374  -8.98073   0.05833 
                          0.03067  -0.00907                      -8.87215   0.08305 
 12 -34.59381 -46.06907   8.69186   0.73778  -4.77262 -16.24788  -6.80361   0.43761 
                          0.35048  -0.06432                      -6.81314   0.44634 
 13 -14.60603 -20.17848   4.29892   0.73077   0.14024  -5.43222  -0.78792   0.10221 
                          0.09291  -0.02695                      -0.77513   0.10606 
 14 -18.31337 -22.34798   3.11289   0.77087   5.33350   1.29889   4.62297   0.00193 
                          0.00102  -0.00124                       4.62842   0.00244 
 15 -18.70076 -22.76991   3.18310   0.77022   5.80529   1.73614   5.12283   0.00117 
                          0.00062  -0.00078                       5.12782   0.00151 
 16 -19.44458 -22.89957   2.72842   0.77574   6.23589   2.78090   5.67227   0.00081 
                          0.00043  -0.00066                       5.67525   0.00105 
 17 -19.90967 -23.38406   2.81370   0.77486   6.89420   3.41981   6.38226   0.00061 
                          0.00048  -0.00036                       6.38460   0.00066 
 18 -20.10058 -23.81341   3.00221   0.77352   6.93724   3.22440   6.38755   0.00069 
                          0.00048  -0.00045                       6.39037   0.00080 
 19 -16.28945 -12.04949  -3.40722   0.79264   9.66001  13.89998  10.32008   0.00640 
                          0.00889  -0.00078                      10.31783   0.00314 
 20 -15.57979 -10.23907  -4.26923   0.80558  11.85289  17.19360  12.71606  -0.00108 
                          0.00172  -0.00230                      12.70969  -0.00313 
 21 -14.79307  -8.45997  -5.21527   0.77537  15.99528  22.32838  16.86158  -0.03924 
                         -0.03031  -0.01408                      16.85349  -0.04211 
 22 -13.99730  -7.96952  -5.02576   0.79544  16.36807  22.39585  17.16475  -0.03555 
                         -0.02848  -0.01287                      17.15857  -0.03759 
 23 -13.73153  -7.73533  -4.99377   0.80604  17.18808  23.18428  17.99568  -0.03767 
                         -0.03044  -0.01310                      17.98964  -0.03962 
 24 -14.02624  -7.78046  -5.17019   0.79972  17.89935  24.14513  18.75887  -0.04990 
                         -0.04076  -0.01608                      18.75171  -0.05238 
 25 -14.26267  -7.82907  -5.32000   0.79223  18.36102  24.79462  19.24225  -0.06314 
                         -0.05344  -0.01869                      19.23445  -0.06583 
 26 -14.60462  -8.00396  -5.43665   0.78745  18.97049  25.57115  19.88575  -0.07465 
                         -0.06384  -0.02094                      19.87703  -0.07766 
 27 -11.87680  -6.01841  -5.29522   0.79959  20.79886  26.65725  21.24576  -0.10938 
                         -0.11613  -0.02934                      21.24367  -0.10959 
 28 -12.60334  -6.69505  -5.24533   0.80138  22.21360  28.12189  22.74077  -0.12670 
                         -0.13240  -0.03107                      22.73797  -0.12706 
 29 -10.87890  -4.62752  -5.86297   0.78577  23.49989  29.75127  23.79178  -0.22739 
                         -0.26450  -0.05034                      23.79051  -0.22656 
 30 -11.81750  -5.19414  -6.03824   0.78308  24.87925  31.50261  25.31739  -0.30031 
                         -0.33935  -0.05909                      25.31445  -0.29914 

Timing (quasiparticle equation):   0.32306

Timing:        96
