########################
######### SPEX #########
########################
Version 05.00  (Sep  5, 2019)
Execution time: Jan 18, 2020  17:50:12
Hostname: Ontology
MPI: 3,1


### subroutine: getinput ###

Basic parameters:
  Number of spins            =  1
            centers          =  4
            types            =  2
            equivalent atoms =  2  2
  Lattice parameter =      1.00000
  Lattice vectors   =      3.01411  -5.22060   0.00000
                           3.01411   5.22060   0.00000
                           0.00000   0.00000   9.80579
  Unit-cell volume  =    308.59778
  Reciprocal cutoff =      4.60000

Unit-cell geometry:
  # Ty  El              Coord.
  1  1  Ga   0.33333  -0.33333   0.00000
  2  1  Ga  -0.33333   0.33333   0.50000
  3  2  N    0.33333  -0.33333  -0.37700
  4  2  N   -0.33333   0.33333   0.12300

Symmetry information:
  Number of symmetry operations = 24
   #  Det           Axis           Angle   Syp  Inv
   1    1     --     --     --      --     Yes   1
   2   -1    1.00  -0.58  -0.00   180.00   No    2
   3   -1    1.00   0.58  -0.00   180.00   No    3
   4    1    0.00   0.00   1.00   120.00   Yes   9
   5    1    0.00   0.00   1.00   180.00   No    5
   6   -1    0.58   1.00  -0.00   180.00   Yes   6
   7   -1    1.00  -0.00  -0.00   180.00   Yes   7
   8    1    0.00   0.00   1.00    60.00   No   11
   9    1   -0.00  -0.00  -1.00   120.00   Yes   4
  10   -1   -0.00   1.00  -0.00   180.00   No   10
  11    1   -0.00  -0.00  -1.00    60.00   No    8
  12   -1   -0.58   1.00  -0.00   180.00   Yes  12
  13 - 24  Time reversal symmetries

##################
### Input file ###
##################
BZ       4 4 4
JOB      GW +:(1-30)
MPIKPT   
RESTART  
NBAND    200
KPT      +=(.24444,.24444,0)


Info: Simpson and Lagrange integration is used.

Radial mesh and basis functions:
  Number of radial grid points:       759  429
  Number of radial basis functions:    19   18
  Angular momentum quantum number:      8    6
  Maximal index:                        3

Core states:
  Atom type  1  (Ga)
  nl      Energy
  1s  -375.34991
  2s   -45.88297
  3s    -4.96076
  2p   -39.88207
  3p    -3.15226
  Atom type  2  (N )
  nl      Energy
  1s   -13.54409
  Number of valence electrons:   36

Average Coulomb potential: -0.35487  ( -9.65657 eV )

Read wavefunctions from harddisc... done   ( Timing:    0.30 )

Maximal energy difference in deg. subspaces: 1.8E-12
Minimal energy difference between subspaces: 7.7E-07

Wave functions:
  Number of bands:             198 -  200  (  200 )
            k points (IBZ):     64  (  12 /  30 )
            G vectors:         783
  k points of IBZ:
    1  (0.00000,0.00000,0.00000)  [ 0.00000, 0.00000, 0.00000 ]
    2  (0.00000,0.00000,0.25000)  [ 0.00000, 0.00000, 0.02550 ]
    3  (0.00000,0.00000,0.50000)  [ 0.00000, 0.00000, 0.05099 ]
    4  (0.00000,0.25000,0.00000)  [ 0.04147, 0.02394, 0.00000 ]
    5  (0.00000,0.25000,0.25000)  [ 0.04147, 0.02394, 0.02550 ]
    6  (0.00000,0.25000,0.50000)  [ 0.04147, 0.02394, 0.05099 ]
    7  (0.00000,0.50000,0.00000)  [ 0.08294, 0.04789, 0.00000 ]
    8  (0.00000,0.50000,0.25000)  [ 0.08294, 0.04789, 0.02550 ]
    9  (0.00000,0.50000,0.50000)  [ 0.08294, 0.04789, 0.05099 ]
   10  (0.25000,0.25000,0.00000)  [ 0.08294, 0.00000, 0.00000 ]
   11  (0.25000,0.25000,0.25000)  [ 0.08294, 0.00000, 0.02550 ]
   12  (0.25000,0.25000,0.50000)  [ 0.08294, 0.00000, 0.05099 ]
  k points of EIBZ (shifted set):
   65  (0.24444,0.24444,0.00000)  [ 0.08110, 0.00000, 0.00000 ]
   66  (0.24444,0.24444,0.25000)  [ 0.08110, 0.00000, 0.02550 ]
   67  (0.24444,0.24444,0.50000)  [ 0.08110, 0.00000, 0.05099 ]
   68  (0.24444,0.49444,0.00000)  [ 0.12257, 0.02394, 0.00000 ]
   69  (0.24444,0.49444,0.25000)  [ 0.12257, 0.02394, 0.02550 ]
   70  (0.24444,0.49444,0.50000)  [ 0.12257, 0.02394, 0.05099 ]
   71  (0.24444,0.74444,0.00000)  [ 0.16404, 0.04789, 0.00000 ]
   72  (0.24444,0.74444,0.25000)  [ 0.16404, 0.04789, 0.02550 ]
   73  (0.24444,0.74444,0.50000)  [ 0.16404, 0.04789, 0.05099 ]
   74  (0.24444,0.99444,0.00000)  [ 0.20551, 0.07183, 0.00000 ]
   75  (0.24444,0.99444,0.25000)  [ 0.20551, 0.07183, 0.02550 ]
   76  (0.24444,0.99444,0.50000)  [ 0.20551, 0.07183, 0.05099 ]
   77  (0.49444,0.49444,0.00000)  [ 0.16404, 0.00000, 0.00000 ]
   78  (0.49444,0.49444,0.25000)  [ 0.16404, 0.00000, 0.02550 ]
   79  (0.49444,0.49444,0.50000)  [ 0.16404, 0.00000, 0.05099 ]
   80  (0.49444,0.74444,0.00000)  [ 0.20551, 0.02394, 0.00000 ]
   81  (0.49444,0.74444,0.25000)  [ 0.20551, 0.02394, 0.02550 ]
   82  (0.49444,0.74444,0.50000)  [ 0.20551, 0.02394, 0.05099 ]
   83  (0.49444,0.99444,0.00000)  [ 0.24698, 0.04789, 0.00000 ]
   84  (0.49444,0.99444,0.25000)  [ 0.24698, 0.04789, 0.02550 ]
   85  (0.49444,0.99444,0.50000)  [ 0.24698, 0.04789, 0.05099 ]
   86  (0.74444,0.74444,0.00000)  [ 0.24698, 0.00000, 0.00000 ]
   87  (0.74444,0.74444,0.25000)  [ 0.24698, 0.00000, 0.02550 ]
   88  (0.74444,0.74444,0.50000)  [ 0.24698, 0.00000, 0.05099 ]
   89  (0.74444,0.99444,0.00000)  [ 0.28846, 0.02394, 0.00000 ]
   90  (0.74444,0.99444,0.25000)  [ 0.28846, 0.02394, 0.02550 ]
   91  (0.74444,0.99444,0.50000)  [ 0.28846, 0.02394, 0.05099 ]
   92  (0.99444,0.99444,0.00000)  [ 0.32993, 0.00000, 0.00000 ]
   93  (0.99444,0.99444,0.25000)  [ 0.32993, 0.00000, 0.02550 ]
   94  (0.99444,0.99444,0.50000)  [ 0.32993, 0.00000, 0.05099 ]

Generate wavefunctions at equivalent k points... done   ( Timing:   0.26 )

Size of array cpw:   209.8 MB
Size of array cmt:   260.9 MB

The system is not a metal.
The Fermi energy is placed in the center of the band gap.
KS energy gap:    0.07059528 Ha   (  1.92099521 eV )
Fermi energy:     0.29316457 Ha   (  7.97741378 eV )
Maximal energy:   5.57300508 Ha
Electron count error of the shifted k-point set:  0.0000000000000000

Wave-function checksum:  3.542172921976E-02


### subroutine: checkinput ###

Overlap <core|core>
Atom type  1
1s  1.000000
2s -0.000000  1.000000
3s  0.000000 -0.000001  0.999961
2p  0.999418
3p -0.000329  0.999458
Atom type  2
1s  0.999983

Overlap <core|basis>
Atom type  1
         u(s)    udot(s)
1s  0.000000  0.000000
2s  0.000001  0.000000
3s  0.004767 -0.007551
         u(p)    udot(p)
2p -0.000106 -0.000031
3p  0.017150 -0.021254
Atom type  2
         u(s)    udot(s)
1s  0.003209 -0.002046

Average overlap <core|val>
Atom type  1
1s  0.000000
2s  0.000000
3s  0.000679
2p  0.000010  0.000010  0.000010
3p  0.002211  0.002207  0.002211
Atom type  2
1s  0.000234

Maximum overlap <core|val> at (band/kpoint)
Atom type  1
1s  0.000000 (033/ 001)
2s  0.000001 (033/ 001)
3s  0.004413 (156/ 003)
2p  0.000056 (025/ 001)  0.000064 (024/ 092)  0.000059 (025/ 003)
3p  0.012683 (124/ 094)  0.014817 (111/ 001)  0.012537 (122/ 094)
Atom type  2
1s  0.001658 (002/ 094)

Overlap <basis|basis>
Atom type  1
   u(s)  1.000000
udot(s) -0.000000  0.129862
   u(p)  1.000000
udot(p)  0.000000  0.075237
   u(d)  1.000000
udot(d) -0.000000  0.733838
 ulo(d)  0.410292 -0.767526  1.000000
   u(f)  1.000000
udot(f) -0.000000  0.020278
   u(g)  1.000000
udot(g) -0.000000  0.006703
   u(h)  1.000000
udot(h) -0.000000  0.003149
   u(i)  1.000000
udot(i)  0.000000  0.001726
   u(j)  1.000000
udot(j) -0.000000  0.001039
   u(k)  1.000000
udot(k) -0.000000  0.000667
Atom type  2
   u(s)  1.000000
udot(s)  0.000000  0.023146
   u(p)  1.000000
udot(p)  0.000000  0.036192
   u(d)  1.000000
udot(d) -0.000000  0.003612
   u(f)  1.000000
udot(f)  0.000000  0.001183
   u(g)  1.000000
udot(g) -0.000000  0.000520
   u(h)  1.000000
udot(h) -0.000000  0.000271
   u(i)  1.000000
udot(i) -0.000000  0.000157


### subroutine: mixedbasis ( Mode: vv ) ###

Mixed basis
  Plane-wave basis:
    Number of unique G vectors:   384
    Maximal number of G vectors:  233

  MT basis read in from spex.mb (mode: vv).
    Total number of product-basis functions:  264



##### Job index:  1 #####


### subroutine: correlation ###

< GW self-energy >
Calculate periodic function...done   ( Timing:    0.04 )

=========

K point (   1 ):   0.00000   0.00000   0.00000

Coulomb matrix read from spex.cor
Inverse dielectric matrices read from spex.cor
Invert dielectric tensor... done   ( Timing:    0.02 )
Hermiticity of transformed Coulomb matrix: 5.1E-11

Add contribution to self-energy... done
                               Timings
  MT wave-func. products:      1.48623
  PW wave-func. products:      0.44982
  Matrix-vector products:      2.61493
  Transformations:             0.29590
  Exchange self-energy:        0.16633
  Frequency integration:       0.05722
  Tetrahedron weights:         0.00000
  Gamma-point correction:      0.42031
  MPI idle time:               0.00004      0.02350
  Other:                       0.16444
  ------------------------------------
  Total:                       5.65521

=========

K point (   2 ):   0.00000   0.00000   0.25000

Coulomb matrix read from spex.cor
Inverse dielectric matrices read from spex.cor
Hermiticity of transformed Coulomb matrix: 5.9E-10

Add contribution to self-energy... done
                               Timings
  MT wave-func. products:      1.64075
  PW wave-func. products:      0.36596
  Matrix-vector products:      2.58724
  Transformations:             0.25744
  Exchange self-energy:        0.14883
  Frequency integration:       0.06089
  Tetrahedron weights:         0.00000
  MPI idle time:               0.00575      0.02068
  Other:                       0.11588
  ------------------------------------
  Total:                       5.18273

=========

K point (   3 ):   0.00000   0.00000   0.50000

Coulomb matrix read from spex.cor
Inverse dielectric matrices read from spex.cor
Hermiticity of transformed Coulomb matrix: 1.8E-10

Add contribution to self-energy... done
                               Timings
  MT wave-func. products:      1.48223
  PW wave-func. products:      0.53229
  Matrix-vector products:      2.62518
  Transformations:             0.23751
  Exchange self-energy:        0.13000
  Frequency integration:       0.05490
  Tetrahedron weights:         0.00000
  MPI idle time:               0.01663      0.01663
  Other:                       0.11107
  ------------------------------------
  Total:                       5.18982

=========

K point (   4 ):   0.00000   0.25000   0.00000

Coulomb matrix read from spex.cor
Inverse dielectric matrices read from spex.cor
Hermiticity of transformed Coulomb matrix: 8.5E-11

Add contribution to self-energy... done
                               Timings
  MT wave-func. products:      2.78616
  PW wave-func. products:      0.67546
  Matrix-vector products:      7.33233
  Transformations:             0.81319
  Exchange self-energy:        0.19413
  Frequency integration:       0.07149
  Tetrahedron weights:         0.00000
  MPI idle time:               0.01640      0.01779
  Other:                       0.47551
  ------------------------------------
  Total:                      12.36468

=========

K point (   5 ):   0.00000   0.25000   0.25000

Coulomb matrix read from spex.cor
Inverse dielectric matrices read from spex.cor
Hermiticity of transformed Coulomb matrix: 9.7E-11

Add contribution to self-energy... done
                               Timings
  MT wave-func. products:      2.78308
  PW wave-func. products:      0.70409
  Matrix-vector products:      6.47358
  Transformations:             0.80173
  Exchange self-energy:        0.15997
  Frequency integration:       0.13641
  Tetrahedron weights:         0.00000
  MPI idle time:               0.02700      0.02700
  Other:                       0.49550
  ------------------------------------
  Total:                      11.58137

=========

K point (   6 ):   0.00000   0.25000   0.50000

Coulomb matrix read from spex.cor
Inverse dielectric matrices read from spex.cor
Hermiticity of transformed Coulomb matrix: 9.8E-11

Add contribution to self-energy... done
                               Timings
  MT wave-func. products:      2.62597
  PW wave-func. products:      0.67615
  Matrix-vector products:      6.63792
  Transformations:             0.81347
  Exchange self-energy:        0.16158
  Frequency integration:       0.12628
  Tetrahedron weights:         0.00000
  MPI idle time:               0.01689      0.01689
  Other:                       0.60443
  ------------------------------------
  Total:                      11.66269

=========

K point (   7 ):   0.00000   0.50000   0.00000

Coulomb matrix read from spex.cor
Inverse dielectric matrices read from spex.cor
Hermiticity of transformed Coulomb matrix: 1.0E-10

Add contribution to self-energy... done
                               Timings
  MT wave-func. products:      2.32906
  PW wave-func. products:      0.60369
  Matrix-vector products:      4.28869
  Transformations:             0.54773
  Exchange self-energy:        0.18420
  Frequency integration:       0.11440
  Tetrahedron weights:         0.00000
  MPI idle time:               0.00202      0.02918
  Other:                       0.28231
  ------------------------------------
  Total:                       8.35212

=========

K point (   8 ):   0.00000   0.50000   0.25000

Coulomb matrix read from spex.cor
Inverse dielectric matrices read from spex.cor
Hermiticity of transformed Coulomb matrix: 5.3E-11

Add contribution to self-energy... done
                               Timings
  MT wave-func. products:      2.28966
  PW wave-func. products:      0.51658
  Matrix-vector products:      4.10916
  Transformations:             0.58846
  Exchange self-energy:        0.19831
  Frequency integration:       0.05038
  Tetrahedron weights:         0.00000
  MPI idle time:               0.00003      0.03770
  Other:                       0.22991
  ------------------------------------
  Total:                       7.98248

=========

K point (   9 ):   0.00000   0.50000   0.50000

Coulomb matrix read from spex.cor
Inverse dielectric matrices read from spex.cor
Hermiticity of transformed Coulomb matrix: 4.1E-11

Add contribution to self-energy... done
                               Timings
  MT wave-func. products:      2.34822
  PW wave-func. products:      0.54913
  Matrix-vector products:      4.69881
  Transformations:             0.54984
  Exchange self-energy:        0.20915
  Frequency integration:       0.11166
  Tetrahedron weights:         0.00000
  MPI idle time:               0.00002      0.02286
  Other:                       0.34346
  ------------------------------------
  Total:                       8.81030

=========

K point (  10 ):   0.25000   0.25000   0.00000

Coulomb matrix read from spex.cor
Inverse dielectric matrices read from spex.cor
Hermiticity of transformed Coulomb matrix: 3.6E-11

Add contribution to self-energy... done
                               Timings
  MT wave-func. products:      3.48915
  PW wave-func. products:      0.91328
  Matrix-vector products:      7.64541
  Transformations:             1.06984
  Exchange self-energy:        0.19625
  Frequency integration:       0.16588
  Tetrahedron weights:         0.00000
  MPI idle time:               0.02796      0.02796
  Other:                       0.65694
  ------------------------------------
  Total:                      14.16471

=========

K point (  11 ):   0.25000   0.25000   0.25000

Coulomb matrix read from spex.cor
Inverse dielectric matrices read from spex.cor
Hermiticity of transformed Coulomb matrix: 5.4E-11

Add contribution to self-energy... done
                               Timings
  MT wave-func. products:      3.04502
  PW wave-func. products:      0.88357
  Matrix-vector products:      7.86637
  Transformations:             1.10935
  Exchange self-energy:        0.20664
  Frequency integration:       0.18440
  Tetrahedron weights:         0.00000
  MPI idle time:               0.02730      0.03360
  Other:                       0.74476
  ------------------------------------
  Total:                      14.06741

=========

K point (  12 ):   0.25000   0.25000   0.50000

Coulomb matrix read from spex.cor
Inverse dielectric matrices read from spex.cor
Hermiticity of transformed Coulomb matrix: 6.5E-11

Add contribution to self-energy... done
                               Timings
  MT wave-func. products:      3.21295
  PW wave-func. products:      0.91849
  Matrix-vector products:     13.52348
  Transformations:             1.12783
  Exchange self-energy:        0.19368
  Frequency integration:       0.33001
  Tetrahedron weights:         0.00000
  MPI idle time:               0.01871      0.01871
  Other:                       0.89352
  ------------------------------------
  Total:                      20.21867


### subroutine: exchange_core ###

        k point       band      exchange (core contribution)
  (0.244,0.244,0.000)   1     -6.9984511
  (0.244,0.244,0.000)   2     -9.3630172
  (0.244,0.244,0.000)   3    -17.7799321
  (0.244,0.244,0.000)   4    -18.0755166
  (0.244,0.244,0.000)   5    -18.2188518
  (0.244,0.244,0.000)   6    -18.3306618
  (0.244,0.244,0.000)   7    -18.2737427
  (0.244,0.244,0.000)   8    -18.4214397
  (0.244,0.244,0.000)   9    -18.5510351
  (0.244,0.244,0.000)  10    -18.5502228
  (0.244,0.244,0.000)  11    -12.9736887
  (0.244,0.244,0.000)  12    -11.2777530
  (0.244,0.244,0.000)  13     -1.6954367
  (0.244,0.244,0.000)  14     -2.0326387
  (0.244,0.244,0.000)  15     -1.4013857
  (0.244,0.244,0.000)  16     -1.5180343
  (0.244,0.244,0.000)  17     -1.8300730
  (0.244,0.244,0.000)  18     -1.7570903
  (0.244,0.244,0.000)  19     -1.5048272
  (0.244,0.244,0.000)  20     -1.8762469
  (0.244,0.244,0.000)  21     -1.6893312
  (0.244,0.244,0.000)  22     -2.1511167
  (0.244,0.244,0.000)  23     -1.8556195
  (0.244,0.244,0.000)  24     -1.7286262
  (0.244,0.244,0.000)  25     -1.7022139
  (0.244,0.244,0.000)  26     -1.4766005
  (0.244,0.244,0.000)  27     -2.3311182
  (0.244,0.244,0.000)  28     -1.9350512
  (0.244,0.244,0.000)  29     -2.2191111
  (0.244,0.244,0.000)  30     -1.1842533
Timing:   0.09




### subroutine: quasiparticle ###

Number of mesh points even: No constraint will be used.

List of k points
    0   0.24444   0.24444   0.00000  (additional)



#####################
### K POINT:    0 ###
#####################


--- DIAGONAL ELEMENTS [eV] ---

 Bd       vxc    sigmax    sigmac         Z        KS        HF          GW lin/dir
  1 -25.88160 -36.85773   8.65708   0.72829  -8.06373 -19.03986  -9.72063   0.62955
                          0.72332  -0.04431                      -9.67775   0.59868
  2 -29.70517 -41.28415   8.91558   0.72157  -7.89740 -19.47638  -9.80389   0.46049
                          0.53163  -0.02887                      -9.73458   0.44604
  3 -42.25060 -55.51822   9.45456   0.73777  -6.39925 -19.66687  -9.21143   0.10523
                          0.06575  -0.01488                      -9.11030   0.13081
  4 -42.82400 -56.17650   9.52859   0.73801  -6.28454 -19.63705  -9.10559   0.10767
                          0.06740  -0.01515                      -9.00477   0.13338
  5 -43.01578 -56.37896   9.50783   0.73949  -6.22967 -19.59284  -9.07991   0.09198
                          0.05518  -0.01327                      -8.97665   0.11766
  6 -43.13860 -56.50104   9.46767   0.74162  -6.21426 -19.57671  -9.10229   0.06891
                          0.03845  -0.01037                      -8.99533   0.09364
  7 -43.08861 -56.45675   9.50334   0.74011  -6.20174 -19.56988  -9.06145   0.08751
                          0.05196  -0.01269                      -8.95750   0.11295
  8 -43.29499 -56.66777   9.47037   0.74201  -6.16715 -19.53993  -9.06242   0.06531
                          0.03559  -0.00997                      -8.95495   0.09022
  9 -43.56735 -56.98284   9.51776   0.74155  -6.11085 -19.52634  -9.00078   0.07130
                          0.03975  -0.01073                      -8.89436   0.09655
 10 -43.54907 -56.93080   9.48147   0.74217  -6.08410 -19.46583  -8.97842   0.06358
                          0.03429  -0.00978                      -8.87100   0.08871
 11 -34.94259 -46.59513   8.75899   0.72508  -5.20310 -16.85564  -7.28338   0.39095
                          0.31186  -0.05696                      -7.23945   0.43176
 12 -33.09831 -44.11708   8.47475   0.73564  -4.15789 -15.17667  -6.00802   0.41605
                          0.36059  -0.05927                      -5.98966   0.41429
 13 -15.98757 -21.03183   3.94363   0.74372   1.31232  -3.73193   0.49448   0.05109
                          0.04561  -0.01560                       0.50329   0.05321
 14 -16.75732 -21.95656   3.93928   0.74694   1.99196  -3.20727   1.05122   0.03795
                          0.02974  -0.01249                       1.06314   0.04114
 15 -15.73788 -20.54104   3.57240   0.75466   2.93002  -1.87313   2.00132   0.01884
                          0.01373  -0.00689                       2.01298   0.02088
 16 -16.30386 -20.84404   3.44907   0.75841   3.18551  -1.35467   2.35807   0.01546
                          0.01171  -0.00603                       2.36666   0.01686
 17 -17.88344 -22.11286   3.21543   0.76928   5.02256   0.79314   4.24252   0.00238
                          0.00137  -0.00130                       4.24946   0.00293
 18 -17.88505 -21.97782   3.14337   0.76911   5.21058   1.11780   4.48038   0.00163
                          0.00088  -0.00101                       4.48646   0.00208
 19 -12.45713  -7.75732  -4.18858   0.81592  12.91355  17.61336  13.33066  -0.00336
                         -0.00209  -0.00324                      13.32917  -0.00368
 20 -16.81233 -10.79950  -4.67362   0.78040  13.60681  19.61964  14.65189  -0.01485
                         -0.00664  -0.00722                      14.64175  -0.01877
 21 -14.77971  -9.15075  -4.64745   0.79205  14.81622  20.44518  15.59351  -0.01887
                         -0.01322  -0.00856                      15.58778  -0.02071
 22 -17.25601 -10.76375  -4.89409   0.78218  14.92061  21.41288  16.17055  -0.02467
                         -0.01368  -0.00874                      16.15552  -0.02990
 23 -14.68288  -8.67187  -4.99766   0.79154  16.64815  22.65916  17.44981  -0.03956
                         -0.03245  -0.01369                      17.44355  -0.04163
 24 -15.51813  -8.89777  -5.43783   0.77157  17.49906  24.11942  18.41045  -0.06362
                         -0.05324  -0.01906                      18.40130  -0.06685
 25 -13.79954  -7.43254  -5.49107   0.78264  17.98462  24.35162  18.66845  -0.07749
                         -0.07271  -0.02350                      18.66345  -0.07913
 26 -13.71257  -6.86242  -5.96855   0.76742  20.82338  27.67353  21.49397  -0.15536
                         -0.15941  -0.03746                      21.48829  -0.15643
 27 -15.87697  -8.27513  -6.35695   0.75440  21.01762  28.61946  21.94810  -0.20323
                         -0.19661  -0.04410                      21.93638  -0.20647
 28 -13.94654  -7.26487  -5.75275   0.78372  22.84873  29.53039  23.56873  -0.18994
                         -0.19326  -0.04142                      23.56268  -0.19100
 29 -15.05324  -7.52521  -6.51757   0.76865  26.79280  34.32083  27.53085  -0.46622
                         -0.50622  -0.07632                      27.52194  -0.46463
 30 -11.77459  -4.87527  -6.21145   0.78551  27.19366  34.09298  27.69944  -0.42330
                         -0.47520  -0.07272                      27.69521  -0.42126

Timing (quasiparticle equation):   0.43691

Timing:       127
