########################
######### SPEX #########
########################
Version 05.00  (Sep  5, 2019)
Execution time: Jan 18, 2020  17:57:37
Hostname: Ontology
MPI: 3,1


### subroutine: getinput ###

Basic parameters:
  Number of spins            =  1
            centers          =  4
            types            =  2
            equivalent atoms =  2  2
  Lattice parameter =      1.00000
  Lattice vectors   =      3.01411  -5.22060   0.00000
                           3.01411   5.22060   0.00000
                           0.00000   0.00000   9.80579
  Unit-cell volume  =    308.59778
  Reciprocal cutoff =      4.60000

Unit-cell geometry:
  # Ty  El              Coord.
  1  1  Ga   0.33333  -0.33333   0.00000
  2  1  Ga  -0.33333   0.33333   0.50000
  3  2  N    0.33333  -0.33333  -0.37700
  4  2  N   -0.33333   0.33333   0.12300

Symmetry information:
  Number of symmetry operations = 24
   #  Det           Axis           Angle   Syp  Inv
   1    1     --     --     --      --     Yes   1
   2   -1    1.00  -0.58  -0.00   180.00   No    2
   3   -1    1.00   0.58  -0.00   180.00   No    3
   4    1    0.00   0.00   1.00   120.00   Yes   9
   5    1    0.00   0.00   1.00   180.00   No    5
   6   -1    0.58   1.00  -0.00   180.00   Yes   6
   7   -1    1.00  -0.00  -0.00   180.00   Yes   7
   8    1    0.00   0.00   1.00    60.00   No   11
   9    1   -0.00  -0.00  -1.00   120.00   Yes   4
  10   -1   -0.00   1.00  -0.00   180.00   No   10
  11    1   -0.00  -0.00  -1.00    60.00   No    8
  12   -1   -0.58   1.00  -0.00   180.00   Yes  12
  13 - 24  Time reversal symmetries

##################
### Input file ###
##################
BZ       4 4 4
JOB      GW +:(1-30)
MPIKPT   
RESTART  
NBAND    200
KPT      +=(.14444,.14444,0)


Info: Simpson and Lagrange integration is used.

Radial mesh and basis functions:
  Number of radial grid points:       759  429
  Number of radial basis functions:    19   18
  Angular momentum quantum number:      8    6
  Maximal index:                        3

Core states:
  Atom type  1  (Ga)
  nl      Energy
  1s  -375.34991
  2s   -45.88297
  3s    -4.96076
  2p   -39.88207
  3p    -3.15226
  Atom type  2  (N )
  nl      Energy
  1s   -13.54409
  Number of valence electrons:   36

Average Coulomb potential: -0.35487  ( -9.65657 eV )

Read wavefunctions from harddisc... done   ( Timing:    0.29 )

Maximal energy difference in deg. subspaces: 9.2E-14
Minimal energy difference between subspaces: 6.7E-06

Wave functions:
  Number of bands:             198 -  200  (  200 )
            k points (IBZ):     64  (  12 /  30 )
            G vectors:         757
  k points of IBZ:
    1  (0.00000,0.00000,0.00000)  [ 0.00000, 0.00000, 0.00000 ]
    2  (0.00000,0.00000,0.25000)  [ 0.00000, 0.00000, 0.02550 ]
    3  (0.00000,0.00000,0.50000)  [ 0.00000, 0.00000, 0.05099 ]
    4  (0.00000,0.25000,0.00000)  [ 0.04147, 0.02394, 0.00000 ]
    5  (0.00000,0.25000,0.25000)  [ 0.04147, 0.02394, 0.02550 ]
    6  (0.00000,0.25000,0.50000)  [ 0.04147, 0.02394, 0.05099 ]
    7  (0.00000,0.50000,0.00000)  [ 0.08294, 0.04789, 0.00000 ]
    8  (0.00000,0.50000,0.25000)  [ 0.08294, 0.04789, 0.02550 ]
    9  (0.00000,0.50000,0.50000)  [ 0.08294, 0.04789, 0.05099 ]
   10  (0.25000,0.25000,0.00000)  [ 0.08294, 0.00000, 0.00000 ]
   11  (0.25000,0.25000,0.25000)  [ 0.08294, 0.00000, 0.02550 ]
   12  (0.25000,0.25000,0.50000)  [ 0.08294, 0.00000, 0.05099 ]
  k points of EIBZ (shifted set):
   65  (0.14444,0.14444,0.00000)  [ 0.04792, 0.00000, 0.00000 ]
   66  (0.14444,0.14444,0.25000)  [ 0.04792, 0.00000, 0.02550 ]
   67  (0.14444,0.14444,0.50000)  [ 0.04792, 0.00000, 0.05099 ]
   68  (0.14444,0.39444,0.00000)  [ 0.08939, 0.02394, 0.00000 ]
   69  (0.14444,0.39444,0.25000)  [ 0.08939, 0.02394, 0.02550 ]
   70  (0.14444,0.39444,0.50000)  [ 0.08939, 0.02394, 0.05099 ]
   71  (0.14444,0.64444,0.00000)  [ 0.13086, 0.04789, 0.00000 ]
   72  (0.14444,0.64444,0.25000)  [ 0.13086, 0.04789, 0.02550 ]
   73  (0.14444,0.64444,0.50000)  [ 0.13086, 0.04789, 0.05099 ]
   74  (0.14444,0.89444,0.00000)  [ 0.17234, 0.07183, 0.00000 ]
   75  (0.14444,0.89444,0.25000)  [ 0.17234, 0.07183, 0.02550 ]
   76  (0.14444,0.89444,0.50000)  [ 0.17234, 0.07183, 0.05099 ]
   77  (0.39444,0.39444,0.00000)  [ 0.13086, 0.00000, 0.00000 ]
   78  (0.39444,0.39444,0.25000)  [ 0.13086, 0.00000, 0.02550 ]
   79  (0.39444,0.39444,0.50000)  [ 0.13086, 0.00000, 0.05099 ]
   80  (0.39444,0.64444,0.00000)  [ 0.17234, 0.02394, 0.00000 ]
   81  (0.39444,0.64444,0.25000)  [ 0.17234, 0.02394, 0.02550 ]
   82  (0.39444,0.64444,0.50000)  [ 0.17234, 0.02394, 0.05099 ]
   83  (0.39444,0.89444,0.00000)  [ 0.21381, 0.04789, 0.00000 ]
   84  (0.39444,0.89444,0.25000)  [ 0.21381, 0.04789, 0.02550 ]
   85  (0.39444,0.89444,0.50000)  [ 0.21381, 0.04789, 0.05099 ]
   86  (0.64444,0.64444,0.00000)  [ 0.21381, 0.00000, 0.00000 ]
   87  (0.64444,0.64444,0.25000)  [ 0.21381, 0.00000, 0.02550 ]
   88  (0.64444,0.64444,0.50000)  [ 0.21381, 0.00000, 0.05099 ]
   89  (0.64444,0.89444,0.00000)  [ 0.25528, 0.02394, 0.00000 ]
   90  (0.64444,0.89444,0.25000)  [ 0.25528, 0.02394, 0.02550 ]
   91  (0.64444,0.89444,0.50000)  [ 0.25528, 0.02394, 0.05099 ]
   92  (0.89444,0.89444,0.00000)  [ 0.29675, 0.00000, 0.00000 ]
   93  (0.89444,0.89444,0.25000)  [ 0.29675, 0.00000, 0.02550 ]
   94  (0.89444,0.89444,0.50000)  [ 0.29675, 0.00000, 0.05099 ]

Generate wavefunctions at equivalent k points... done   ( Timing:   0.26 )

Size of array cpw:   209.8 MB
Size of array cmt:   260.9 MB

The system is not a metal.
The Fermi energy is placed in the center of the band gap.
KS energy gap:    0.07059528 Ha   (  1.92099521 eV )
Fermi energy:     0.29316457 Ha   (  7.97741378 eV )
Maximal energy:   5.58544674 Ha
Electron count error of the shifted k-point set:  0.0000000000000000

Wave-function checksum: -7.997028878481E-02


### subroutine: checkinput ###

Overlap <core|core>
Atom type  1
1s  1.000000
2s -0.000000  1.000000
3s  0.000000 -0.000001  0.999961
2p  0.999418
3p -0.000329  0.999458
Atom type  2
1s  0.999983

Overlap <core|basis>
Atom type  1
         u(s)    udot(s)
1s  0.000000  0.000000
2s  0.000001  0.000000
3s  0.004767 -0.007551
         u(p)    udot(p)
2p -0.000106 -0.000031
3p  0.017150 -0.021254
Atom type  2
         u(s)    udot(s)
1s  0.003209 -0.002046

Average overlap <core|val>
Atom type  1
1s  0.000000
2s  0.000000
3s  0.000679
2p  0.000010  0.000010  0.000010
3p  0.002208  0.002205  0.002208
Atom type  2
1s  0.000234

Maximum overlap <core|val> at (band/kpoint)
Atom type  1
1s  0.000000 (033/ 001)
2s  0.000001 (033/ 001)
3s  0.004367 (156/ 003)
2p  0.000069 (025/ 003)  0.000064 (024/ 001)  0.000067 (026/ 003)
3p  0.011562 (124/ 003)  0.014817 (111/ 001)  0.012086 (124/ 003)
Atom type  2
1s  0.001654 (002/ 110)

Overlap <basis|basis>
Atom type  1
   u(s)  1.000000
udot(s) -0.000000  0.129862
   u(p)  1.000000
udot(p) -0.000000  0.075237
   u(d)  1.000000
udot(d)  0.000000  0.733838
 ulo(d)  0.410292 -0.767526  1.000000
   u(f)  1.000000
udot(f)  0.000000  0.020278
   u(g)  1.000000
udot(g)  0.000000  0.006703
   u(h)  1.000000
udot(h) -0.000000  0.003149
   u(i)  1.000000
udot(i) -0.000000  0.001726
   u(j)  1.000000
udot(j) -0.000000  0.001039
   u(k)  1.000000
udot(k)  0.000000  0.000667
Atom type  2
   u(s)  1.000000
udot(s) -0.000000  0.023146
   u(p)  1.000000
udot(p)  0.000000  0.036192
   u(d)  1.000000
udot(d)  0.000000  0.003612
   u(f)  1.000000
udot(f) -0.000000  0.001183
   u(g)  1.000000
udot(g)  0.000000  0.000520
   u(h)  1.000000
udot(h) -0.000000  0.000271
   u(i)  1.000000
udot(i) -0.000000  0.000157


### subroutine: mixedbasis ( Mode: vv ) ###

Mixed basis
  Plane-wave basis:
    Number of unique G vectors:   365
    Maximal number of G vectors:  233

  MT basis read in from spex.mb (mode: vv).
    Total number of product-basis functions:  264



##### Job index:  1 #####


### subroutine: correlation ###

< GW self-energy >
Calculate periodic function...done   ( Timing:    0.04 )

=========

K point (   1 ):   0.00000   0.00000   0.00000

Coulomb matrix read from spex.cor
Inverse dielectric matrices read from spex.cor
Invert dielectric tensor... done   ( Timing:    0.02 )
Hermiticity of transformed Coulomb matrix: 5.1E-11

Add contribution to self-energy... done
                               Timings
  MT wave-func. products:      1.52446
  PW wave-func. products:      0.42187
  Matrix-vector products:      2.57037
  Transformations:             0.27263
  Exchange self-energy:        0.16143
  Frequency integration:       0.06139
  Tetrahedron weights:         0.00000
  Gamma-point correction:      0.39629
  MPI idle time:               0.02926      0.02926
  Other:                       0.19191
  ------------------------------------
  Total:                       5.62961

=========

K point (   2 ):   0.00000   0.00000   0.25000

Coulomb matrix read from spex.cor
Inverse dielectric matrices read from spex.cor
Hermiticity of transformed Coulomb matrix: 5.9E-10

Add contribution to self-energy... done
                               Timings
  MT wave-func. products:      1.38973
  PW wave-func. products:      0.34662
  Matrix-vector products:      2.31911
  Transformations:             0.26195
  Exchange self-energy:        0.12032
  Frequency integration:       0.03197
  Tetrahedron weights:         0.00000
  MPI idle time:               0.02006      0.02006
  Other:                       0.13043
  ------------------------------------
  Total:                       4.62019

=========

K point (   3 ):   0.00000   0.00000   0.50000

Coulomb matrix read from spex.cor
Inverse dielectric matrices read from spex.cor
Hermiticity of transformed Coulomb matrix: 1.8E-10

Add contribution to self-energy... done
                               Timings
  MT wave-func. products:      1.46644
  PW wave-func. products:      0.41672
  Matrix-vector products:      2.31281
  Transformations:             0.27522
  Exchange self-energy:        0.13058
  Frequency integration:       0.02160
  Tetrahedron weights:         0.00000
  MPI idle time:               0.00002      0.01527
  Other:                       0.15072
  ------------------------------------
  Total:                       4.77412

=========

K point (   4 ):   0.00000   0.25000   0.00000

Coulomb matrix read from spex.cor
Inverse dielectric matrices read from spex.cor
Hermiticity of transformed Coulomb matrix: 8.5E-11

Add contribution to self-energy... done
                               Timings
  MT wave-func. products:      2.74477
  PW wave-func. products:      0.69485
  Matrix-vector products:      6.80033
  Transformations:             0.85840
  Exchange self-energy:        0.16575
  Frequency integration:       0.09714
  Tetrahedron weights:         0.00000
  MPI idle time:               0.01805      0.01912
  Other:                       0.61073
  ------------------------------------
  Total:                      11.99001

=========

K point (   5 ):   0.00000   0.25000   0.25000

Coulomb matrix read from spex.cor
Inverse dielectric matrices read from spex.cor
Hermiticity of transformed Coulomb matrix: 9.7E-11

Add contribution to self-energy... done
                               Timings
  MT wave-func. products:      2.38918
  PW wave-func. products:      0.67374
  Matrix-vector products:      6.17617
  Transformations:             0.81516
  Exchange self-energy:        0.15034
  Frequency integration:       0.11522
  Tetrahedron weights:         0.00000
  MPI idle time:               0.02339      0.02339
  Other:                       0.45256
  ------------------------------------
  Total:                      10.79576

=========

K point (   6 ):   0.00000   0.25000   0.50000

Coulomb matrix read from spex.cor
Inverse dielectric matrices read from spex.cor
Hermiticity of transformed Coulomb matrix: 9.8E-11

Add contribution to self-energy... done
                               Timings
  MT wave-func. products:      2.65335
  PW wave-func. products:      0.68241
  Matrix-vector products:      6.51923
  Transformations:             0.80903
  Exchange self-energy:        0.18599
  Frequency integration:       0.11982
  Tetrahedron weights:         0.00000
  MPI idle time:               0.01032      0.01093
  Other:                       0.49557
  ------------------------------------
  Total:                      11.47573

=========

K point (   7 ):   0.00000   0.50000   0.00000

Coulomb matrix read from spex.cor
Inverse dielectric matrices read from spex.cor
Hermiticity of transformed Coulomb matrix: 1.0E-10

Add contribution to self-energy... done
                               Timings
  MT wave-func. products:      2.38301
  PW wave-func. products:      0.60809
  Matrix-vector products:      4.44682
  Transformations:             0.58250
  Exchange self-energy:        0.15619
  Frequency integration:       0.08229
  Tetrahedron weights:         0.00000
  MPI idle time:               0.01390      0.01751
  Other:                       0.31078
  ------------------------------------
  Total:                       8.58358

=========

K point (   8 ):   0.00000   0.50000   0.25000

Coulomb matrix read from spex.cor
Inverse dielectric matrices read from spex.cor
Hermiticity of transformed Coulomb matrix: 5.3E-11

Add contribution to self-energy... done
                               Timings
  MT wave-func. products:      2.05380
  PW wave-func. products:      0.55949
  Matrix-vector products:      4.31448
  Transformations:             0.51225
  Exchange self-energy:        0.13612
  Frequency integration:       0.16220
  Tetrahedron weights:         0.00000
  MPI idle time:               0.02091      0.02846
  Other:                       0.27262
  ------------------------------------
  Total:                       8.03188

=========

K point (   9 ):   0.00000   0.50000   0.50000

Coulomb matrix read from spex.cor
Inverse dielectric matrices read from spex.cor
Hermiticity of transformed Coulomb matrix: 4.1E-11

Add contribution to self-energy... done
                               Timings
  MT wave-func. products:      2.19524
  PW wave-func. products:      0.53156
  Matrix-vector products:      4.57053
  Transformations:             0.49639
  Exchange self-energy:        0.13173
  Frequency integration:       0.10334
  Tetrahedron weights:         0.00000
  MPI idle time:               0.00029      0.01690
  Other:                       0.43518
  ------------------------------------
  Total:                       8.46427

=========

K point (  10 ):   0.25000   0.25000   0.00000

Coulomb matrix read from spex.cor
Inverse dielectric matrices read from spex.cor
Hermiticity of transformed Coulomb matrix: 3.6E-11

Add contribution to self-energy... done
                               Timings
  MT wave-func. products:      3.22167
  PW wave-func. products:      0.89024
  Matrix-vector products:      8.34583
  Transformations:             1.08752
  Exchange self-energy:        0.22780
  Frequency integration:       0.18710
  Tetrahedron weights:         0.00000
  MPI idle time:               0.02236      0.02236
  Other:                       0.50535
  ------------------------------------
  Total:                      14.48788

=========

K point (  11 ):   0.25000   0.25000   0.25000

Coulomb matrix read from spex.cor
Inverse dielectric matrices read from spex.cor
Hermiticity of transformed Coulomb matrix: 5.4E-11

Add contribution to self-energy... done
                               Timings
  MT wave-func. products:      3.35397
  PW wave-func. products:      0.92062
  Matrix-vector products:      8.94563
  Transformations:             1.23127
  Exchange self-energy:        0.22946
  Frequency integration:       0.15312
  Tetrahedron weights:         0.00000
  MPI idle time:               0.02171      0.03296
  Other:                       0.65806
  ------------------------------------
  Total:                      15.51383

=========

K point (  12 ):   0.25000   0.25000   0.50000

Coulomb matrix read from spex.cor
Inverse dielectric matrices read from spex.cor
Hermiticity of transformed Coulomb matrix: 6.5E-11

Add contribution to self-energy... done
                               Timings
  MT wave-func. products:      3.29952
  PW wave-func. products:      0.96139
  Matrix-vector products:     13.92685
  Transformations:             1.15171
  Exchange self-energy:        0.32403
  Frequency integration:       0.26340
  Tetrahedron weights:         0.00000
  MPI idle time:               0.05236      0.06503
  Other:                       0.75275
  ------------------------------------
  Total:                      20.73200


### subroutine: exchange_core ###

        k point       band      exchange (core contribution)
  (0.144,0.144,0.000)   1     -3.3719874
  (0.144,0.144,0.000)   2     -8.7510245
  (0.144,0.144,0.000)   3    -17.8612829
  (0.144,0.144,0.000)   4    -17.8835141
  (0.144,0.144,0.000)   5    -18.0311723
  (0.144,0.144,0.000)   6    -17.8886003
  (0.144,0.144,0.000)   7    -18.3552271
  (0.144,0.144,0.000)   8    -18.4649646
  (0.144,0.144,0.000)   9    -17.0114600
  (0.144,0.144,0.000)  10    -18.4613627
  (0.144,0.144,0.000)  11    -17.9220538
  (0.144,0.144,0.000)  12    -11.7661808
  (0.144,0.144,0.000)  13     -1.4656713
  (0.144,0.144,0.000)  14     -1.7842141
  (0.144,0.144,0.000)  15     -2.3504836
  (0.144,0.144,0.000)  16     -1.8151365
  (0.144,0.144,0.000)  17     -2.0193680
  (0.144,0.144,0.000)  18     -1.9476370
  (0.144,0.144,0.000)  19     -1.7645436
  (0.144,0.144,0.000)  20     -2.1332812
  (0.144,0.144,0.000)  21     -1.5010747
  (0.144,0.144,0.000)  22     -1.8561178
  (0.144,0.144,0.000)  23     -1.9553847
  (0.144,0.144,0.000)  24     -1.6342487
  (0.144,0.144,0.000)  25     -1.8330641
  (0.144,0.144,0.000)  26     -2.0029954
  (0.144,0.144,0.000)  27     -1.4219064
  (0.144,0.144,0.000)  28     -1.8254861
  (0.144,0.144,0.000)  29     -1.4920966
  (0.144,0.144,0.000)  30     -1.1333338
Timing:   0.09




### subroutine: quasiparticle ###

Number of mesh points even: No constraint will be used.

List of k points
    0   0.14444   0.14444   0.00000  (additional)



#####################
### K POINT:    0 ###
#####################


--- DIAGONAL ELEMENTS [eV] ---

 Bd       vxc    sigmax    sigmac         Z        KS        HF          GW lin/dir
  1 -19.82245 -29.89085   8.28829   0.73491  -8.46024 -18.52864  -9.68754   0.90883
                          1.05002  -0.07706                      -9.68522   0.88230
  2 -28.71337 -40.13291   8.85977   0.72463  -7.94657 -19.36611  -9.78034   0.51970
                          0.59086  -0.03576                      -9.72130   0.49849
  3 -42.44589 -55.75133   9.50011   0.73698  -6.37179 -19.67723  -9.17519   0.10985
                          0.06904  -0.01550                      -9.07478   0.13572
  4 -42.49803 -55.82284   9.51785   0.73705  -6.36668 -19.69149  -9.17144   0.11397
                          0.07249  -0.01590                      -9.07139   0.13966
  5 -42.70308 -56.03527   9.49752   0.73844  -6.29830 -19.63050  -9.12908   0.10064
                          0.06181  -0.01434                      -9.02708   0.12646
  6 -42.47646 -55.76894   9.48767   0.73778  -6.27947 -19.57194  -9.08546   0.11248
                          0.07129  -0.01574                      -8.98567   0.13814
  7 -43.16615 -56.50789   9.43300   0.74254  -6.20375 -19.54549  -9.10587   0.05649
                          0.02952  -0.00884                      -8.99704   0.08088
  8 -43.38108 -56.76426   9.47650   0.74213  -6.15738 -19.54056  -9.05633   0.06275
                          0.03374  -0.00965                      -8.94846   0.08758
  9 -41.05331 -54.04869   9.34592   0.73589  -6.13674 -19.13211  -8.81986   0.16349
                          0.11397  -0.02182                      -8.73072   0.18775
 10 -43.36774 -56.73288   9.45873   0.74245  -6.13392 -19.49906  -9.03395   0.06123
                          0.03275  -0.00945                      -8.92597   0.08602
 11 -42.53426 -55.73507   9.40415   0.74056  -6.03449 -19.23531  -8.84521   0.10259
                          0.06505  -0.01433                      -8.74619   0.12665
 12 -33.62386 -44.82228   8.56113   0.73639  -4.46034 -15.65875  -6.38032   0.42656
                          0.35897  -0.06151                      -6.36856   0.42686
 13 -15.18163 -20.49650   4.10045   0.73733   0.82028  -4.49460  -0.07387   0.07125
                          0.06316  -0.02032                      -0.06258   0.07438
 14 -16.74535 -21.38658   3.48822   0.75983   3.38416  -1.25706   2.50812   0.01386
                          0.00989  -0.00550                       2.51777   0.01546
 15 -18.16280 -22.67622   3.42804   0.76189   3.86925  -0.64418   3.04234   0.01015
                          0.00658  -0.00473                       3.05051   0.01180
 16 -17.99596 -22.03313   3.11697   0.76953   5.01019   0.97303   4.30208   0.00263
                          0.00154  -0.00157                       4.30759   0.00318
 17 -19.22789 -22.99465   2.96847   0.77404   6.26549   2.49873   5.64758   0.00070
                          0.00044  -0.00044                       5.65131   0.00087
 18 -19.18068 -22.89421   2.94562   0.77338   6.35856   2.64504   5.76468   0.00058
                          0.00038  -0.00037                       5.76815   0.00072
 19 -16.29546 -11.28798  -3.97211   0.79024  11.50968  16.51716  12.32788  -0.00105
                          0.00304  -0.00334                      12.32276  -0.00345
 20 -16.34160 -10.42073  -4.59796   0.79310  13.59932  19.52018  14.64848  -0.01096
                         -0.00460  -0.00553                      14.63859  -0.01418
 21 -13.83774  -8.34090  -4.67348   0.79504  14.73845  20.23528  15.39293  -0.01747
                         -0.01319  -0.00848                      15.38883  -0.01872
 22 -13.87050  -8.31282  -4.63111   0.80754  14.87272  20.43040  15.62087  -0.01710
                         -0.01236  -0.00769                      15.61596  -0.01854
 23 -13.95281  -7.94056  -5.07492   0.79782  17.33932  23.35157  18.08650  -0.04751
                         -0.04096  -0.01582                      18.08111  -0.04925
 24 -13.96585  -7.71144  -5.25661   0.78949  17.34835  23.60275  18.13532  -0.05316
                         -0.04567  -0.01715                      18.12913  -0.05528
 25 -15.01622  -8.34686  -5.49501   0.77736  18.13564  24.80501  19.04727  -0.07221
                         -0.06155  -0.02075                      19.03820  -0.07539
 26 -14.56626  -7.90480  -5.54298   0.78505  20.04621  26.70768  20.92169  -0.10543
                         -0.09595  -0.02691                      20.91354  -0.10814
 27 -12.71367  -6.47073  -5.54695   0.78558  20.83364  27.07659  21.37601  -0.12802
                         -0.13395  -0.03274                      21.37266  -0.12850
 28 -14.05392  -7.35789  -5.70809   0.78052  20.98860  27.68463  21.75551  -0.13287
                         -0.12901  -0.03257                      21.74885  -0.13468
 29 -12.40832  -5.63210  -6.14969   0.77958  25.87647  32.65269  26.33933  -0.34868
                         -0.39530  -0.06466                      26.33589  -0.34710
 30 -11.14525  -4.52470  -6.14002   0.78344  25.96369  32.58424  26.31252  -0.35507
                         -0.41208  -0.06707                      26.31041  -0.35330

Timing (quasiparticle equation):   0.43694

Timing:       127
