########################
######### SPEX #########
########################
Version 05.00  (Sep  5, 2019)
Execution time: Jan 17, 2020  22:02:42
Hostname: login18-1.hpc.itc.rwth-aachen.de
MPI: 1,1


### subroutine: getinput ###

Basic parameters:
  Number of spins            =  1
            centers          =  4
            types            =  2
            equivalent atoms =  2  2
  Lattice parameter =      1.00000
  Lattice vectors   =      3.01411  -5.22060   0.00000
                           3.01411   5.22060   0.00000
                           0.00000   0.00000   9.80579
  Unit-cell volume  =    308.59778
  Reciprocal cutoff =      4.60000

Unit-cell geometry:
  # Ty  El              Coord.
  1  1  Ga   0.33333  -0.33333   0.00000
  2  1  Ga  -0.33333   0.33333   0.50000
  3  2  N    0.33333  -0.33333  -0.37700
  4  2  N   -0.33333   0.33333   0.12300

Symmetry information:
  Number of symmetry operations = 24
   #  Det           Axis           Angle   Syp  Inv
   1    1     --     --     --      --     Yes   1
   2   -1    1.00  -0.58   0.00   180.00   No    2
   3   -1    1.00   0.58   0.00   180.00   No    3
   4    1    0.00   0.00   1.00   120.00   Yes   9
   5    1    0.00   0.00   1.00   180.00   No    5
   6   -1    0.58   1.00   0.00   180.00   Yes   6
   7   -1    1.00   0.00   0.00   180.00   Yes   7
   8    1    0.00   0.00   1.00    60.00   No   11
   9    1    0.00   0.00  -1.00   120.00   Yes   4
  10   -1    0.00   1.00   0.00   180.00   No   10
  11    1    0.00   0.00  -1.00    60.00   No    8
  12   -1   -0.58   1.00   0.00   180.00   Yes  12
  13 - 24  Time reversal symmetries

##################
### Input file ###
##################
BZ       4 4 4
JOB      GW +:(1-10)
NBAND    200
RESTART  
KPT      +=(.76923,1.00000,0)
 
#  k point is converted from (0.76923,1.00000,0.00000) to (0.76923,0.00000,0.00000)

Info: Simpson and Lagrange integration is used.

Radial mesh and basis functions:
  Number of radial grid points:       759  429
  Number of radial basis functions:    19   18
  Angular momentum quantum number:      8    6
  Maximal index:                        3

Core states:
  Atom type  1  (Ga)
  nl      Energy
  1s  -375.34991
  2s   -45.88297
  3s    -4.96076
  2p   -39.88207
  3p    -3.15226
  Atom type  2  (N )
  nl      Energy
  1s   -13.54409
  Number of valence electrons:   36

Average Coulomb potential: -0.35487  ( -9.65657 eV )

Read wavefunctions from harddisc... done   ( Timing:    0.21 )

Maximal energy difference in deg. subspaces: 3.6E-12
Minimal energy difference between subspaces: 3.1E-06

Wave functions:
  Number of bands:             198 -  200  (  200 )
            k points (IBZ):     64  (  12 /  30 )
            G vectors:         721
  k points of IBZ:
    1  (0.00000,0.00000,0.00000)  [ 0.00000, 0.00000, 0.00000 ]
    2  (0.00000,0.00000,0.25000)  [ 0.00000, 0.00000, 0.02550 ]
    3  (0.00000,0.00000,0.50000)  [ 0.00000, 0.00000, 0.05099 ]
    4  (0.00000,0.25000,0.00000)  [ 0.04147, 0.02394, 0.00000 ]
    5  (0.00000,0.25000,0.25000)  [ 0.04147, 0.02394, 0.02550 ]
    6  (0.00000,0.25000,0.50000)  [ 0.04147, 0.02394, 0.05099 ]
    7  (0.00000,0.50000,0.00000)  [ 0.08294, 0.04789, 0.00000 ]
    8  (0.00000,0.50000,0.25000)  [ 0.08294, 0.04789, 0.02550 ]
    9  (0.00000,0.50000,0.50000)  [ 0.08294, 0.04789, 0.05099 ]
   10  (0.25000,0.25000,0.00000)  [ 0.08294, 0.00000, 0.00000 ]
   11  (0.25000,0.25000,0.25000)  [ 0.08294, 0.00000, 0.02550 ]
   12  (0.25000,0.25000,0.50000)  [ 0.08294, 0.00000, 0.05099 ]
  k points of EIBZ (shifted set):
   65  (0.76923,0.00000,0.00000)  [ 0.12760,-0.07367, 0.00000 ]
   66  (0.76923,0.00000,0.25000)  [ 0.12760,-0.07367, 0.02550 ]
   67  (0.76923,0.00000,0.50000)  [ 0.12760,-0.07367, 0.05099 ]
   68  (0.76923,0.25000,0.00000)  [ 0.16908,-0.04973, 0.00000 ]
   69  (0.76923,0.25000,0.25000)  [ 0.16908,-0.04973, 0.02550 ]
   70  (0.76923,0.25000,0.50000)  [ 0.16908,-0.04973, 0.05099 ]
   71  (0.76923,0.50000,0.00000)  [ 0.21055,-0.02579, 0.00000 ]
   72  (0.76923,0.50000,0.25000)  [ 0.21055,-0.02579, 0.02550 ]
   73  (0.76923,0.50000,0.50000)  [ 0.21055,-0.02579, 0.05099 ]
   74  (0.76923,0.75000,0.00000)  [ 0.25202,-0.00184, 0.00000 ]
   75  (0.76923,0.75000,0.25000)  [ 0.25202,-0.00184, 0.02550 ]
   76  (0.76923,0.75000,0.50000)  [ 0.25202,-0.00184, 0.05099 ]
   77  (0.01923,0.00000,0.00000)  [ 0.00319,-0.00184, 0.00000 ]
   78  (0.01923,0.00000,0.25000)  [ 0.00319,-0.00184, 0.02550 ]
   79  (0.01923,0.00000,0.50000)  [ 0.00319,-0.00184, 0.05099 ]
   80  (0.01923,0.25000,0.00000)  [ 0.04466, 0.02210, 0.00000 ]
   81  (0.01923,0.25000,0.25000)  [ 0.04466, 0.02210, 0.02550 ]
   82  (0.01923,0.25000,0.50000)  [ 0.04466, 0.02210, 0.05099 ]
   83  (0.01923,0.50000,0.00000)  [ 0.08613, 0.04605, 0.00000 ]
   84  (0.01923,0.50000,0.25000)  [ 0.08613, 0.04605, 0.02550 ]
   85  (0.01923,0.50000,0.50000)  [ 0.08613, 0.04605, 0.05099 ]
   86  (0.26923,0.00000,0.00000)  [ 0.04466,-0.02579, 0.00000 ]
   87  (0.26923,0.00000,0.25000)  [ 0.04466,-0.02579, 0.02550 ]
   88  (0.26923,0.00000,0.50000)  [ 0.04466,-0.02579, 0.05099 ]
   89  (0.26923,0.25000,0.00000)  [ 0.08613,-0.00184, 0.00000 ]
   90  (0.26923,0.25000,0.25000)  [ 0.08613,-0.00184, 0.02550 ]
   91  (0.26923,0.25000,0.50000)  [ 0.08613,-0.00184, 0.05099 ]
   92  (0.51923,0.00000,0.00000)  [ 0.08613,-0.04973, 0.00000 ]
   93  (0.51923,0.00000,0.25000)  [ 0.08613,-0.04973, 0.02550 ]
   94  (0.51923,0.00000,0.50000)  [ 0.08613,-0.04973, 0.05099 ]

Generate wavefunctions at equivalent k points... done   ( Timing:   0.31 )

Size of array cpw:   209.8 MB
Size of array cmt:   260.9 MB

The system is not a metal.
The Fermi energy is placed in the center of the band gap.
KS energy gap:    0.07059528 Ha   (  1.92099521 eV )
Fermi energy:     0.29316457 Ha   (  7.97741378 eV )
Maximal energy:   5.57248232 Ha
Electron count error of the shifted k-point set:  0.0000000000000000

Wave-function checksum: -1.365594942009E-01


### subroutine: checkinput ###

Overlap <core|core>
Atom type  1
1s  1.000000 
2s -0.000000  1.000000 
3s  0.000000 -0.000001  0.999961 
2p  0.999418 
3p -0.000329  0.999458 
Atom type  2
1s  0.999983 

Overlap <core|basis>
Atom type  1
         u(s)    udot(s)
1s  0.000000  0.000000 
2s  0.000001  0.000000 
3s  0.004767 -0.007551 
         u(p)    udot(p)
2p -0.000106 -0.000031 
3p  0.017150 -0.021254 
Atom type  2
         u(s)    udot(s)
1s  0.003209 -0.002046 

Average overlap <core|val>
Atom type  1
1s  0.000000
2s  0.000000
3s  0.000679
2p  0.000010  0.000010  0.000010
3p  0.002211  0.002206  0.002211
Atom type  2
1s  0.000234

Maximum overlap <core|val> at (band/kpoint)
Atom type  1
1s  0.000000 (022/ 009)
2s  0.000001 (022/ 009)
3s  0.004055 (097/ 094)
2p  0.000060 (025/ 003)  0.000064 (024/ 077)  0.000067 (026/ 003)
3p  0.012494 (122/ 003)  0.014817 (111/ 001)  0.013262 (124/ 003)
Atom type  2
1s  0.001579 (001/ 067)

Overlap <basis|basis>
Atom type  1
   u(s)  1.000000 
udot(s)  0.000000  0.129862 
   u(p)  1.000000 
udot(p) -0.000000  0.075237 
   u(d)  1.000000 
udot(d) -0.000000  0.733838 
 ulo(d)  0.410292 -0.767526  1.000000 
   u(f)  1.000000 
udot(f) -0.000000  0.020278 
   u(g)  1.000000 
udot(g) -0.000000  0.006703 
   u(h)  1.000000 
udot(h)  0.000000  0.003149 
   u(i)  1.000000 
udot(i) -0.000000  0.001726 
   u(j)  1.000000 
udot(j)  0.000000  0.001039 
   u(k)  1.000000 
udot(k) -0.000000  0.000667 
Atom type  2
   u(s)  1.000000 
udot(s)  0.000000  0.023146 
   u(p)  1.000000 
udot(p)  0.000000  0.036192 
   u(d)  1.000000 
udot(d)  0.000000  0.003612 
   u(f)  1.000000 
udot(f)  0.000000  0.001183 
   u(g)  1.000000 
udot(g)  0.000000  0.000520 
   u(h)  1.000000 
udot(h) -0.000000  0.000271 
   u(i)  1.000000 
udot(i)  0.000000  0.000157 


### subroutine: mixedbasis ( Mode: vv ) ###

Mixed basis
  Plane-wave basis:
    Number of unique G vectors:   338
    Maximal number of G vectors:  233

  MT basis read in from spex.mb (mode: vv).
    Total number of product-basis functions:  264



##### Job index:  1 #####


### subroutine: correlation ###

< GW self-energy >
Calculate periodic function...done   ( Timing:    0.08 )

=========

K point (   1 ):   0.00000   0.00000   0.00000

Coulomb matrix read from spex.cor
Inverse dielectric matrices read from spex.cor 
Invert dielectric tensor... done   ( Timing:    0.02 )
Hermiticity of transformed Coulomb matrix: 6.8E-11

Add contribution to self-energy... done
                               Timings
  MT wave-func. products:      0.11860
  PW wave-func. products:      0.26679
  Matrix-vector products:      0.36694
  Transformations:             0.08619
  Exchange self-energy:        0.07250
  Frequency integration:       0.01848
  Tetrahedron weights:         0.00000
  Gamma-point correction:      1.36741
  MPI idle time:               0.00004      0.00004
  Other:                       0.06480
  ------------------------------------
  Total:                       2.36176

=========

K point (   2 ):   0.00000   0.00000   0.25000

Coulomb matrix read from spex.cor
Inverse dielectric matrices read from spex.cor 
Hermiticity of transformed Coulomb matrix: 8.7E-10

Add contribution to self-energy... done
                               Timings
  MT wave-func. products:      0.11238
  PW wave-func. products:      0.24302
  Matrix-vector products:      0.32407
  Transformations:             0.07977
  Exchange self-energy:        0.05200
  Frequency integration:       0.01749
  Tetrahedron weights:         0.00000
  MPI idle time:               0.00002      0.00002
  Other:                       0.04882
  ------------------------------------
  Total:                       0.87757

=========

K point (   3 ):   0.00000   0.00000   0.50000

Coulomb matrix read from spex.cor
Inverse dielectric matrices read from spex.cor 
Hermiticity of transformed Coulomb matrix: 2.4E-10

Add contribution to self-energy... done
                               Timings
  MT wave-func. products:      0.11616
  PW wave-func. products:      0.24253
  Matrix-vector products:      0.53989
  Transformations:             0.07840
  Exchange self-energy:        0.05029
  Frequency integration:       0.02068
  Tetrahedron weights:         0.00000
  MPI idle time:               0.00004      0.00004
  Other:                       0.05180
  ------------------------------------
  Total:                       1.09979

=========

K point (   4 ):   0.00000   0.25000   0.00000

Coulomb matrix read from spex.cor
Inverse dielectric matrices read from spex.cor 
Hermiticity of transformed Coulomb matrix: 1.5E-10

Add contribution to self-energy... done
                               Timings
  MT wave-func. products:      0.37208
  PW wave-func. products:      0.83287
  Matrix-vector products:      2.19024
  Transformations:             0.32969
  Exchange self-energy:        0.10583
  Frequency integration:       0.07258
  Tetrahedron weights:         0.00000
  MPI idle time:               0.00007      0.00007
  Other:                       0.18162
  ------------------------------------
  Total:                       4.08498

=========

K point (   5 ):   0.00000   0.25000   0.25000

Coulomb matrix read from spex.cor
Inverse dielectric matrices read from spex.cor 
Hermiticity of transformed Coulomb matrix: 1.5E-10

Add contribution to self-energy... done
                               Timings
  MT wave-func. products:      0.36920
  PW wave-func. products:      0.83980
  Matrix-vector products:      2.21284
  Transformations:             0.32157
  Exchange self-energy:        0.10229
  Frequency integration:       0.07154
  Tetrahedron weights:         0.00000
  MPI idle time:               0.00006      0.00006
  Other:                       0.17725
  ------------------------------------
  Total:                       4.09456

=========

K point (   6 ):   0.00000   0.25000   0.50000

Coulomb matrix read from spex.cor
Inverse dielectric matrices read from spex.cor 
Hermiticity of transformed Coulomb matrix: 1.4E-10

Add contribution to self-energy... done
                               Timings
  MT wave-func. products:      0.37421
  PW wave-func. products:      0.85745
  Matrix-vector products:      2.22594
  Transformations:             0.34286
  Exchange self-energy:        0.11026
  Frequency integration:       0.07229
  Tetrahedron weights:         0.00000
  MPI idle time:               0.00005      0.00005
  Other:                       0.18009
  ------------------------------------
  Total:                       4.16315

=========

K point (   7 ):   0.00000   0.50000   0.00000

Coulomb matrix read from spex.cor
Inverse dielectric matrices read from spex.cor 
Hermiticity of transformed Coulomb matrix: 1.3E-10

Add contribution to self-energy... done
                               Timings
  MT wave-func. products:      0.18812
  PW wave-func. products:      0.43501
  Matrix-vector products:      0.65239
  Transformations:             0.15102
  Exchange self-energy:        0.07158
  Frequency integration:       0.03470
  Tetrahedron weights:         0.00000
  MPI idle time:               0.00002      0.00002
  Other:                       0.08960
  ------------------------------------
  Total:                       1.62243

=========

K point (   8 ):   0.00000   0.50000   0.25000

Coulomb matrix read from spex.cor
Inverse dielectric matrices read from spex.cor 
Hermiticity of transformed Coulomb matrix: 7.9E-11

Add contribution to self-energy... done
                               Timings
  MT wave-func. products:      0.19211
  PW wave-func. products:      0.43036
  Matrix-vector products:      0.65355
  Transformations:             0.15527
  Exchange self-energy:        0.07362
  Frequency integration:       0.03564
  Tetrahedron weights:         0.00000
  MPI idle time:               0.00002      0.00002
  Other:                       0.09375
  ------------------------------------
  Total:                       1.63432

=========

K point (   9 ):   0.00000   0.50000   0.50000

Coulomb matrix read from spex.cor
Inverse dielectric matrices read from spex.cor 
Hermiticity of transformed Coulomb matrix: 5.5E-11

Add contribution to self-energy... done
                               Timings
  MT wave-func. products:      0.19900
  PW wave-func. products:      0.43365
  Matrix-vector products:      1.10139
  Transformations:             0.14774
  Exchange self-energy:        0.06608
  Frequency integration:       0.03575
  Tetrahedron weights:         0.00000
  MPI idle time:               0.00005      0.00005
  Other:                       0.09204
  ------------------------------------
  Total:                       2.07570

=========

K point (  10 ):   0.25000   0.25000   0.00000

Coulomb matrix read from spex.cor
Inverse dielectric matrices read from spex.cor 
Hermiticity of transformed Coulomb matrix: 5.5E-11

Add contribution to self-energy... done
                               Timings
  MT wave-func. products:      0.28726
  PW wave-func. products:      0.61869
  Matrix-vector products:      1.51918
  Transformations:             0.24883
  Exchange self-energy:        0.08256
  Frequency integration:       0.05405
  Tetrahedron weights:         0.00000
  MPI idle time:               0.00004      0.00004
  Other:                       0.13688
  ------------------------------------
  Total:                       2.94750

=========

K point (  11 ):   0.25000   0.25000   0.25000

Coulomb matrix read from spex.cor
Inverse dielectric matrices read from spex.cor 
Hermiticity of transformed Coulomb matrix: 8.0E-11

Add contribution to self-energy... done
                               Timings
  MT wave-func. products:      0.30186
  PW wave-func. products:      0.64361
  Matrix-vector products:      1.61499
  Transformations:             0.25291
  Exchange self-energy:        0.08639
  Frequency integration:       0.05458
  Tetrahedron weights:         0.00000
  MPI idle time:               0.00004      0.00004
  Other:                       0.13798
  ------------------------------------
  Total:                       3.09236

=========

K point (  12 ):   0.25000   0.25000   0.50000

Coulomb matrix read from spex.cor
Inverse dielectric matrices read from spex.cor 
Hermiticity of transformed Coulomb matrix: 9.9E-11

Add contribution to self-energy... done
                               Timings
  MT wave-func. products:      0.28734
  PW wave-func. products:      0.65326
  Matrix-vector products:      2.96674
  Transformations:             0.26795
  Exchange self-energy:        0.08757
  Frequency integration:       0.05490
  Tetrahedron weights:         0.00000
  MPI idle time:               0.00004      0.00004
  Other:                       0.13225
  ------------------------------------
  Total:                       4.45005


### subroutine: exchange_core ###

        k point       band      exchange (core contribution)
  (0.769,0.000,0.000)   1     -3.0526069
  (0.769,0.000,0.000)   2     -8.6318394
  (0.769,0.000,0.000)   3    -17.8255267
  (0.769,0.000,0.000)   4    -17.8894121
  (0.769,0.000,0.000)   5    -17.8833855
  (0.769,0.000,0.000)   6    -18.1412857
  (0.769,0.000,0.000)   7    -17.2962403
  (0.769,0.000,0.000)   8    -18.0587846
  (0.769,0.000,0.000)   9    -18.4694134
  (0.769,0.000,0.000)  10    -17.8851433
Timing:   0.13




### subroutine: quasiparticle ###

Number of mesh points even: No constraint will be used.

List of k points
    0   0.76923   0.00000   0.00000  (additional) 



#####################
### K POINT:    0 ###
#####################


--- DIAGONAL ELEMENTS [eV] ---

 Bd       vxc    sigmax    sigmac         Z        KS        HF          GW lin/dir 
  1 -19.26630 -29.26690   8.24812   0.73552  -8.51973 -18.52032  -9.72473   0.92790 
                          1.07554  -0.07807                      -9.72437   0.90159 
  2 -28.51876 -39.91356   8.84009   0.72447  -7.95716 -19.35196  -9.78715   0.52033 
                          0.59476  -0.03501                      -9.72751   0.49865 
  3 -42.39023 -55.69678   9.50330   0.73702  -6.38433 -19.69089  -9.18627   0.11395 
                          0.07258  -0.01590                      -9.08632   0.13956 
  4 -42.50724 -55.83058   9.51727   0.73682  -6.36585 -19.68919  -9.16913   0.11174 
                          0.07052  -0.01571                      -9.06884   0.13763 
  5 -42.45898 -55.74832   9.47872   0.73791  -6.30542 -19.59476  -9.11627   0.10886 
                          0.06841  -0.01532                      -9.01590   0.13454 
  6 -42.92512 -56.29501   9.53587   0.73835  -6.26961 -19.63950  -9.09948   0.10485 
                          0.06526  -0.01478                      -8.99804   0.13049 
  7 -41.47869 -54.57400   9.38305   0.73689  -6.21135 -19.30666  -8.94503   0.14242 
                          0.09648  -0.01921                      -8.85154   0.16700 
  8 -42.68496 -55.94672   9.40325   0.74145  -6.20171 -19.46347  -9.06212   0.07638 
                          0.04482  -0.01118                      -8.95741   0.10055 
  9 -43.37951 -56.74811   9.45527   0.74266  -6.15858 -19.52718  -9.06461   0.05545 
                          0.02870  -0.00872                      -8.95561   0.07993 
 10 -42.43811 -55.64524   9.40114   0.74037  -6.10546 -19.31260  -8.92242   0.10068 
                          0.06332  -0.01414                      -8.82255   0.12502 

Timing (quasiparticle equation):   0.11084

Timing:        34
