########################
######### SPEX #########
########################
Version 05.00  (Sep  5, 2019)
Execution time: Jan 16, 2020  16:46:57
Hostname: login18-1.hpc.itc.rwth-aachen.de
MPI: 1,1


### subroutine: getinput ###

Basic parameters:
  Number of spins            =  1
            centers          =  4
            types            =  2
            equivalent atoms =  2  2
  Lattice parameter =      1.00000
  Lattice vectors   =      3.01411  -5.22060   0.00000
                           3.01411   5.22060   0.00000
                           0.00000   0.00000   9.80579
  Unit-cell volume  =    308.59778
  Reciprocal cutoff =      4.60000

Unit-cell geometry:
  # Ty  El              Coord.
  1  1  Ga   0.33333  -0.33333   0.00000
  2  1  Ga  -0.33333   0.33333   0.50000
  3  2  N    0.33333  -0.33333  -0.37700
  4  2  N   -0.33333   0.33333   0.12300

Symmetry information:
  Number of symmetry operations = 24
   #  Det           Axis           Angle   Syp  Inv
   1    1     --     --     --      --     Yes   1
   2   -1    1.00  -0.58   0.00   180.00   No    2
   3   -1    1.00   0.58   0.00   180.00   No    3
   4    1    0.00   0.00   1.00   120.00   Yes   9
   5    1    0.00   0.00   1.00   180.00   No    5
   6   -1    0.58   1.00   0.00   180.00   Yes   6
   7   -1    1.00   0.00   0.00   180.00   Yes   7
   8    1    0.00   0.00   1.00    60.00   No   11
   9    1    0.00   0.00  -1.00   120.00   Yes   4
  10   -1    0.00   1.00   0.00   180.00   No   10
  11    1    0.00   0.00  -1.00    60.00   No    8
  12   -1   -0.58   1.00   0.00   180.00   Yes  12
  13 - 24  Time reversal symmetries

##################
### Input file ###
##################
BZ       4 4 4
JOB      GW +:(1-10)
NBAND    200
RESTART  
KPT      +=(0,.36538,0)
 

Info: Simpson and Lagrange integration is used.

Radial mesh and basis functions:
  Number of radial grid points:       759  429
  Number of radial basis functions:    19   18
  Angular momentum quantum number:      8    6
  Maximal index:                        3

Core states:
  Atom type  1  (Ga)
  nl      Energy
  1s  -375.34991
  2s   -45.88297
  3s    -4.96076
  2p   -39.88207
  3p    -3.15226
  Atom type  2  (N )
  nl      Energy
  1s   -13.54409
  Number of valence electrons:   36

Average Coulomb potential: -0.35487  ( -9.65657 eV )

Read wavefunctions from harddisc... done   ( Timing:    0.27 )

Maximal energy difference in deg. subspaces: 1.5E-13
Minimal energy difference between subspaces: 2.2E-05

Wave functions:
  Number of bands:             198 -  200  (  200 )
            k points (IBZ):     64  (  12 /  30 )
            G vectors:         736
  k points of IBZ:
    1  (0.00000,0.00000,0.00000)  [ 0.00000, 0.00000, 0.00000 ]
    2  (0.00000,0.00000,0.25000)  [ 0.00000, 0.00000, 0.02550 ]
    3  (0.00000,0.00000,0.50000)  [ 0.00000, 0.00000, 0.05099 ]
    4  (0.00000,0.25000,0.00000)  [ 0.04147, 0.02394, 0.00000 ]
    5  (0.00000,0.25000,0.25000)  [ 0.04147, 0.02394, 0.02550 ]
    6  (0.00000,0.25000,0.50000)  [ 0.04147, 0.02394, 0.05099 ]
    7  (0.00000,0.50000,0.00000)  [ 0.08294, 0.04789, 0.00000 ]
    8  (0.00000,0.50000,0.25000)  [ 0.08294, 0.04789, 0.02550 ]
    9  (0.00000,0.50000,0.50000)  [ 0.08294, 0.04789, 0.05099 ]
   10  (0.25000,0.25000,0.00000)  [ 0.08294, 0.00000, 0.00000 ]
   11  (0.25000,0.25000,0.25000)  [ 0.08294, 0.00000, 0.02550 ]
   12  (0.25000,0.25000,0.50000)  [ 0.08294, 0.00000, 0.05099 ]
  k points of EIBZ (shifted set):
   65  (0.00000,0.36538,0.00000)  [ 0.06061, 0.03499, 0.00000 ]
   66  (0.00000,0.36538,0.25000)  [ 0.06061, 0.03499, 0.02550 ]
   67  (0.00000,0.36538,0.50000)  [ 0.06061, 0.03499, 0.05099 ]
   68  (0.00000,0.61538,0.00000)  [ 0.10208, 0.05894, 0.00000 ]
   69  (0.00000,0.61538,0.25000)  [ 0.10208, 0.05894, 0.02550 ]
   70  (0.00000,0.61538,0.50000)  [ 0.10208, 0.05894, 0.05099 ]
   71  (0.00000,0.86538,0.00000)  [ 0.14355, 0.08288, 0.00000 ]
   72  (0.00000,0.86538,0.25000)  [ 0.14355, 0.08288, 0.02550 ]
   73  (0.00000,0.86538,0.50000)  [ 0.14355, 0.08288, 0.05099 ]
   74  (0.00000,0.11538,0.00000)  [ 0.01914, 0.01105, 0.00000 ]
   75  (0.00000,0.11538,0.25000)  [ 0.01914, 0.01105, 0.02550 ]
   76  (0.00000,0.11538,0.50000)  [ 0.01914, 0.01105, 0.05099 ]
   77  (0.25000,0.36538,0.00000)  [ 0.10208, 0.01105, 0.00000 ]
   78  (0.25000,0.36538,0.25000)  [ 0.10208, 0.01105, 0.02550 ]
   79  (0.25000,0.36538,0.50000)  [ 0.10208, 0.01105, 0.05099 ]
   80  (0.25000,0.61538,0.00000)  [ 0.14355, 0.03499, 0.00000 ]
   81  (0.25000,0.61538,0.25000)  [ 0.14355, 0.03499, 0.02550 ]
   82  (0.25000,0.61538,0.50000)  [ 0.14355, 0.03499, 0.05099 ]
   83  (0.25000,0.86538,0.00000)  [ 0.18503, 0.05894, 0.00000 ]
   84  (0.25000,0.86538,0.25000)  [ 0.18503, 0.05894, 0.02550 ]
   85  (0.25000,0.86538,0.50000)  [ 0.18503, 0.05894, 0.05099 ]
   86  (0.25000,0.11538,0.00000)  [ 0.06061,-0.01289, 0.00000 ]
   87  (0.25000,0.11538,0.25000)  [ 0.06061,-0.01289, 0.02550 ]
   88  (0.25000,0.11538,0.50000)  [ 0.06061,-0.01289, 0.05099 ]
   89  (0.50000,0.36538,0.00000)  [ 0.14355,-0.01289, 0.00000 ]
   90  (0.50000,0.36538,0.25000)  [ 0.14355,-0.01289, 0.02550 ]
   91  (0.50000,0.36538,0.50000)  [ 0.14355,-0.01289, 0.05099 ]
   92  (0.50000,0.61538,0.00000)  [ 0.18503, 0.01105, 0.00000 ]
   93  (0.50000,0.61538,0.25000)  [ 0.18503, 0.01105, 0.02550 ]
   94  (0.50000,0.61538,0.50000)  [ 0.18503, 0.01105, 0.05099 ]

Generate wavefunctions at equivalent k points... done   ( Timing:   0.45 )

Size of array cpw:   209.8 MB
Size of array cmt:   260.9 MB

The system is not a metal.
The Fermi energy is placed in the center of the band gap.
KS energy gap:    0.07059528 Ha   (  1.92099521 eV )
Fermi energy:     0.29316457 Ha   (  7.97741378 eV )
Maximal energy:   5.57307583 Ha
Electron count error of the shifted k-point set:  0.0000000000000000

Wave-function checksum: -5.901198847186E-03


### subroutine: checkinput ###

Overlap <core|core>
Atom type  1
1s  1.000000 
2s -0.000000  1.000000 
3s  0.000000 -0.000001  0.999961 
2p  0.999418 
3p -0.000329  0.999458 
Atom type  2
1s  0.999983 

Overlap <core|basis>
Atom type  1
         u(s)    udot(s)
1s  0.000000  0.000000 
2s  0.000001  0.000000 
3s  0.004767 -0.007551 
         u(p)    udot(p)
2p -0.000106 -0.000031 
3p  0.017150 -0.021254 
Atom type  2
         u(s)    udot(s)
1s  0.003209 -0.002046 

Average overlap <core|val>
Atom type  1
1s  0.000000
2s  0.000000
3s  0.000679
2p  0.000010  0.000010  0.000010
3p  0.002209  0.002206  0.002209
Atom type  2
1s  0.000234

Maximum overlap <core|val> at (band/kpoint)
Atom type  1
1s  0.000000 (033/ 001)
2s  0.000001 (033/ 001)
3s  0.003697 (156/ 003)
2p  0.000056 (031/ 079)  0.000064 (024/ 001)  0.000057 (023/ 003)
3p  0.011526 (121/ 003)  0.014817 (111/ 001)  0.011787 (124/ 003)
Atom type  2
1s  0.001620 (001/ 085)

Overlap <basis|basis>
Atom type  1
   u(s)  1.000000 
udot(s) -0.000000  0.129862 
   u(p)  1.000000 
udot(p) -0.000000  0.075237 
   u(d)  1.000000 
udot(d) -0.000000  0.733838 
 ulo(d)  0.410292 -0.767526  1.000000 
   u(f)  1.000000 
udot(f) -0.000000  0.020278 
   u(g)  1.000000 
udot(g) -0.000000  0.006703 
   u(h)  1.000000 
udot(h)  0.000000  0.003149 
   u(i)  1.000000 
udot(i) -0.000000  0.001726 
   u(j)  1.000000 
udot(j) -0.000000  0.001039 
   u(k)  1.000000 
udot(k)  0.000000  0.000667 
Atom type  2
   u(s)  1.000000 
udot(s)  0.000000  0.023146 
   u(p)  1.000000 
udot(p)  0.000000  0.036192 
   u(d)  1.000000 
udot(d)  0.000000  0.003612 
   u(f)  1.000000 
udot(f)  0.000000  0.001183 
   u(g)  1.000000 
udot(g) -0.000000  0.000520 
   u(h)  1.000000 
udot(h) -0.000000  0.000271 
   u(i)  1.000000 
udot(i)  0.000000  0.000157 


### subroutine: mixedbasis ( Mode: vv ) ###

Mixed basis
  Plane-wave basis:
    Number of unique G vectors:   347
    Maximal number of G vectors:  233

  MT basis read in from spex.mb (mode: vv).
    Total number of product-basis functions:  264



##### Job index:  1 #####


### subroutine: correlation ###

< GW self-energy >
Calculate periodic function...done   ( Timing:    0.09 )

=========

K point (   1 ):   0.00000   0.00000   0.00000

Coulomb matrix read from spex.cor
Inverse dielectric matrices read from spex.cor 
Invert dielectric tensor... done   ( Timing:    0.02 )
Hermiticity of transformed Coulomb matrix: 6.8E-11

Add contribution to self-energy... done
                               Timings
  MT wave-func. products:      0.12894
  PW wave-func. products:      0.28104
  Matrix-vector products:      0.38094
  Transformations:             0.09594
  Exchange self-energy:        0.07785
  Frequency integration:       0.02056
  Tetrahedron weights:         0.00000
  Gamma-point correction:      1.51564
  MPI idle time:               0.00004      0.00004
  Other:                       0.06874
  ------------------------------------
  Total:                       2.56968

=========

K point (   2 ):   0.00000   0.00000   0.25000

Coulomb matrix read from spex.cor
Inverse dielectric matrices read from spex.cor 
Hermiticity of transformed Coulomb matrix: 8.7E-10

Add contribution to self-energy... done
                               Timings
  MT wave-func. products:      0.13193
  PW wave-func. products:      0.27269
  Matrix-vector products:      0.35097
  Transformations:             0.09101
  Exchange self-energy:        0.05796
  Frequency integration:       0.02047
  Tetrahedron weights:         0.00000
  MPI idle time:               0.00008      0.00008
  Other:                       0.05456
  ------------------------------------
  Total:                       0.97966

=========

K point (   3 ):   0.00000   0.00000   0.50000

Coulomb matrix read from spex.cor
Inverse dielectric matrices read from spex.cor 
Hermiticity of transformed Coulomb matrix: 2.4E-10

Add contribution to self-energy... done
                               Timings
  MT wave-func. products:      0.13119
  PW wave-func. products:      0.25915
  Matrix-vector products:      0.57876
  Transformations:             0.08630
  Exchange self-energy:        0.05444
  Frequency integration:       0.02063
  Tetrahedron weights:         0.00000
  MPI idle time:               0.00005      0.00005
  Other:                       0.05544
  ------------------------------------
  Total:                       1.18595

=========

K point (   4 ):   0.00000   0.25000   0.00000

Coulomb matrix read from spex.cor
Inverse dielectric matrices read from spex.cor 
Hermiticity of transformed Coulomb matrix: 1.5E-10

Add contribution to self-energy... done
                               Timings
  MT wave-func. products:      0.39140
  PW wave-func. products:      0.86599
  Matrix-vector products:      2.35123
  Transformations:             0.34835
  Exchange self-energy:        0.10903
  Frequency integration:       0.08041
  Tetrahedron weights:         0.00000
  MPI idle time:               0.00006      0.00006
  Other:                       0.19292
  ------------------------------------
  Total:                       4.33940

=========

K point (   5 ):   0.00000   0.25000   0.25000

Coulomb matrix read from spex.cor
Inverse dielectric matrices read from spex.cor 
Hermiticity of transformed Coulomb matrix: 1.5E-10

Add contribution to self-energy... done
                               Timings
  MT wave-func. products:      0.38296
  PW wave-func. products:      0.88929
  Matrix-vector products:      2.38018
  Transformations:             0.36035
  Exchange self-energy:        0.11283
  Frequency integration:       0.08095
  Tetrahedron weights:         0.00000
  MPI idle time:               0.00005      0.00005
  Other:                       0.19449
  ------------------------------------
  Total:                       4.40110

=========

K point (   6 ):   0.00000   0.25000   0.50000

Coulomb matrix read from spex.cor
Inverse dielectric matrices read from spex.cor 
Hermiticity of transformed Coulomb matrix: 1.4E-10

Add contribution to self-energy... done
                               Timings
  MT wave-func. products:      0.38356
  PW wave-func. products:      0.89371
  Matrix-vector products:      2.47212
  Transformations:             0.36439
  Exchange self-energy:        0.11358
  Frequency integration:       0.08119
  Tetrahedron weights:         0.00000
  MPI idle time:               0.00002      0.00002
  Other:                       0.19574
  ------------------------------------
  Total:                       4.50432

=========

K point (   7 ):   0.00000   0.50000   0.00000

Coulomb matrix read from spex.cor
Inverse dielectric matrices read from spex.cor 
Hermiticity of transformed Coulomb matrix: 1.3E-10

Add contribution to self-energy... done
                               Timings
  MT wave-func. products:      0.20819
  PW wave-func. products:      0.48534
  Matrix-vector products:      0.72574
  Transformations:             0.18384
  Exchange self-energy:        0.07725
  Frequency integration:       0.04023
  Tetrahedron weights:         0.00000
  MPI idle time:               0.00004      0.00004
  Other:                       0.10029
  ------------------------------------
  Total:                       1.82093

=========

K point (   8 ):   0.00000   0.50000   0.25000

Coulomb matrix read from spex.cor
Inverse dielectric matrices read from spex.cor 
Hermiticity of transformed Coulomb matrix: 7.9E-11

Add contribution to self-energy... done
                               Timings
  MT wave-func. products:      0.20740
  PW wave-func. products:      0.47025
  Matrix-vector products:      0.71435
  Transformations:             0.18647
  Exchange self-energy:        0.07408
  Frequency integration:       0.04041
  Tetrahedron weights:         0.00000
  MPI idle time:               0.00006      0.00006
  Other:                       0.09990
  ------------------------------------
  Total:                       1.79291

=========

K point (   9 ):   0.00000   0.50000   0.50000

Coulomb matrix read from spex.cor
Inverse dielectric matrices read from spex.cor 
Hermiticity of transformed Coulomb matrix: 5.5E-11

Add contribution to self-energy... done
                               Timings
  MT wave-func. products:      0.21309
  PW wave-func. products:      0.45822
  Matrix-vector products:      1.14618
  Transformations:             0.17754
  Exchange self-energy:        0.07023
  Frequency integration:       0.04010
  Tetrahedron weights:         0.00000
  MPI idle time:               0.00004      0.00004
  Other:                       0.10010
  ------------------------------------
  Total:                       2.20551

=========

K point (  10 ):   0.25000   0.25000   0.00000

Coulomb matrix read from spex.cor
Inverse dielectric matrices read from spex.cor 
Hermiticity of transformed Coulomb matrix: 5.5E-11

Add contribution to self-energy... done
                               Timings
  MT wave-func. products:      0.29860
  PW wave-func. products:      0.65858
  Matrix-vector products:      1.63865
  Transformations:             0.27035
  Exchange self-energy:        0.08774
  Frequency integration:       0.06074
  Tetrahedron weights:         0.00000
  MPI idle time:               0.00007      0.00007
  Other:                       0.14717
  ------------------------------------
  Total:                       3.16188

=========

K point (  11 ):   0.25000   0.25000   0.25000

Coulomb matrix read from spex.cor
Inverse dielectric matrices read from spex.cor 
Hermiticity of transformed Coulomb matrix: 8.0E-11

Add contribution to self-energy... done
                               Timings
  MT wave-func. products:      0.30271
  PW wave-func. products:      0.68131
  Matrix-vector products:      1.73260
  Transformations:             0.27608
  Exchange self-energy:        0.09464
  Frequency integration:       0.06091
  Tetrahedron weights:         0.00000
  MPI idle time:               0.00004      0.00004
  Other:                       0.14802
  ------------------------------------
  Total:                       3.29630

=========

K point (  12 ):   0.25000   0.25000   0.50000

Coulomb matrix read from spex.cor
Inverse dielectric matrices read from spex.cor 
Hermiticity of transformed Coulomb matrix: 9.9E-11

Add contribution to self-energy... done
                               Timings
  MT wave-func. products:      0.29502
  PW wave-func. products:      0.67313
  Matrix-vector products:      3.12461
  Transformations:             0.27679
  Exchange self-energy:        0.09269
  Frequency integration:       0.06012
  Tetrahedron weights:         0.00000
  MPI idle time:               0.00005      0.00005
  Other:                       0.13887
  ------------------------------------
  Total:                       4.66128


### subroutine: exchange_core ###

        k point       band      exchange (core contribution)
  (0.000,0.365,0.000)   1     -5.8001860
  (0.000,0.365,0.000)   2     -9.3034099
  (0.000,0.365,0.000)   3    -17.8138953
  (0.000,0.365,0.000)   4    -17.9473081
  (0.000,0.365,0.000)   5    -18.0752130
  (0.000,0.365,0.000)   6    -18.2319692
  (0.000,0.365,0.000)   7    -18.3425181
  (0.000,0.365,0.000)   8    -18.4051846
  (0.000,0.365,0.000)   9    -18.5662484
  (0.000,0.365,0.000)  10    -18.6958973
Timing:   0.15




### subroutine: quasiparticle ###

Number of mesh points even: No constraint will be used.

List of k points
    0   0.00000   0.36538   0.00000  (additional) 



#####################
### K POINT:    0 ###
#####################


--- DIAGONAL ELEMENTS [eV] ---

 Bd       vxc    sigmax    sigmac         Z        KS        HF          GW lin/dir 
  1 -23.89895 -34.56495   8.53847   0.73100  -8.18147 -18.84748  -9.68963   0.72841 
                          0.83177  -0.05659                      -9.66374   0.69628 
  2 -29.60631 -41.16244   8.91572   0.72264  -7.90391 -19.46005  -9.79470   0.47681 
                          0.54360  -0.03180                      -9.72935   0.46061 
  3 -42.34120 -55.61725   9.46512   0.73784  -6.36635 -19.64240  -9.17719   0.10796 
                          0.06796  -0.01517                      -9.07663   0.13343 
  4 -42.57890 -55.89761   9.49757   0.73774  -6.34703 -19.66575  -9.16508   0.10375 
                          0.06437  -0.01472                      -9.06368   0.12949 
  5 -42.72773 -56.03958   9.45979   0.73984  -6.26066 -19.57252  -9.10988   0.08913 
                          0.05323  -0.01292                      -9.00639   0.11456 
  6 -42.98733 -56.30846   9.44462   0.74130  -6.20476 -19.52589  -9.07796   0.07356 
                          0.04187  -0.01097                      -8.97232   0.09843 
  7 -43.27145 -56.68541   9.56358   0.73904  -6.19362 -19.60759  -9.03832   0.10136 
                          0.06246  -0.01433                      -8.93622   0.12702 
  8 -43.30930 -56.70982   9.51839   0.74069  -6.17297 -19.57349  -9.04786   0.08144 
                          0.04726  -0.01196                      -8.94282   0.10686 
  9 -43.57375 -56.98076   9.49610   0.74218  -6.11106 -19.51806  -9.01333   0.06210 
                          0.03317  -0.00958                      -8.90529   0.08711 
 10 -43.79296 -57.20952   9.49347   0.74292  -6.05266 -19.46923  -8.96696   0.05450 
                          0.02772  -0.00864                      -8.85767   0.07945 

Timing (quasiparticle equation):   0.10857

Timing:        37
