{
   "url":"www.flapw.de/collect.pl",
   "calculation-id":"9F7C1184C455EB4A",
   "data": {
        "githash":"edef532aab1ed2ab5ee26ab6faf6413a84e58506",
        "XC-treatment":2,
        "MPI-PE":1,
        "OMP":6,
        "A-Types":1,
        "Atoms":1,
        "Real":false,
        "Spins":2,
        "Noco":true,
        "SOC":false,
        "SpinSpiral":true,
        "PlaneWaves":60,
        "LOs":4,
        "nkpt":70,
        "gpu_per_node":0,
        "diag-solver":4,
        "Iterations":62,
        "Runtime":0.00,
        "cpu_model":"1",
        "cpu_modelname":"AMD Ryzen 5 1600X Six-Core Processor",
        "VmPeak":797544,
        "VmSize":778300,
        "VmData":241684,
        "VmStk":276,
        "VmExe":5980,
        "VmSwap":0
      }
}
