{
   "timername" : "Total Run",
   "totaltime" : 0.0000E+00,
   "subtimers": [
      {
         "timername" : "Initialization",
         "totaltime" : 0.0000E+00,
         "mintime"   : 0.0000E+00,
         "maxtime"   : 0.0000E+00,
         "ncalls"    : 1,
         "subtimers": [
            {
               "timername" : "r_inpXML",
               "totaltime" : 0.0000E+00,
               "mintime"   : 0.0000E+00,
               "maxtime"   : 0.0000E+00,
               "ncalls"    : 1
            },
            {
               "timername" : "postprocessInput",
               "totaltime" : 0.0000E+00,
               "mintime"   : 0.0000E+00,
               "maxtime"   : 0.0000E+00,
               "ncalls"    : 1,
               "subtimers": [
                  {
                     "timername" : "strgn",
                     "totaltime" : 0.0000E+00,
                     "mintime"   : 0.0000E+00,
                     "maxtime"   : 0.0000E+00,
                     "ncalls"    : 1,
                     "subtimers": [
                        {
                           "timername" : "writeStars",
                           "totaltime" : 0.0000E+00,
                           "mintime"   : 0.0000E+00,
                           "maxtime"   : 0.0000E+00,
                           "ncalls"    : 1
                        }
                     ]
                  },
                  {
                     "timername" : "stepf",
                     "totaltime" : 0.0000E+00,
                     "mintime"   : 0.0000E+00,
                     "maxtime"   : 0.0000E+00,
                     "ncalls"    : 1
                  }
               ]
            }
         ]
      },
      {
         "timername" : "generation of start-density",
         "totaltime" : 0.0000E+00,
         "mintime"   : 0.0000E+00,
         "maxtime"   : 0.0000E+00,
         "ncalls"    : 1,
         "subtimers": [
            {
               "timername" : "qpw_to_nmt",
               "totaltime" : 0.0000E+00,
               "mintime"   : 0.0000E+00,
               "maxtime"   : 0.0000E+00,
               "ncalls"    : 2
            },
            {
               "timername" : "cdntot",
               "totaltime" : 0.0000E+00,
               "mintime"   : 0.0000E+00,
               "maxtime"   : 0.0000E+00,
               "ncalls"    : 1,
               "subtimers": [
                  {
                     "timername" : "MT",
                     "totaltime" : 0.0000E+00,
                     "mintime"   : 0.0000E+00,
                     "maxtime"   : 0.0000E+00,
                     "ncalls"    : 2
                  }
               ]
            }
         ]
      },
      {
         "timername" : "Qfix",
         "totaltime" : 0.0000E+00,
         "mintime"   : 0.0000E+00,
         "maxtime"   : 0.0000E+00,
         "ncalls"    : 1
      },
      {
         "timername" : "Open file/memory for IO of eig",
         "totaltime" : 0.0000E+00,
         "mintime"   : 0.0000E+00,
         "maxtime"   : 0.0000E+00,
         "ncalls"    : 1
      },
      {
         "timername" : "Iteration",
         "totaltime" : 0.0000E+00,
         "mintime"   : 0.0000E+00,
         "maxtime"   : 0.0000E+00,
         "ncalls"    : 26,
         "subtimers": [
            {
               "timername" : "generation of potential",
               "totaltime" : 0.0000E+00,
               "mintime"   : 0.0000E+00,
               "maxtime"   : 0.0000E+00,
               "ncalls"    : 26,
               "subtimers": [
                  {
                     "timername" : "psqpw",
                     "totaltime" : 0.0000E+00,
                     "mintime"   : 0.0000E+00,
                     "maxtime"   : 0.0000E+00,
                     "ncalls"    : 26
                  },
                  {
                     "timername" : "interstitial",
                     "totaltime" : 0.0000E+00,
                     "mintime"   : 0.0000E+00,
                     "maxtime"   : 0.0000E+00,
                     "ncalls"    : 26
                  },
                  {
                     "timername" : "MT-spheres",
                     "totaltime" : 0.0000E+00,
                     "mintime"   : 0.0000E+00,
                     "maxtime"   : 0.0000E+00,
                     "ncalls"    : 26
                  },
                  {
                     "timername" : "den-pot integrals",
                     "totaltime" : 0.0000E+00,
                     "mintime"   : 0.0000E+00,
                     "maxtime"   : 0.0000E+00,
                     "ncalls"    : 26
                  },
                  {
                     "timername" : "Vxc in interstitial",
                     "totaltime" : 0.0000E+00,
                     "mintime"   : 0.0000E+00,
                     "maxtime"   : 0.0000E+00,
                     "ncalls"    : 26
                  },
                  {
                     "timername" : "Vxc in MT",
                     "totaltime" : 0.0000E+00,
                     "mintime"   : 0.0000E+00,
                     "maxtime"   : 0.0000E+00,
                     "ncalls"    : 26
                  }
               ]
            },
            {
               "timername" : "gen. of hamil. and diag. (tota",
               "totaltime" : 0.0000E+00,
               "mintime"   : 0.0000E+00,
               "maxtime"   : 0.0000E+00,
               "ncalls"    : 26,
               "subtimers": [
                  {
                     "timername" : "eigen",
                     "totaltime" : 0.0000E+00,
                     "mintime"   : 0.0000E+00,
                     "maxtime"   : 0.0000E+00,
                     "ncalls"    : 26,
                     "subtimers": [
                        {
                           "timername" : "Updating energy parameters",
                           "totaltime" : 0.0000E+00,
                           "mintime"   : 0.0000E+00,
                           "maxtime"   : 0.0000E+00,
                           "ncalls"    : 26
                        },
                        {
                           "timername" : "tlmplm",
                           "totaltime" : 0.0000E+00,
                           "mintime"   : 0.0000E+00,
                           "maxtime"   : 0.0000E+00,
                           "ncalls"    : 26
                        },
                        {
                           "timername" : "Setup of H&S matrices",
                           "totaltime" : 0.0000E+00,
                           "mintime"   : 0.0000E+00,
                           "maxtime"   : 0.0000E+00,
                           "ncalls"    : 1820,
                           "subtimers": [
                              {
                                 "timername" : "Interstitial part",
                                 "totaltime" : 0.0000E+00,
                                 "mintime"   : 0.0000E+00,
                                 "maxtime"   : 0.0000E+00,
                                 "ncalls"    : 1820
                              },
                              {
                                 "timername" : "MT part",
                                 "totaltime" : 0.0000E+00,
                                 "mintime"   : 0.0000E+00,
                                 "maxtime"   : 0.0000E+00,
                                 "ncalls"    : 1820,
                                 "subtimers": [
                                    {
                                       "timername" : "fjgj coefficients",
                                       "totaltime" : 0.0000E+00,
                                       "mintime"   : 0.0000E+00,
                                       "maxtime"   : 0.0000E+00,
                                       "ncalls"    : 3640
                                    },
                                    {
                                       "timername" : "spherical setup",
                                       "totaltime" : 0.0000E+00,
                                       "mintime"   : 0.0000E+00,
                                       "maxtime"   : 0.0000E+00,
                                       "ncalls"    : 14560
                                    },
                                    {
                                       "timername" : "non-spherical setup",
                                       "totaltime" : 0.0000E+00,
                                       "mintime"   : 0.0000E+00,
                                       "maxtime"   : 0.0000E+00,
                                       "ncalls"    : 14560
                                    },
                                    {
                                       "timername" : "LO setup",
                                       "totaltime" : 0.0000E+00,
                                       "mintime"   : 0.0000E+00,
                                       "maxtime"   : 0.0000E+00,
                                       "ncalls"    : 14560
                                    }
                                 ]
                              },
                              {
                                 "timername" : "Matrix redistribution",
                                 "totaltime" : 0.0000E+00,
                                 "mintime"   : 0.0000E+00,
                                 "maxtime"   : 0.0000E+00,
                                 "ncalls"    : 1820
                              }
                           ]
                        },
                        {
                           "timername" : "Diagonalization",
                           "totaltime" : 0.0000E+00,
                           "mintime"   : 0.0000E+00,
                           "maxtime"   : 0.0000E+00,
                           "ncalls"    : 1820
                        },
                        {
                           "timername" : "EV output",
                           "totaltime" : 0.0000E+00,
                           "mintime"   : 0.0000E+00,
                           "maxtime"   : 0.0000E+00,
                           "ncalls"    : 1820,
                           "subtimers": [
                              {
                                 "timername" : "IO (write)",
                                 "totaltime" : 0.0000E+00,
                                 "mintime"   : 0.0000E+00,
                                 "maxtime"   : 0.0000E+00,
                                 "ncalls"    : 1820
                              }
                           ]
                        }
                     ]
                  }
               ]
            },
            {
               "timername" : "determination of fermi energy",
               "totaltime" : 0.0000E+00,
               "mintime"   : 0.0000E+00,
               "maxtime"   : 0.0000E+00,
               "ncalls"    : 26,
               "subtimers": [
                  {
                     "timername" : "IO (read)",
                     "totaltime" : 0.0000E+00,
                     "mintime"   : 0.0000E+00,
                     "maxtime"   : 0.0000E+00,
                     "ncalls"    : 1820
                  },
                  {
                     "timername" : "IO (write)",
                     "totaltime" : 0.0000E+00,
                     "mintime"   : 0.0000E+00,
                     "maxtime"   : 0.0000E+00,
                     "ncalls"    : 1820
                  }
               ]
            },
            {
               "timername" : "generation of new charge densi",
               "totaltime" : 0.0000E+00,
               "mintime"   : 0.0000E+00,
               "maxtime"   : 0.0000E+00,
               "ncalls"    : 26,
               "subtimers": [
                  {
                     "timername" : "cdnval",
                     "totaltime" : 0.0000E+00,
                     "mintime"   : 0.0000E+00,
                     "maxtime"   : 0.0000E+00,
                     "ncalls"    : 52,
                     "subtimers": [
                        {
                           "timername" : "IO (read)",
                           "totaltime" : 0.0000E+00,
                           "mintime"   : 0.0000E+00,
                           "maxtime"   : 0.0000E+00,
                           "ncalls"    : 3640
                        },
                        {
                           "timername" : "pwden",
                           "totaltime" : 0.0000E+00,
                           "mintime"   : 0.0000E+00,
                           "maxtime"   : 0.0000E+00,
                           "ncalls"    : 1820
                        },
                        {
                           "timername" : "abcof",
                           "totaltime" : 0.0000E+00,
                           "mintime"   : 0.0000E+00,
                           "maxtime"   : 0.0000E+00,
                           "ncalls"    : 3640
                        },
                        {
                           "timername" : "cdnval: rhomt",
                           "totaltime" : 0.0000E+00,
                           "mintime"   : 0.0000E+00,
                           "maxtime"   : 0.0000E+00,
                           "ncalls"    : 3640
                        },
                        {
                           "timername" : "cdnval: rhonmt",
                           "totaltime" : 0.0000E+00,
                           "mintime"   : 0.0000E+00,
                           "maxtime"   : 0.0000E+00,
                           "ncalls"    : 3640
                        },
                        {
                           "timername" : "cdnval: rho(n)mtlo",
                           "totaltime" : 0.0000E+00,
                           "mintime"   : 0.0000E+00,
                           "maxtime"   : 0.0000E+00,
                           "ncalls"    : 3640
                        },
                        {
                           "timername" : "mpi_col_den",
                           "totaltime" : 0.0000E+00,
                           "mintime"   : 0.0000E+00,
                           "maxtime"   : 0.0000E+00,
                           "ncalls"    : 52
                        },
                        {
                           "timername" : "cdnmt",
                           "totaltime" : 0.0000E+00,
                           "mintime"   : 0.0000E+00,
                           "maxtime"   : 0.0000E+00,
                           "ncalls"    : 52
                        }
                     ]
                  },
                  {
                     "timername" : "cdntot",
                     "totaltime" : 0.0000E+00,
                     "mintime"   : 0.0000E+00,
                     "maxtime"   : 0.0000E+00,
                     "ncalls"    : 52,
                     "subtimers": [
                        {
                           "timername" : "MT",
                           "totaltime" : 0.0000E+00,
                           "mintime"   : 0.0000E+00,
                           "maxtime"   : 0.0000E+00,
                           "ncalls"    : 104
                        }
                     ]
                  },
                  {
                     "timername" : "cdngen: cdncore",
                     "totaltime" : 0.0000E+00,
                     "mintime"   : 0.0000E+00,
                     "maxtime"   : 0.0000E+00,
                     "ncalls"    : 26
                  }
               ]
            },
            {
               "timername" : "determination of total energy",
               "totaltime" : 0.0000E+00,
               "mintime"   : 0.0000E+00,
               "maxtime"   : 0.0000E+00,
               "ncalls"    : 26
            },
            {
               "timername" : "Charge Density Mixing",
               "totaltime" : 0.0000E+00,
               "mintime"   : 0.0000E+00,
               "maxtime"   : 0.0000E+00,
               "ncalls"    : 26,
               "subtimers": [
                  {
                     "timername" : "Reading of distances",
                     "totaltime" : 0.0000E+00,
                     "mintime"   : 0.0000E+00,
                     "maxtime"   : 0.0000E+00,
                     "ncalls"    : 26
                  },
                  {
                     "timername" : "Mixing",
                     "totaltime" : 0.0000E+00,
                     "mintime"   : 0.0000E+00,
                     "maxtime"   : 0.0000E+00,
                     "ncalls"    : 26
                  },
                  {
                     "timername" : "Postprocessing",
                     "totaltime" : 0.0000E+00,
                     "mintime"   : 0.0000E+00,
                     "maxtime"   : 0.0000E+00,
                     "ncalls"    : 26
                  }
               ]
            }
         ]
      }
   ]
}
