########################
######### SPEX #########
########################
Version 05.00  (Sep  5, 2019)
Execution time: Jan 16, 2020  16:58:14
Hostname: login18-1.hpc.itc.rwth-aachen.de
MPI: 1,1


### subroutine: getinput ###

Basic parameters:
  Number of spins            =  1
            centers          =  4
            types            =  2
            equivalent atoms =  2  2
  Lattice parameter =      1.00000
  Lattice vectors   =      3.01411  -5.22060   0.00000
                           3.01411   5.22060   0.00000
                           0.00000   0.00000   9.80579
  Unit-cell volume  =    308.59778
  Reciprocal cutoff =      4.60000

Unit-cell geometry:
  # Ty  El              Coord.
  1  1  Ga   0.33333  -0.33333   0.00000
  2  1  Ga  -0.33333   0.33333   0.50000
  3  2  N    0.33333  -0.33333  -0.37700
  4  2  N   -0.33333   0.33333   0.12300

Symmetry information:
  Number of symmetry operations = 24
   #  Det           Axis           Angle   Syp  Inv
   1    1     --     --     --      --     Yes   1
   2   -1    1.00  -0.58   0.00   180.00   No    2
   3   -1    1.00   0.58   0.00   180.00   No    3
   4    1    0.00   0.00   1.00   120.00   Yes   9
   5    1    0.00   0.00   1.00   180.00   No    5
   6   -1    0.58   1.00   0.00   180.00   Yes   6
   7   -1    1.00   0.00   0.00   180.00   Yes   7
   8    1    0.00   0.00   1.00    60.00   No   11
   9    1    0.00   0.00  -1.00   120.00   Yes   4
  10   -1    0.00   1.00   0.00   180.00   No   10
  11    1    0.00   0.00  -1.00    60.00   No    8
  12   -1   -0.58   1.00   0.00   180.00   Yes  12
  13 - 24  Time reversal symmetries

##################
### Input file ###
##################
BZ       4 4 4
JOB      GW +:(1-10)
NBAND    200
RESTART  
KPT      +=(0,.61538,0)
 

Info: Simpson and Lagrange integration is used.

Radial mesh and basis functions:
  Number of radial grid points:       759  429
  Number of radial basis functions:    19   18
  Angular momentum quantum number:      8    6
  Maximal index:                        3

Core states:
  Atom type  1  (Ga)
  nl      Energy
  1s  -375.34991
  2s   -45.88297
  3s    -4.96076
  2p   -39.88207
  3p    -3.15226
  Atom type  2  (N )
  nl      Energy
  1s   -13.54409
  Number of valence electrons:   36

Average Coulomb potential: -0.35487  ( -9.65657 eV )

Read wavefunctions from harddisc... done   ( Timing:    0.24 )

Maximal energy difference in deg. subspaces: 2.0E-13
Minimal energy difference between subspaces: 2.2E-05

Wave functions:
  Number of bands:             198 -  200  (  200 )
            k points (IBZ):     64  (  12 /  30 )
            G vectors:         736
  k points of IBZ:
    1  (0.00000,0.00000,0.00000)  [ 0.00000, 0.00000, 0.00000 ]
    2  (0.00000,0.00000,0.25000)  [ 0.00000, 0.00000, 0.02550 ]
    3  (0.00000,0.00000,0.50000)  [ 0.00000, 0.00000, 0.05099 ]
    4  (0.00000,0.25000,0.00000)  [ 0.04147, 0.02394, 0.00000 ]
    5  (0.00000,0.25000,0.25000)  [ 0.04147, 0.02394, 0.02550 ]
    6  (0.00000,0.25000,0.50000)  [ 0.04147, 0.02394, 0.05099 ]
    7  (0.00000,0.50000,0.00000)  [ 0.08294, 0.04789, 0.00000 ]
    8  (0.00000,0.50000,0.25000)  [ 0.08294, 0.04789, 0.02550 ]
    9  (0.00000,0.50000,0.50000)  [ 0.08294, 0.04789, 0.05099 ]
   10  (0.25000,0.25000,0.00000)  [ 0.08294, 0.00000, 0.00000 ]
   11  (0.25000,0.25000,0.25000)  [ 0.08294, 0.00000, 0.02550 ]
   12  (0.25000,0.25000,0.50000)  [ 0.08294, 0.00000, 0.05099 ]
  k points of EIBZ (shifted set):
   65  (0.00000,0.61538,0.00000)  [ 0.10208, 0.05894, 0.00000 ]
   66  (0.00000,0.61538,0.25000)  [ 0.10208, 0.05894, 0.02550 ]
   67  (0.00000,0.61538,0.50000)  [ 0.10208, 0.05894, 0.05099 ]
   68  (0.00000,0.86538,0.00000)  [ 0.14355, 0.08288, 0.00000 ]
   69  (0.00000,0.86538,0.25000)  [ 0.14355, 0.08288, 0.02550 ]
   70  (0.00000,0.86538,0.50000)  [ 0.14355, 0.08288, 0.05099 ]
   71  (0.00000,0.11538,0.00000)  [ 0.01914, 0.01105, 0.00000 ]
   72  (0.00000,0.11538,0.25000)  [ 0.01914, 0.01105, 0.02550 ]
   73  (0.00000,0.11538,0.50000)  [ 0.01914, 0.01105, 0.05099 ]
   74  (0.00000,0.36538,0.00000)  [ 0.06061, 0.03499, 0.00000 ]
   75  (0.00000,0.36538,0.25000)  [ 0.06061, 0.03499, 0.02550 ]
   76  (0.00000,0.36538,0.50000)  [ 0.06061, 0.03499, 0.05099 ]
   77  (0.25000,0.61538,0.00000)  [ 0.14355, 0.03499, 0.00000 ]
   78  (0.25000,0.61538,0.25000)  [ 0.14355, 0.03499, 0.02550 ]
   79  (0.25000,0.61538,0.50000)  [ 0.14355, 0.03499, 0.05099 ]
   80  (0.25000,0.86538,0.00000)  [ 0.18503, 0.05894, 0.00000 ]
   81  (0.25000,0.86538,0.25000)  [ 0.18503, 0.05894, 0.02550 ]
   82  (0.25000,0.86538,0.50000)  [ 0.18503, 0.05894, 0.05099 ]
   83  (0.25000,0.11538,0.00000)  [ 0.06061,-0.01289, 0.00000 ]
   84  (0.25000,0.11538,0.25000)  [ 0.06061,-0.01289, 0.02550 ]
   85  (0.25000,0.11538,0.50000)  [ 0.06061,-0.01289, 0.05099 ]
   86  (0.25000,0.36538,0.00000)  [ 0.10208, 0.01105, 0.00000 ]
   87  (0.25000,0.36538,0.25000)  [ 0.10208, 0.01105, 0.02550 ]
   88  (0.25000,0.36538,0.50000)  [ 0.10208, 0.01105, 0.05099 ]
   89  (0.50000,0.61538,0.00000)  [ 0.18503, 0.01105, 0.00000 ]
   90  (0.50000,0.61538,0.25000)  [ 0.18503, 0.01105, 0.02550 ]
   91  (0.50000,0.61538,0.50000)  [ 0.18503, 0.01105, 0.05099 ]
   92  (0.50000,0.86538,0.00000)  [ 0.22650, 0.03499, 0.00000 ]
   93  (0.50000,0.86538,0.25000)  [ 0.22650, 0.03499, 0.02550 ]
   94  (0.50000,0.86538,0.50000)  [ 0.22650, 0.03499, 0.05099 ]

Generate wavefunctions at equivalent k points... done   ( Timing:   0.46 )

Size of array cpw:   209.8 MB
Size of array cmt:   260.9 MB

The system is not a metal.
The Fermi energy is placed in the center of the band gap.
KS energy gap:    0.07059528 Ha   (  1.92099521 eV )
Fermi energy:     0.29316457 Ha   (  7.97741378 eV )
Maximal energy:   5.57307583 Ha
Electron count error of the shifted k-point set:  0.0000000000000000

Wave-function checksum: -2.250227822819E-01


### subroutine: checkinput ###

Overlap <core|core>
Atom type  1
1s  1.000000 
2s -0.000000  1.000000 
3s  0.000000 -0.000001  0.999961 
2p  0.999418 
3p -0.000329  0.999458 
Atom type  2
1s  0.999983 

Overlap <core|basis>
Atom type  1
         u(s)    udot(s)
1s  0.000000  0.000000 
2s  0.000001  0.000000 
3s  0.004767 -0.007551 
         u(p)    udot(p)
2p -0.000106 -0.000031 
3p  0.017150 -0.021254 
Atom type  2
         u(s)    udot(s)
1s  0.003209 -0.002046 

Average overlap <core|val>
Atom type  1
1s  0.000000
2s  0.000000
3s  0.000679
2p  0.000010  0.000010  0.000010
3p  0.002209  0.002206  0.002209
Atom type  2
1s  0.000234

Maximum overlap <core|val> at (band/kpoint)
Atom type  1
1s  0.000000 (022/ 009)
2s  0.000001 (022/ 009)
3s  0.003767 (156/ 003)
2p  0.000060 (025/ 003)  0.000064 (024/ 001)  0.000067 (026/ 003)
3p  0.012494 (122/ 003)  0.014817 (111/ 001)  0.013262 (124/ 003)
Atom type  2
1s  0.001622 (002/ 108)

Overlap <basis|basis>
Atom type  1
   u(s)  1.000000 
udot(s)  0.000000  0.129862 
   u(p)  1.000000 
udot(p) -0.000000  0.075237 
   u(d)  1.000000 
udot(d) -0.000000  0.733838 
 ulo(d)  0.410292 -0.767526  1.000000 
   u(f)  1.000000 
udot(f) -0.000000  0.020278 
   u(g)  1.000000 
udot(g) -0.000000  0.006703 
   u(h)  1.000000 
udot(h)  0.000000  0.003149 
   u(i)  1.000000 
udot(i) -0.000000  0.001726 
   u(j)  1.000000 
udot(j)  0.000000  0.001039 
   u(k)  1.000000 
udot(k) -0.000000  0.000667 
Atom type  2
   u(s)  1.000000 
udot(s)  0.000000  0.023146 
   u(p)  1.000000 
udot(p)  0.000000  0.036192 
   u(d)  1.000000 
udot(d)  0.000000  0.003612 
   u(f)  1.000000 
udot(f)  0.000000  0.001183 
   u(g)  1.000000 
udot(g)  0.000000  0.000520 
   u(h)  1.000000 
udot(h) -0.000000  0.000271 
   u(i)  1.000000 
udot(i)  0.000000  0.000157 


### subroutine: mixedbasis ( Mode: vv ) ###

Mixed basis
  Plane-wave basis:
    Number of unique G vectors:   347
    Maximal number of G vectors:  233

  MT basis read in from spex.mb (mode: vv).
    Total number of product-basis functions:  264



##### Job index:  1 #####


### subroutine: correlation ###

< GW self-energy >
Calculate periodic function...done   ( Timing:    0.09 )

=========

K point (   1 ):   0.00000   0.00000   0.00000

Coulomb matrix read from spex.cor
Inverse dielectric matrices read from spex.cor 
Invert dielectric tensor... done   ( Timing:    0.02 )
Hermiticity of transformed Coulomb matrix: 6.8E-11

Add contribution to self-energy... done
                               Timings
  MT wave-func. products:      0.13035
  PW wave-func. products:      0.27625
  Matrix-vector products:      0.38066
  Transformations:             0.09424
  Exchange self-energy:        0.07647
  Frequency integration:       0.01981
  Tetrahedron weights:         0.00000
  Gamma-point correction:      1.49905
  MPI idle time:               0.00007      0.00007
  Other:                       0.05764
  ------------------------------------
  Total:                       2.53455

=========

K point (   2 ):   0.00000   0.00000   0.25000

Coulomb matrix read from spex.cor
Inverse dielectric matrices read from spex.cor 
Hermiticity of transformed Coulomb matrix: 8.7E-10

Add contribution to self-energy... done
                               Timings
  MT wave-func. products:      0.13000
  PW wave-func. products:      0.27991
  Matrix-vector products:      0.35469
  Transformations:             0.09278
  Exchange self-energy:        0.05864
  Frequency integration:       0.01952
  Tetrahedron weights:         0.00000
  MPI idle time:               0.00006      0.00006
  Other:                       0.05357
  ------------------------------------
  Total:                       0.98918

=========

K point (   3 ):   0.00000   0.00000   0.50000

Coulomb matrix read from spex.cor
Inverse dielectric matrices read from spex.cor 
Hermiticity of transformed Coulomb matrix: 2.4E-10

Add contribution to self-energy... done
                               Timings
  MT wave-func. products:      0.13010
  PW wave-func. products:      0.26208
  Matrix-vector products:      0.58451
  Transformations:             0.08611
  Exchange self-energy:        0.05411
  Frequency integration:       0.01967
  Tetrahedron weights:         0.00000
  MPI idle time:               0.00002      0.00002
  Other:                       0.05558
  ------------------------------------
  Total:                       1.19218

=========

K point (   4 ):   0.00000   0.25000   0.00000

Coulomb matrix read from spex.cor
Inverse dielectric matrices read from spex.cor 
Hermiticity of transformed Coulomb matrix: 1.5E-10

Add contribution to self-energy... done
                               Timings
  MT wave-func. products:      0.39288
  PW wave-func. products:      0.88300
  Matrix-vector products:      2.42136
  Transformations:             0.35936
  Exchange self-energy:        0.11534
  Frequency integration:       0.07890
  Tetrahedron weights:         0.00000
  MPI idle time:               0.00006      0.00006
  Other:                       0.19512
  ------------------------------------
  Total:                       4.44601

=========

K point (   5 ):   0.00000   0.25000   0.25000

Coulomb matrix read from spex.cor
Inverse dielectric matrices read from spex.cor 
Hermiticity of transformed Coulomb matrix: 1.5E-10

Add contribution to self-energy... done
                               Timings
  MT wave-func. products:      0.39169
  PW wave-func. products:      0.89828
  Matrix-vector products:      2.38088
  Transformations:             0.36346
  Exchange self-energy:        0.11393
  Frequency integration:       0.07863
  Tetrahedron weights:         0.00000
  MPI idle time:               0.00005      0.00005
  Other:                       0.19663
  ------------------------------------
  Total:                       4.42354

=========

K point (   6 ):   0.00000   0.25000   0.50000

Coulomb matrix read from spex.cor
Inverse dielectric matrices read from spex.cor 
Hermiticity of transformed Coulomb matrix: 1.4E-10

Add contribution to self-energy... done
                               Timings
  MT wave-func. products:      0.38771
  PW wave-func. products:      0.89946
  Matrix-vector products:      2.46873
  Transformations:             0.36847
  Exchange self-energy:        0.11398
  Frequency integration:       0.07918
  Tetrahedron weights:         0.00000
  MPI idle time:               0.00004      0.00004
  Other:                       0.19626
  ------------------------------------
  Total:                       4.51382

=========

K point (   7 ):   0.00000   0.50000   0.00000

Coulomb matrix read from spex.cor
Inverse dielectric matrices read from spex.cor 
Hermiticity of transformed Coulomb matrix: 1.3E-10

Add contribution to self-energy... done
                               Timings
  MT wave-func. products:      0.21520
  PW wave-func. products:      0.49666
  Matrix-vector products:      0.75112
  Transformations:             0.18443
  Exchange self-energy:        0.07957
  Frequency integration:       0.03920
  Tetrahedron weights:         0.00000
  MPI idle time:               0.00002      0.00002
  Other:                       0.10062
  ------------------------------------
  Total:                       1.86680

=========

K point (   8 ):   0.00000   0.50000   0.25000

Coulomb matrix read from spex.cor
Inverse dielectric matrices read from spex.cor 
Hermiticity of transformed Coulomb matrix: 7.9E-11

Add contribution to self-energy... done
                               Timings
  MT wave-func. products:      0.21451
  PW wave-func. products:      0.47862
  Matrix-vector products:      0.73103
  Transformations:             0.18366
  Exchange self-energy:        0.07451
  Frequency integration:       0.03938
  Tetrahedron weights:         0.00000
  MPI idle time:               0.00002      0.00002
  Other:                       0.09945
  ------------------------------------
  Total:                       1.82117

=========

K point (   9 ):   0.00000   0.50000   0.50000

Coulomb matrix read from spex.cor
Inverse dielectric matrices read from spex.cor 
Hermiticity of transformed Coulomb matrix: 5.5E-11

Add contribution to self-energy... done
                               Timings
  MT wave-func. products:      0.21447
  PW wave-func. products:      0.45693
  Matrix-vector products:      1.16728
  Transformations:             0.18291
  Exchange self-energy:        0.07022
  Frequency integration:       0.03914
  Tetrahedron weights:         0.00000
  MPI idle time:               0.00004      0.00004
  Other:                       0.10038
  ------------------------------------
  Total:                       2.23136

=========

K point (  10 ):   0.25000   0.25000   0.00000

Coulomb matrix read from spex.cor
Inverse dielectric matrices read from spex.cor 
Hermiticity of transformed Coulomb matrix: 5.5E-11

Add contribution to self-energy... done
                               Timings
  MT wave-func. products:      0.30409
  PW wave-func. products:      0.67333
  Matrix-vector products:      1.64372
  Transformations:             0.27449
  Exchange self-energy:        0.08914
  Frequency integration:       0.05944
  Tetrahedron weights:         0.00000
  MPI idle time:               0.00008      0.00008
  Other:                       0.14706
  ------------------------------------
  Total:                       3.19134

=========

K point (  11 ):   0.25000   0.25000   0.25000

Coulomb matrix read from spex.cor
Inverse dielectric matrices read from spex.cor 
Hermiticity of transformed Coulomb matrix: 8.0E-11

Add contribution to self-energy... done
                               Timings
  MT wave-func. products:      0.30906
  PW wave-func. products:      0.69896
  Matrix-vector products:      1.73448
  Transformations:             0.28297
  Exchange self-energy:        0.09476
  Frequency integration:       0.05970
  Tetrahedron weights:         0.00000
  MPI idle time:               0.00004      0.00004
  Other:                       0.14945
  ------------------------------------
  Total:                       3.32943

=========

K point (  12 ):   0.25000   0.25000   0.50000

Coulomb matrix read from spex.cor
Inverse dielectric matrices read from spex.cor 
Hermiticity of transformed Coulomb matrix: 9.9E-11

Add contribution to self-energy... done
                               Timings
  MT wave-func. products:      0.30624
  PW wave-func. products:      0.70725
  Matrix-vector products:      3.43181
  Transformations:             0.28568
  Exchange self-energy:        0.09546
  Frequency integration:       0.06270
  Tetrahedron weights:         0.00000
  MPI idle time:               0.00005      0.00005
  Other:                       0.14972
  ------------------------------------
  Total:                       5.03889


### subroutine: exchange_core ###

        k point       band      exchange (core contribution)
  (0.000,0.615,0.000)   1     -6.1845306
  (0.000,0.615,0.000)   2     -9.3510211
  (0.000,0.615,0.000)   3    -17.8053456
  (0.000,0.615,0.000)   4    -17.9501530
  (0.000,0.615,0.000)   5    -18.1023508
  (0.000,0.615,0.000)   6    -18.2106799
  (0.000,0.615,0.000)   7    -18.3637604
  (0.000,0.615,0.000)   8    -18.4356198
  (0.000,0.615,0.000)   9    -18.5827565
  (0.000,0.615,0.000)  10    -18.6988078
Timing:   0.15




### subroutine: quasiparticle ###

Number of mesh points even: No constraint will be used.

List of k points
    0   0.00000   0.61538   0.00000  (additional) 



#####################
### K POINT:    0 ###
#####################


--- DIAGONAL ELEMENTS [eV] ---

 Bd       vxc    sigmax    sigmac         Z        KS        HF          GW lin/dir 
  1 -24.53033 -35.29445   8.57934   0.73033  -8.15005 -18.91417  -9.70290   0.70060 
                          0.79931  -0.05348                      -9.67265   0.66862 
  2 -29.68338 -41.25126   8.91944   0.72256  -7.89995 -19.46783  -9.79679   0.47245 
                          0.53949  -0.03120                      -9.73056   0.45661 
  3 -42.32102 -55.59090   9.45816   0.73796  -6.36664 -19.63652  -9.17853   0.10707 
                          0.06730  -0.01506                      -9.07789   0.13249 
  4 -42.58040 -55.89792   9.49493   0.73783  -6.34649 -19.66401  -9.16597   0.10289 
                          0.06371  -0.01462                      -9.06445   0.12861 
  5 -42.76917 -56.08814   9.46208   0.74000  -6.25785 -19.57682  -9.11128   0.08723 
                          0.05178  -0.01268                      -9.00745   0.11263 
  6 -42.94678 -56.25687   9.43465   0.74140  -6.20471 -19.51480  -9.07749   0.07283 
                          0.04139  -0.01087                      -8.97183   0.09764 
  7 -43.30779 -56.72628   9.56632   0.73912  -6.18591 -19.60441  -9.03226   0.10094 
                          0.06215  -0.01428                      -8.93008   0.12660 
  8 -43.37223 -56.78934   9.53556   0.74045  -6.16999 -19.58710  -9.04348   0.08389 
                          0.04896  -0.01227                      -8.93869   0.10946 
  9 -43.60557 -57.01775   9.50134   0.74215  -6.10377 -19.51595  -9.00588   0.06276 
                          0.03362  -0.00967                      -8.89794   0.08782 
 10 -43.79793 -57.21497   9.49362   0.74292  -6.05115 -19.46818  -8.96570   0.05427 
                          0.02754  -0.00862                      -8.85637   0.07923 

Timing (quasiparticle equation):   0.12450

Timing:        38
