########################
######### SPEX #########
########################
Version 05.00  (Sep  5, 2019)
Execution time: Jan 18, 2020  17:46:43
Hostname: Ontology
MPI: 3,1


### subroutine: getinput ###

Basic parameters:
  Number of spins            =  1
            centers          =  4
            types            =  2
            equivalent atoms =  2  2
  Lattice parameter =      1.00000
  Lattice vectors   =      3.01411  -5.22060   0.00000
                           3.01411   5.22060   0.00000
                           0.00000   0.00000   9.80579
  Unit-cell volume  =    308.59778
  Reciprocal cutoff =      4.60000

Unit-cell geometry:
  # Ty  El              Coord.
  1  1  Ga   0.33333  -0.33333   0.00000
  2  1  Ga  -0.33333   0.33333   0.50000
  3  2  N    0.33333  -0.33333  -0.37700
  4  2  N   -0.33333   0.33333   0.12300

Symmetry information:
  Number of symmetry operations = 24
   #  Det           Axis           Angle   Syp  Inv
   1    1     --     --     --      --     Yes   1
   2   -1    1.00  -0.58  -0.00   180.00   No    2
   3   -1    1.00   0.58  -0.00   180.00   No    3
   4    1    0.00   0.00   1.00   120.00   Yes   9
   5    1    0.00   0.00   1.00   180.00   No    5
   6   -1    0.58   1.00  -0.00   180.00   Yes   6
   7   -1    1.00  -0.00  -0.00   180.00   Yes   7
   8    1    0.00   0.00   1.00    60.00   No   11
   9    1   -0.00  -0.00  -1.00   120.00   Yes   4
  10   -1   -0.00   1.00  -0.00   180.00   No   10
  11    1   -0.00  -0.00  -1.00    60.00   No    8
  12   -1   -0.58   1.00  -0.00   180.00   Yes  12
  13 - 24  Time reversal symmetries

##################
### Input file ###
##################
BZ       4 4 4
JOB      GW +:(1-30)
MPIKPT   
RESTART  
NBAND    200
KPT      +=(.28889,.28889,0)


Info: Simpson and Lagrange integration is used.

Radial mesh and basis functions:
  Number of radial grid points:       759  429
  Number of radial basis functions:    19   18
  Angular momentum quantum number:      8    6
  Maximal index:                        3

Core states:
  Atom type  1  (Ga)
  nl      Energy
  1s  -375.34991
  2s   -45.88297
  3s    -4.96076
  2p   -39.88207
  3p    -3.15226
  Atom type  2  (N )
  nl      Energy
  1s   -13.54409
  Number of valence electrons:   36

Average Coulomb potential: -0.35487  ( -9.65657 eV )

Read wavefunctions from harddisc... done   ( Timing:    0.29 )

Maximal energy difference in deg. subspaces: 1.2E-13
Minimal energy difference between subspaces: 2.2E-05

Wave functions:
  Number of bands:             198 -  200  (  200 )
            k points (IBZ):     64  (  12 /  30 )
            G vectors:         724
  k points of IBZ:
    1  (0.00000,0.00000,0.00000)  [ 0.00000, 0.00000, 0.00000 ]
    2  (0.00000,0.00000,0.25000)  [ 0.00000, 0.00000, 0.02550 ]
    3  (0.00000,0.00000,0.50000)  [ 0.00000, 0.00000, 0.05099 ]
    4  (0.00000,0.25000,0.00000)  [ 0.04147, 0.02394, 0.00000 ]
    5  (0.00000,0.25000,0.25000)  [ 0.04147, 0.02394, 0.02550 ]
    6  (0.00000,0.25000,0.50000)  [ 0.04147, 0.02394, 0.05099 ]
    7  (0.00000,0.50000,0.00000)  [ 0.08294, 0.04789, 0.00000 ]
    8  (0.00000,0.50000,0.25000)  [ 0.08294, 0.04789, 0.02550 ]
    9  (0.00000,0.50000,0.50000)  [ 0.08294, 0.04789, 0.05099 ]
   10  (0.25000,0.25000,0.00000)  [ 0.08294, 0.00000, 0.00000 ]
   11  (0.25000,0.25000,0.25000)  [ 0.08294, 0.00000, 0.02550 ]
   12  (0.25000,0.25000,0.50000)  [ 0.08294, 0.00000, 0.05099 ]
  k points of EIBZ (shifted set):
   65  (0.28889,0.28889,0.00000)  [ 0.09585, 0.00000, 0.00000 ]
   66  (0.28889,0.28889,0.25000)  [ 0.09585, 0.00000, 0.02550 ]
   67  (0.28889,0.28889,0.50000)  [ 0.09585, 0.00000, 0.05099 ]
   68  (0.28889,0.53889,0.00000)  [ 0.13732, 0.02394, 0.00000 ]
   69  (0.28889,0.53889,0.25000)  [ 0.13732, 0.02394, 0.02550 ]
   70  (0.28889,0.53889,0.50000)  [ 0.13732, 0.02394, 0.05099 ]
   71  (0.28889,0.78889,0.00000)  [ 0.17879, 0.04789, 0.00000 ]
   72  (0.28889,0.78889,0.25000)  [ 0.17879, 0.04789, 0.02550 ]
   73  (0.28889,0.78889,0.50000)  [ 0.17879, 0.04789, 0.05099 ]
   74  (0.28889,0.03889,0.00000)  [ 0.05437,-0.02394, 0.00000 ]
   75  (0.28889,0.03889,0.25000)  [ 0.05437,-0.02394, 0.02550 ]
   76  (0.28889,0.03889,0.50000)  [ 0.05437,-0.02394, 0.05099 ]
   77  (0.53889,0.53889,0.00000)  [ 0.17879, 0.00000, 0.00000 ]
   78  (0.53889,0.53889,0.25000)  [ 0.17879, 0.00000, 0.02550 ]
   79  (0.53889,0.53889,0.50000)  [ 0.17879, 0.00000, 0.05099 ]
   80  (0.53889,0.78889,0.00000)  [ 0.22026, 0.02394, 0.00000 ]
   81  (0.53889,0.78889,0.25000)  [ 0.22026, 0.02394, 0.02550 ]
   82  (0.53889,0.78889,0.50000)  [ 0.22026, 0.02394, 0.05099 ]
   83  (0.53889,0.03889,0.00000)  [ 0.09585,-0.04789, 0.00000 ]
   84  (0.53889,0.03889,0.25000)  [ 0.09585,-0.04789, 0.02550 ]
   85  (0.53889,0.03889,0.50000)  [ 0.09585,-0.04789, 0.05099 ]
   86  (0.78889,0.78889,0.00000)  [ 0.26173, 0.00000, 0.00000 ]
   87  (0.78889,0.78889,0.25000)  [ 0.26173, 0.00000, 0.02550 ]
   88  (0.78889,0.78889,0.50000)  [ 0.26173, 0.00000, 0.05099 ]
   89  (0.78889,0.03889,0.00000)  [ 0.13732,-0.07183, 0.00000 ]
   90  (0.78889,0.03889,0.25000)  [ 0.13732,-0.07183, 0.02550 ]
   91  (0.78889,0.03889,0.50000)  [ 0.13732,-0.07183, 0.05099 ]
   92  (0.03889,0.03889,0.00000)  [ 0.01290, 0.00000, 0.00000 ]
   93  (0.03889,0.03889,0.25000)  [ 0.01290, 0.00000, 0.02550 ]
   94  (0.03889,0.03889,0.50000)  [ 0.01290, 0.00000, 0.05099 ]

Generate wavefunctions at equivalent k points... done   ( Timing:   0.26 )

Size of array cpw:   209.8 MB
Size of array cmt:   260.9 MB

The system is not a metal.
The Fermi energy is placed in the center of the band gap.
KS energy gap:    0.07059528 Ha   (  1.92099521 eV )
Fermi energy:     0.29316457 Ha   (  7.97741378 eV )
Maximal energy:   5.57248232 Ha
Electron count error of the shifted k-point set:  0.0000000000000000

Wave-function checksum:  2.384703318767E-02


### subroutine: checkinput ###

Overlap <core|core>
Atom type  1
1s  1.000000
2s -0.000000  1.000000
3s  0.000000 -0.000001  0.999961
2p  0.999418
3p -0.000329  0.999458
Atom type  2
1s  0.999983

Overlap <core|basis>
Atom type  1
         u(s)    udot(s)
1s  0.000000  0.000000
2s  0.000001  0.000000
3s  0.004767 -0.007551
         u(p)    udot(p)
2p -0.000106 -0.000031
3p  0.017150 -0.021254
Atom type  2
         u(s)    udot(s)
1s  0.003209 -0.002046

Average overlap <core|val>
Atom type  1
1s  0.000000
2s  0.000000
3s  0.000679
2p  0.000010  0.000010  0.000010
3p  0.002209  0.002205  0.002208
Atom type  2
1s  0.000234

Maximum overlap <core|val> at (band/kpoint)
Atom type  1
1s  0.000000 (033/ 001)
2s  0.000001 (033/ 001)
3s  0.004386 (156/ 003)
2p  0.000073 (025/ 003)  0.000064 (024/ 001)  0.000058 (026/ 127)
3p  0.013032 (123/ 003)  0.014817 (111/ 001)  0.011325 (124/ 094)
Atom type  2
1s  0.001496 (001/ 006)

Overlap <basis|basis>
Atom type  1
   u(s)  1.000000
udot(s) -0.000000  0.129862
   u(p)  1.000000
udot(p)  0.000000  0.075237
   u(d)  1.000000
udot(d) -0.000000  0.733838
 ulo(d)  0.410292 -0.767526  1.000000
   u(f)  1.000000
udot(f) -0.000000  0.020278
   u(g)  1.000000
udot(g) -0.000000  0.006703
   u(h)  1.000000
udot(h) -0.000000  0.003149
   u(i)  1.000000
udot(i)  0.000000  0.001726
   u(j)  1.000000
udot(j) -0.000000  0.001039
   u(k)  1.000000
udot(k) -0.000000  0.000667
Atom type  2
   u(s)  1.000000
udot(s)  0.000000  0.023146
   u(p)  1.000000
udot(p)  0.000000  0.036192
   u(d)  1.000000
udot(d) -0.000000  0.003612
   u(f)  1.000000
udot(f)  0.000000  0.001183
   u(g)  1.000000
udot(g) -0.000000  0.000520
   u(h)  1.000000
udot(h) -0.000000  0.000271
   u(i)  1.000000
udot(i) -0.000000  0.000157


### subroutine: mixedbasis ( Mode: vv ) ###

Mixed basis
  Plane-wave basis:
    Number of unique G vectors:   346
    Maximal number of G vectors:  233

  MT basis read in from spex.mb (mode: vv).
    Total number of product-basis functions:  264



##### Job index:  1 #####


### subroutine: correlation ###

< GW self-energy >
Calculate periodic function...done   ( Timing:    0.04 )

=========

K point (   1 ):   0.00000   0.00000   0.00000

Coulomb matrix read from spex.cor
Inverse dielectric matrices read from spex.cor
Invert dielectric tensor... done   ( Timing:    0.02 )
Hermiticity of transformed Coulomb matrix: 5.1E-11

Add contribution to self-energy... done
                               Timings
  MT wave-func. products:      1.38227
  PW wave-func. products:      0.45133
  Matrix-vector products:      2.29685
  Transformations:             0.28653
  Exchange self-energy:        0.16674
  Frequency integration:       0.10965
  Tetrahedron weights:         0.00000
  Gamma-point correction:      0.39203
  MPI idle time:               0.00002      0.02871
  Other:                       0.19080
  ------------------------------------
  Total:                       5.27623

=========

K point (   2 ):   0.00000   0.00000   0.25000

Coulomb matrix read from spex.cor
Inverse dielectric matrices read from spex.cor
Hermiticity of transformed Coulomb matrix: 5.9E-10

Add contribution to self-energy... done
                               Timings
  MT wave-func. products:      1.33190
  PW wave-func. products:      0.31933
  Matrix-vector products:      2.15332
  Transformations:             0.26280
  Exchange self-energy:        0.16185
  Frequency integration:       0.01331
  Tetrahedron weights:         0.00000
  MPI idle time:               0.00010      0.02365
  Other:                       0.19256
  ------------------------------------
  Total:                       4.43518

=========

K point (   3 ):   0.00000   0.00000   0.50000

Coulomb matrix read from spex.cor
Inverse dielectric matrices read from spex.cor
Hermiticity of transformed Coulomb matrix: 1.8E-10

Add contribution to self-energy... done
                               Timings
  MT wave-func. products:      1.28885
  PW wave-func. products:      0.44774
  Matrix-vector products:      2.24073
  Transformations:             0.21540
  Exchange self-energy:        0.12354
  Frequency integration:       0.03492
  Tetrahedron weights:         0.00000
  MPI idle time:               0.00002      0.02055
  Other:                       0.13269
  ------------------------------------
  Total:                       4.48390

=========

K point (   4 ):   0.00000   0.25000   0.00000

Coulomb matrix read from spex.cor
Inverse dielectric matrices read from spex.cor
Hermiticity of transformed Coulomb matrix: 8.5E-11

Add contribution to self-energy... done
                               Timings
  MT wave-func. products:      2.45722
  PW wave-func. products:      0.66417
  Matrix-vector products:      6.63373
  Transformations:             0.82147
  Exchange self-energy:        0.15591
  Frequency integration:       0.11488
  Tetrahedron weights:         0.00000
  MPI idle time:               0.03565      0.03565
  Other:                       0.43146
  ------------------------------------
  Total:                      11.31449

=========

K point (   5 ):   0.00000   0.25000   0.25000

Coulomb matrix read from spex.cor
Inverse dielectric matrices read from spex.cor
Hermiticity of transformed Coulomb matrix: 9.7E-11

Add contribution to self-energy... done
                               Timings
  MT wave-func. products:      2.78378
  PW wave-func. products:      0.73015
  Matrix-vector products:      7.03979
  Transformations:             0.82933
  Exchange self-energy:        0.34192
  Frequency integration:       0.12714
  Tetrahedron weights:         0.00000
  MPI idle time:               0.00002      0.02277
  Other:                       0.52808
  ------------------------------------
  Total:                      12.38022

=========

K point (   6 ):   0.00000   0.25000   0.50000

Coulomb matrix read from spex.cor
Inverse dielectric matrices read from spex.cor
Hermiticity of transformed Coulomb matrix: 9.8E-11

Add contribution to self-energy... done
                               Timings
  MT wave-func. products:      2.55827
  PW wave-func. products:      0.68321
  Matrix-vector products:      6.58377
  Transformations:             0.85873
  Exchange self-energy:        0.16173
  Frequency integration:       0.18627
  Tetrahedron weights:         0.00000
  MPI idle time:               0.01320      0.01320
  Other:                       0.59815
  ------------------------------------
  Total:                      11.64331

=========

K point (   7 ):   0.00000   0.50000   0.00000

Coulomb matrix read from spex.cor
Inverse dielectric matrices read from spex.cor
Hermiticity of transformed Coulomb matrix: 1.0E-10

Add contribution to self-energy... done
                               Timings
  MT wave-func. products:      2.12085
  PW wave-func. products:      0.50906
  Matrix-vector products:      4.02538
  Transformations:             0.53238
  Exchange self-energy:        0.17066
  Frequency integration:       0.09300
  Tetrahedron weights:         0.00000
  MPI idle time:               0.01837      0.01837
  Other:                       0.36024
  ------------------------------------
  Total:                       7.82996

=========

K point (   8 ):   0.00000   0.50000   0.25000

Coulomb matrix read from spex.cor
Inverse dielectric matrices read from spex.cor
Hermiticity of transformed Coulomb matrix: 5.3E-11

Add contribution to self-energy... done
                               Timings
  MT wave-func. products:      2.18248
  PW wave-func. products:      0.52959
  Matrix-vector products:      4.23792
  Transformations:             0.56135
  Exchange self-energy:        0.14470
  Frequency integration:       0.08185
  Tetrahedron weights:         0.00000
  MPI idle time:               0.02048      0.02564
  Other:                       0.32638
  ------------------------------------
  Total:                       8.08475

=========

K point (   9 ):   0.00000   0.50000   0.50000

Coulomb matrix read from spex.cor
Inverse dielectric matrices read from spex.cor
Hermiticity of transformed Coulomb matrix: 4.1E-11

Add contribution to self-energy... done
                               Timings
  MT wave-func. products:      1.91918
  PW wave-func. products:      0.62936
  Matrix-vector products:      4.01617
  Transformations:             0.49344
  Exchange self-energy:        0.12735
  Frequency integration:       0.15842
  Tetrahedron weights:         0.00000
  MPI idle time:               0.03224      0.03224
  Other:                       0.35165
  ------------------------------------
  Total:                       7.72781

=========

K point (  10 ):   0.25000   0.25000   0.00000

Coulomb matrix read from spex.cor
Inverse dielectric matrices read from spex.cor
Hermiticity of transformed Coulomb matrix: 3.6E-11

Add contribution to self-energy... done
                               Timings
  MT wave-func. products:      3.42802
  PW wave-func. products:      0.91201
  Matrix-vector products:      8.23544
  Transformations:             1.05119
  Exchange self-energy:        0.19861
  Frequency integration:       0.18393
  Tetrahedron weights:         0.00000
  MPI idle time:               0.00961      0.03087
  Other:                       0.66311
  ------------------------------------
  Total:                      14.68192

=========

K point (  11 ):   0.25000   0.25000   0.25000

Coulomb matrix read from spex.cor
Inverse dielectric matrices read from spex.cor
Hermiticity of transformed Coulomb matrix: 5.4E-11

Add contribution to self-energy... done
                               Timings
  MT wave-func. products:      3.53717
  PW wave-func. products:      0.92341
  Matrix-vector products:      8.42548
  Transformations:             1.16512
  Exchange self-energy:        0.22020
  Frequency integration:       0.18422
  Tetrahedron weights:         0.00000
  MPI idle time:               0.00002      0.03632
  Other:                       0.76260
  ------------------------------------
  Total:                      15.21822

=========

K point (  12 ):   0.25000   0.25000   0.50000

Coulomb matrix read from spex.cor
Inverse dielectric matrices read from spex.cor
Hermiticity of transformed Coulomb matrix: 6.5E-11

Add contribution to self-energy... done
                               Timings
  MT wave-func. products:      3.32069
  PW wave-func. products:      0.97878
  Matrix-vector products:     13.75560
  Transformations:             1.05528
  Exchange self-energy:        0.20700
  Frequency integration:       0.27105
  Tetrahedron weights:         0.00000
  MPI idle time:               0.01529      0.01840
  Other:                       0.88852
  ------------------------------------
  Total:                      20.49221


### subroutine: exchange_core ###

        k point       band      exchange (core contribution)
  (0.289,0.289,0.000)   1     -8.1420791
  (0.289,0.289,0.000)   2     -9.2125900
  (0.289,0.289,0.000)   3    -17.7408895
  (0.289,0.289,0.000)   4    -18.1521108
  (0.289,0.289,0.000)   5    -18.2564995
  (0.289,0.289,0.000)   6    -18.3609332
  (0.289,0.289,0.000)   7    -18.3534607
  (0.289,0.289,0.000)   8    -18.4199492
  (0.289,0.289,0.000)   9    -18.5288021
  (0.289,0.289,0.000)  10    -18.5656433
  (0.289,0.289,0.000)  11    -12.1149056
  (0.289,0.289,0.000)  12    -11.3713849
  (0.289,0.289,0.000)  13     -1.7340874
  (0.289,0.289,0.000)  14     -1.6820519
  (0.289,0.289,0.000)  15     -1.4705415
  (0.289,0.289,0.000)  16     -1.4933486
  (0.289,0.289,0.000)  17     -1.7600411
  (0.289,0.289,0.000)  18     -1.6766885
  (0.289,0.289,0.000)  19     -1.5182838
  (0.289,0.289,0.000)  20     -2.0022251
  (0.289,0.289,0.000)  21     -2.0915095
  (0.289,0.289,0.000)  22     -1.5138526
  (0.289,0.289,0.000)  23     -1.8105198
  (0.289,0.289,0.000)  24     -1.6943309
  (0.289,0.289,0.000)  25     -1.9599411
  (0.289,0.289,0.000)  26     -1.3455636
  (0.289,0.289,0.000)  27     -2.3617624
  (0.289,0.289,0.000)  28     -2.0394972
  (0.289,0.289,0.000)  29     -2.2339537
  (0.289,0.289,0.000)  30     -1.7804488
Timing:   0.09




### subroutine: quasiparticle ###

Number of mesh points even: No constraint will be used.

List of k points
    0   0.28889   0.28889   0.00000  (additional)



#####################
### K POINT:    0 ###
#####################


--- DIAGONAL ELEMENTS [eV] ---

 Bd       vxc    sigmax    sigmac         Z        KS        HF          GW lin/dir
  1 -27.74026 -39.00179   8.78639   0.72518  -7.97879 -19.24031  -9.74977   0.55222
                          0.63226  -0.03786                      -9.69524   0.52799
  2 -29.46628 -41.00238   8.90496   0.72207  -7.90468 -19.44077  -9.78746   0.47705
                          0.54681  -0.03125                      -9.72162   0.46113
  3 -42.17289 -55.43007   9.44544   0.73771  -6.41453 -19.67170  -9.22550   0.10539
                          0.06582  -0.01491                      -9.12435   0.13104
  4 -42.94910 -56.31074   9.52883   0.73848  -6.24867 -19.61031  -9.07816   0.10399
                          0.06447  -0.01471                      -8.97683   0.12972
  5 -43.09256 -56.45985   9.51263   0.73957  -6.20887 -19.57615  -9.05893   0.09230
                          0.05546  -0.01330                      -8.95585   0.11793
  6 -43.20534 -56.58866   9.49306   0.74115  -6.20487 -19.58819  -9.08766   0.07481
                          0.04260  -0.01111                      -8.98150   0.09985
  7 -43.20322 -56.58319   9.49602   0.74088  -6.19087 -19.57085  -9.06790   0.07798
                          0.04481  -0.01153                      -8.96232   0.10326
  8 -43.29409 -56.67288   9.47669   0.74186  -6.17527 -19.55405  -9.06973   0.06642
                          0.03634  -0.01011                      -8.96236   0.09140
  9 -43.51849 -56.93148   9.51217   0.74160  -6.12260 -19.53558  -9.01503   0.07031
                          0.03907  -0.01060                      -8.90828   0.09552
 10 -43.57115 -56.95847   9.48240   0.74221  -6.08829 -19.47560  -8.98624   0.06168
                          0.03278  -0.00957                      -8.87839   0.08692
 11 -33.91630 -45.23328   8.60131   0.73406  -4.73756 -16.05454  -6.70838   0.43338
                          0.35332  -0.06408                      -6.70523   0.44946
 12 -33.17137 -44.21952   8.48788   0.73551  -4.22879 -15.27694  -6.09045   0.41728
                          0.35981  -0.05962                      -6.07245   0.41594
 13 -16.15110 -21.17417   3.92305   0.74465   1.43454  -3.58853   0.61604   0.04780
                          0.04231  -0.01481                       0.62481   0.04988
 14 -15.87927 -21.09531   3.94902   0.74478   1.64464  -3.57141   0.70153   0.04633
                          0.03764  -0.01444                       0.71365   0.04959
 15 -15.83013 -20.63588   3.65223   0.75196   2.40036  -2.40538   1.53318   0.02823
                          0.02264  -0.00972                       1.54297   0.03025
 16 -16.28893 -20.91671   3.46896   0.75839   3.50296  -1.12482   2.62415   0.01136
                          0.00790  -0.00464                       2.63435   0.01283
 17 -17.41015 -21.80554   3.30907   0.76650   4.54233   0.14694   3.70967   0.00421
                          0.00254  -0.00209                       3.71799   0.00507
 18 -17.32734 -21.61369   3.25789   0.76577   4.62144   0.33508   3.83387   0.00347
                          0.00206  -0.00185                       3.84140   0.00420
 19 -11.97839  -7.49492  -4.08048   0.82246  12.41684  16.90031  12.74828  -0.00162
                         -0.00090  -0.00218                      12.74737  -0.00178
 20 -17.37416 -10.93517  -4.89879   0.77646  14.37625  20.81524  15.57205  -0.02304
                         -0.01222  -0.00880                      15.55817  -0.02827
 21 -17.63760 -10.95139  -5.00631   0.77586  15.05614  21.74234  16.35934  -0.02902
                         -0.01635  -0.00973                      16.34250  -0.03513
 22 -14.87626  -9.09723  -4.82391   0.78157  15.19945  20.97849  15.94574  -0.02547
                         -0.01935  -0.01083                      15.94005  -0.02738
 23 -15.07605  -8.92684  -5.07293   0.78566  16.71193  22.86114  17.55702  -0.04256
                         -0.03447  -0.01437                      17.54986  -0.04499
 24 -15.41290  -8.97522  -5.29097   0.77552  17.18111  23.61879  18.06965  -0.05382
                         -0.04432  -0.01695                      18.06122  -0.05676
 25 -14.25212  -7.55584  -5.78122   0.77427  18.79538  25.49166  19.50057  -0.11177
                         -0.10816  -0.03063                      19.49479  -0.11355
 26 -13.45955  -6.77866  -5.82811   0.77174  20.36398  27.04487  21.01761  -0.13233
                         -0.13456  -0.03341                      21.01247  -0.13342
 27 -15.47275  -8.09599  -6.24569   0.75929  20.42476  27.80152  21.27607  -0.18304
                         -0.17854  -0.04197                      21.26650  -0.18570
 28 -14.19773  -7.36080  -5.87404   0.78245  24.12704  30.96397  24.86808  -0.24504
                         -0.25304  -0.04886                      24.86136  -0.24581
 29 -15.03051  -7.64272  -6.32652   0.77210  26.33372  33.72152  27.12432  -0.39956
                         -0.42409  -0.06796                      27.11511  -0.39914
 30 -13.51897  -6.37228  -6.26791   0.77763  26.74781  33.89450  27.40046  -0.40343
                         -0.43988  -0.06983                      27.39386  -0.40212

Timing (quasiparticle equation):   0.43256

Timing:       125
