########################
######### SPEX #########
########################
Version 05.00  (Sep  5, 2019)
Execution time: Jan 18, 2020  16:56:29
Hostname: Ontology
MPI: 3,1


### subroutine: getinput ###

Basic parameters:
  Number of spins            =  1
            centers          =  4
            types            =  2
            equivalent atoms =  2  2
  Lattice parameter =      1.00000
  Lattice vectors   =      3.01411  -5.22060   0.00000
                           3.01411   5.22060   0.00000
                           0.00000   0.00000   9.80579
  Unit-cell volume  =    308.59778
  Reciprocal cutoff =      4.60000

Unit-cell geometry:
  # Ty  El              Coord.
  1  1  Ga   0.33333  -0.33333   0.00000
  2  1  Ga  -0.33333   0.33333   0.50000
  3  2  N    0.33333  -0.33333  -0.37700
  4  2  N   -0.33333   0.33333   0.12300

Symmetry information:
  Number of symmetry operations = 24
   #  Det           Axis           Angle   Syp  Inv
   1    1     --     --     --      --     Yes   1
   2   -1    1.00  -0.58  -0.00   180.00   No    2
   3   -1    1.00   0.58  -0.00   180.00   No    3
   4    1    0.00   0.00   1.00   120.00   Yes   9
   5    1    0.00   0.00   1.00   180.00   No    5
   6   -1    0.58   1.00  -0.00   180.00   Yes   6
   7   -1    1.00  -0.00  -0.00   180.00   Yes   7
   8    1    0.00   0.00   1.00    60.00   No   11
   9    1   -0.00  -0.00  -1.00   120.00   Yes   4
  10   -1   -0.00   1.00  -0.00   180.00   No   10
  11    1   -0.00  -0.00  -1.00    60.00   No    8
  12   -1   -0.58   1.00  -0.00   180.00   Yes  12
  13 - 24  Time reversal symmetries

##################
### Input file ###
##################
BZ       4 4 4
JOB      GW +:(1-30)
MPIKPT   
RESTART  
NBAND    200
KPT      +=(.92222,.92222,0)


Info: Simpson and Lagrange integration is used.

Radial mesh and basis functions:
  Number of radial grid points:       759  429
  Number of radial basis functions:    19   18
  Angular momentum quantum number:      8    6
  Maximal index:                        3

Core states:
  Atom type  1  (Ga)
  nl      Energy
  1s  -375.34991
  2s   -45.88297
  3s    -4.96076
  2p   -39.88207
  3p    -3.15226
  Atom type  2  (N )
  nl      Energy
  1s   -13.54409
  Number of valence electrons:   36

Average Coulomb potential: -0.35487  ( -9.65657 eV )

Read wavefunctions from harddisc... done   ( Timing:    0.31 )

Maximal energy difference in deg. subspaces: 8.9E-14
Minimal energy difference between subspaces: 1.5E-05

Wave functions:
  Number of bands:             198 -  200  (  200 )
            k points (IBZ):     64  (  12 /  30 )
            G vectors:         765
  k points of IBZ:
    1  (0.00000,0.00000,0.00000)  [ 0.00000, 0.00000, 0.00000 ]
    2  (0.00000,0.00000,0.25000)  [ 0.00000, 0.00000, 0.02550 ]
    3  (0.00000,0.00000,0.50000)  [ 0.00000, 0.00000, 0.05099 ]
    4  (0.00000,0.25000,0.00000)  [ 0.04147, 0.02394, 0.00000 ]
    5  (0.00000,0.25000,0.25000)  [ 0.04147, 0.02394, 0.02550 ]
    6  (0.00000,0.25000,0.50000)  [ 0.04147, 0.02394, 0.05099 ]
    7  (0.00000,0.50000,0.00000)  [ 0.08294, 0.04789, 0.00000 ]
    8  (0.00000,0.50000,0.25000)  [ 0.08294, 0.04789, 0.02550 ]
    9  (0.00000,0.50000,0.50000)  [ 0.08294, 0.04789, 0.05099 ]
   10  (0.25000,0.25000,0.00000)  [ 0.08294, 0.00000, 0.00000 ]
   11  (0.25000,0.25000,0.25000)  [ 0.08294, 0.00000, 0.02550 ]
   12  (0.25000,0.25000,0.50000)  [ 0.08294, 0.00000, 0.05099 ]
  k points of EIBZ (shifted set):
   65  (0.92222,0.92222,0.00000)  [ 0.30597, 0.00000, 0.00000 ]
   66  (0.92222,0.92222,0.25000)  [ 0.30597, 0.00000, 0.02550 ]
   67  (0.92222,0.92222,0.50000)  [ 0.30597, 0.00000, 0.05099 ]
   68  (0.92222,0.17222,0.00000)  [ 0.18155,-0.07183, 0.00000 ]
   69  (0.92222,0.17222,0.25000)  [ 0.18155,-0.07183, 0.02550 ]
   70  (0.92222,0.17222,0.50000)  [ 0.18155,-0.07183, 0.05099 ]
   71  (0.92222,0.42222,0.00000)  [ 0.22302,-0.04789, 0.00000 ]
   72  (0.92222,0.42222,0.25000)  [ 0.22302,-0.04789, 0.02550 ]
   73  (0.92222,0.42222,0.50000)  [ 0.22302,-0.04789, 0.05099 ]
   74  (0.92222,0.67222,0.00000)  [ 0.26450,-0.02394, 0.00000 ]
   75  (0.92222,0.67222,0.25000)  [ 0.26450,-0.02394, 0.02550 ]
   76  (0.92222,0.67222,0.50000)  [ 0.26450,-0.02394, 0.05099 ]
   77  (0.17222,0.17222,0.00000)  [ 0.05714, 0.00000, 0.00000 ]
   78  (0.17222,0.17222,0.25000)  [ 0.05714, 0.00000, 0.02550 ]
   79  (0.17222,0.17222,0.50000)  [ 0.05714, 0.00000, 0.05099 ]
   80  (0.17222,0.42222,0.00000)  [ 0.09861, 0.02394, 0.00000 ]
   81  (0.17222,0.42222,0.25000)  [ 0.09861, 0.02394, 0.02550 ]
   82  (0.17222,0.42222,0.50000)  [ 0.09861, 0.02394, 0.05099 ]
   83  (0.17222,0.67222,0.00000)  [ 0.14008, 0.04789, 0.00000 ]
   84  (0.17222,0.67222,0.25000)  [ 0.14008, 0.04789, 0.02550 ]
   85  (0.17222,0.67222,0.50000)  [ 0.14008, 0.04789, 0.05099 ]
   86  (0.42222,0.42222,0.00000)  [ 0.14008, 0.00000, 0.00000 ]
   87  (0.42222,0.42222,0.25000)  [ 0.14008, 0.00000, 0.02550 ]
   88  (0.42222,0.42222,0.50000)  [ 0.14008, 0.00000, 0.05099 ]
   89  (0.42222,0.67222,0.00000)  [ 0.18155, 0.02394, 0.00000 ]
   90  (0.42222,0.67222,0.25000)  [ 0.18155, 0.02394, 0.02550 ]
   91  (0.42222,0.67222,0.50000)  [ 0.18155, 0.02394, 0.05099 ]
   92  (0.67222,0.67222,0.00000)  [ 0.22302, 0.00000, 0.00000 ]
   93  (0.67222,0.67222,0.25000)  [ 0.22302, 0.00000, 0.02550 ]
   94  (0.67222,0.67222,0.50000)  [ 0.22302, 0.00000, 0.05099 ]

Generate wavefunctions at equivalent k points... done   ( Timing:   0.27 )

Size of array cpw:   209.8 MB
Size of array cmt:   260.9 MB

The system is not a metal.
The Fermi energy is placed in the center of the band gap.
KS energy gap:    0.07059528 Ha   (  1.92099521 eV )
Fermi energy:     0.29316457 Ha   (  7.97741378 eV )
Maximal energy:   5.58161318 Ha
Electron count error of the shifted k-point set:  0.0000000000000000

Wave-function checksum:  8.532224058647E-02


### subroutine: checkinput ###

Overlap <core|core>
Atom type  1
1s  1.000000
2s -0.000000  1.000000
3s  0.000000 -0.000001  0.999961
2p  0.999418
3p -0.000329  0.999458
Atom type  2
1s  0.999983

Overlap <core|basis>
Atom type  1
         u(s)    udot(s)
1s  0.000000  0.000000
2s  0.000001  0.000000
3s  0.004767 -0.007551
         u(p)    udot(p)
2p -0.000106 -0.000031
3p  0.017150 -0.021254
Atom type  2
         u(s)    udot(s)
1s  0.003209 -0.002046

Average overlap <core|val>
Atom type  1
1s  0.000000
2s  0.000000
3s  0.000679
2p  0.000010  0.000010  0.000010
3p  0.002206  0.002204  0.002208
Atom type  2
1s  0.000234

Maximum overlap <core|val> at (band/kpoint)
Atom type  1
1s  0.000000 (033/ 001)
2s  0.000001 (033/ 001)
3s  0.004370 (156/ 003)
2p  0.000066 (027/ 094)  0.000064 (024/ 001)  0.000066 (031/ 094)
3p  0.011685 (124/ 003)  0.014817 (111/ 001)  0.012243 (124/ 003)
Atom type  2
1s  0.001654 (001/ 067)

Overlap <basis|basis>
Atom type  1
   u(s)  1.000000
udot(s) -0.000000  0.129862
   u(p)  1.000000
udot(p) -0.000000  0.075237
   u(d)  1.000000
udot(d)  0.000000  0.733838
 ulo(d)  0.410292 -0.767526  1.000000
   u(f)  1.000000
udot(f)  0.000000  0.020278
   u(g)  1.000000
udot(g)  0.000000  0.006703
   u(h)  1.000000
udot(h) -0.000000  0.003149
   u(i)  1.000000
udot(i) -0.000000  0.001726
   u(j)  1.000000
udot(j) -0.000000  0.001039
   u(k)  1.000000
udot(k)  0.000000  0.000667
Atom type  2
   u(s)  1.000000
udot(s) -0.000000  0.023146
   u(p)  1.000000
udot(p)  0.000000  0.036192
   u(d)  1.000000
udot(d)  0.000000  0.003612
   u(f)  1.000000
udot(f) -0.000000  0.001183
   u(g)  1.000000
udot(g)  0.000000  0.000520
   u(h)  1.000000
udot(h) -0.000000  0.000271
   u(i)  1.000000
udot(i) -0.000000  0.000157


### subroutine: mixedbasis ( Mode: vv ) ###

Mixed basis
  Plane-wave basis:
    Number of unique G vectors:   369
    Maximal number of G vectors:  233

  MT basis read in from spex.mb (mode: vv).
    Total number of product-basis functions:  264



##### Job index:  1 #####


### subroutine: correlation ###

< GW self-energy >
Calculate periodic function...done   ( Timing:    0.04 )

=========

K point (   1 ):   0.00000   0.00000   0.00000

Coulomb matrix read from spex.cor
Inverse dielectric matrices read from spex.cor
Invert dielectric tensor... done   ( Timing:    0.03 )
Hermiticity of transformed Coulomb matrix: 5.1E-11

Add contribution to self-energy... done
                               Timings
  MT wave-func. products:      1.80393
  PW wave-func. products:      0.46597
  Matrix-vector products:      2.51455
  Transformations:             0.27786
  Exchange self-energy:        0.18440
  Frequency integration:       0.03288
  Tetrahedron weights:         0.00000
  Gamma-point correction:      0.40636
  MPI idle time:               0.01146      0.03641
  Other:                       0.19006
  ------------------------------------
  Total:                       5.88747

=========

K point (   2 ):   0.00000   0.00000   0.25000

Coulomb matrix read from spex.cor
Inverse dielectric matrices read from spex.cor
Hermiticity of transformed Coulomb matrix: 5.9E-10

Add contribution to self-energy... done
                               Timings
  MT wave-func. products:      1.78171
  PW wave-func. products:      0.39236
  Matrix-vector products:      2.43315
  Transformations:             0.23271
  Exchange self-energy:        0.16420
  Frequency integration:       0.05719
  Tetrahedron weights:         0.00000
  MPI idle time:               0.02607      0.02607
  Other:                       0.16677
  ------------------------------------
  Total:                       5.25416

=========

K point (   3 ):   0.00000   0.00000   0.50000

Coulomb matrix read from spex.cor
Inverse dielectric matrices read from spex.cor
Hermiticity of transformed Coulomb matrix: 1.8E-10

Add contribution to self-energy... done
                               Timings
  MT wave-func. products:      1.67082
  PW wave-func. products:      0.41175
  Matrix-vector products:      2.61837
  Transformations:             0.26559
  Exchange self-energy:        0.13869
  Frequency integration:       0.06558
  Tetrahedron weights:         0.00000
  MPI idle time:               0.00601      0.02046
  Other:                       0.14435
  ------------------------------------
  Total:                       5.32115

=========

K point (   4 ):   0.00000   0.25000   0.00000

Coulomb matrix read from spex.cor
Inverse dielectric matrices read from spex.cor
Hermiticity of transformed Coulomb matrix: 8.5E-11

Add contribution to self-energy... done
                               Timings
  MT wave-func. products:      3.04881
  PW wave-func. products:      0.73829
  Matrix-vector products:      7.05154
  Transformations:             0.83487
  Exchange self-energy:        0.19340
  Frequency integration:       0.14679
  Tetrahedron weights:         0.00000
  MPI idle time:               0.01603      0.02680
  Other:                       0.53842
  ------------------------------------
  Total:                      12.56816

=========

K point (   5 ):   0.00000   0.25000   0.25000

Coulomb matrix read from spex.cor
Inverse dielectric matrices read from spex.cor
Hermiticity of transformed Coulomb matrix: 9.7E-11

Add contribution to self-energy... done
                               Timings
  MT wave-func. products:      3.22672
  PW wave-func. products:      0.77091
  Matrix-vector products:      6.84383
  Transformations:             0.85912
  Exchange self-energy:        0.19973
  Frequency integration:       0.13797
  Tetrahedron weights:         0.00000
  MPI idle time:               0.02692      0.02692
  Other:                       0.52545
  ------------------------------------
  Total:                      12.59064

=========

K point (   6 ):   0.00000   0.25000   0.50000

Coulomb matrix read from spex.cor
Inverse dielectric matrices read from spex.cor
Hermiticity of transformed Coulomb matrix: 9.8E-11

Add contribution to self-energy... done
                               Timings
  MT wave-func. products:      2.97429
  PW wave-func. products:      0.76112
  Matrix-vector products:      7.20821
  Transformations:             0.86878
  Exchange self-energy:        0.27141
  Frequency integration:       0.14063
  Tetrahedron weights:         0.00000
  MPI idle time:               0.00677      0.02044
  Other:                       0.52032
  ------------------------------------
  Total:                      12.75153

=========

K point (   7 ):   0.00000   0.50000   0.00000

Coulomb matrix read from spex.cor
Inverse dielectric matrices read from spex.cor
Hermiticity of transformed Coulomb matrix: 1.0E-10

Add contribution to self-energy... done
                               Timings
  MT wave-func. products:      2.44880
  PW wave-func. products:      0.52235
  Matrix-vector products:      4.21193
  Transformations:             0.55647
  Exchange self-energy:        0.16017
  Frequency integration:       0.04054
  Tetrahedron weights:         0.00000
  MPI idle time:               0.01450      0.01450
  Other:                       0.30835
  ------------------------------------
  Total:                       8.26312

=========

K point (   8 ):   0.00000   0.50000   0.25000

Coulomb matrix read from spex.cor
Inverse dielectric matrices read from spex.cor
Hermiticity of transformed Coulomb matrix: 5.3E-11

Add contribution to self-energy... done
                               Timings
  MT wave-func. products:      2.50648
  PW wave-func. products:      0.52766
  Matrix-vector products:      3.83829
  Transformations:             0.57315
  Exchange self-energy:        0.19387
  Frequency integration:       0.11198
  Tetrahedron weights:         0.00000
  MPI idle time:               0.00003      0.04334
  Other:                       0.28205
  ------------------------------------
  Total:                       8.03353

=========

K point (   9 ):   0.00000   0.50000   0.50000

Coulomb matrix read from spex.cor
Inverse dielectric matrices read from spex.cor
Hermiticity of transformed Coulomb matrix: 4.1E-11

Add contribution to self-energy... done
                               Timings
  MT wave-func. products:      2.29023
  PW wave-func. products:      0.49604
  Matrix-vector products:      4.65136
  Transformations:             0.54697
  Exchange self-energy:        0.15883
  Frequency integration:       0.09357
  Tetrahedron weights:         0.00000
  MPI idle time:               0.02425      0.03732
  Other:                       0.35038
  ------------------------------------
  Total:                       8.61163

=========

K point (  10 ):   0.25000   0.25000   0.00000

Coulomb matrix read from spex.cor
Inverse dielectric matrices read from spex.cor
Hermiticity of transformed Coulomb matrix: 3.6E-11

Add contribution to self-energy... done
                               Timings
  MT wave-func. products:      3.77857
  PW wave-func. products:      0.92973
  Matrix-vector products:      8.48609
  Transformations:             1.14639
  Exchange self-energy:        0.26185
  Frequency integration:       0.19572
  Tetrahedron weights:         0.00000
  MPI idle time:               0.03095      0.03095
  Other:                       0.70862
  ------------------------------------
  Total:                      15.53793

=========

K point (  11 ):   0.25000   0.25000   0.25000

Coulomb matrix read from spex.cor
Inverse dielectric matrices read from spex.cor
Hermiticity of transformed Coulomb matrix: 5.4E-11

Add contribution to self-energy... done
                               Timings
  MT wave-func. products:      3.87154
  PW wave-func. products:      0.97896
  Matrix-vector products:      9.08615
  Transformations:             1.15393
  Exchange self-energy:        0.37862
  Frequency integration:       0.25852
  Tetrahedron weights:         0.00000
  MPI idle time:               0.00735      0.01373
  Other:                       0.73398
  ------------------------------------
  Total:                      16.46906

=========

K point (  12 ):   0.25000   0.25000   0.50000

Coulomb matrix read from spex.cor
Inverse dielectric matrices read from spex.cor
Hermiticity of transformed Coulomb matrix: 6.5E-11

Add contribution to self-energy... done
                               Timings
  MT wave-func. products:      3.59055
  PW wave-func. products:      1.10002
  Matrix-vector products:     14.36397
  Transformations:             1.17850
  Exchange self-energy:        0.24867
  Frequency integration:       0.37494
  Tetrahedron weights:         0.00000
  MPI idle time:               0.00003      0.04314
  Other:                       0.67099
  ------------------------------------
  Total:                      21.52766


### subroutine: exchange_core ###

        k point       band      exchange (core contribution)
  (0.922,0.922,0.000)   1     -1.9933064
  (0.922,0.922,0.000)   2     -8.0518936
  (0.922,0.922,0.000)   3    -17.7571320
  (0.922,0.922,0.000)   4    -17.8127362
  (0.922,0.922,0.000)   5    -17.4671923
  (0.922,0.922,0.000)   6    -17.9496216
  (0.922,0.922,0.000)   7    -17.9242748
  (0.922,0.922,0.000)   8    -18.4182390
  (0.922,0.922,0.000)   9    -18.4489084
  (0.922,0.922,0.000)  10    -18.5574237
  (0.922,0.922,0.000)  11    -18.6621327
  (0.922,0.922,0.000)  12    -12.3729506
  (0.922,0.922,0.000)  13     -1.3377257
  (0.922,0.922,0.000)  14     -1.9279285
  (0.922,0.922,0.000)  15     -2.0589179
  (0.922,0.922,0.000)  16     -2.1744066
  (0.922,0.922,0.000)  17     -2.0614057
  (0.922,0.922,0.000)  18     -2.1413636
  (0.922,0.922,0.000)  19     -1.8867595
  (0.922,0.922,0.000)  20     -2.2130538
  (0.922,0.922,0.000)  21     -1.3198719
  (0.922,0.922,0.000)  22     -1.8857763
  (0.922,0.922,0.000)  23     -1.9677591
  (0.922,0.922,0.000)  24     -2.0776786
  (0.922,0.922,0.000)  25     -1.8167904
  (0.922,0.922,0.000)  26     -1.9692536
  (0.922,0.922,0.000)  27     -1.4672569
  (0.922,0.922,0.000)  28     -1.3741100
  (0.922,0.922,0.000)  29     -1.0180448
  (0.922,0.922,0.000)  30     -1.3305734
Timing:   0.09




### subroutine: quasiparticle ###

Number of mesh points even: No constraint will be used.

List of k points
    0   0.92222   0.92222   0.00000  (additional)



#####################
### K POINT:    0 ###
#####################


--- DIAGONAL ELEMENTS [eV] ---

 Bd       vxc    sigmax    sigmac         Z        KS        HF          GW lin/dir
  1 -17.37356 -27.13947   8.17358   0.73586  -8.78609 -18.55199  -9.84583   1.03242
                          1.20127  -0.09323                      -9.85144   1.01654
  2 -27.56764 -38.81155   8.78602   0.72702  -8.01237 -19.25629  -9.77237   0.57477
                          0.65055  -0.04142                      -9.72240   0.54852
  3 -42.27769 -55.57888   9.50512   0.73651  -6.41407 -19.71526  -9.20869   0.11705
                          0.07501  -0.01628                      -9.10906   0.14274
  4 -42.38256 -55.69370   9.51396   0.73630  -6.39603 -19.70718  -9.19074   0.11400
                          0.07223  -0.01602                      -9.09081   0.13999
  5 -41.78153 -54.97634   9.44882   0.73569  -6.36228 -19.55709  -9.11663   0.13107
                          0.08623  -0.01806                      -9.02012   0.15677
  6 -42.58102 -55.90270   9.49945   0.73786  -6.34005 -19.66172  -9.15935   0.10548
                          0.06575  -0.01490                      -9.05815   0.13117
  7 -42.55744 -55.87341   9.50597   0.73759  -6.31879 -19.63475  -9.12789   0.11155
                          0.07063  -0.01561                      -9.02776   0.13716
  8 -43.28267 -56.63434   9.43843   0.74279  -6.18282 -19.53449  -9.08928   0.05406
                          0.02775  -0.00855                      -8.98014   0.07839
  9 -43.33784 -56.69945   9.44533   0.74284  -6.17087 -19.53249  -9.07980   0.05386
                          0.02763  -0.00851                      -8.97050   0.07819
 10 -43.54530 -56.93303   9.47777   0.74258  -6.09904 -19.48676  -9.00217   0.06110
                          0.03258  -0.00944                      -8.89421   0.08595
 11 -43.73680 -57.14961   9.49444   0.74284  -6.06793 -19.48074  -8.97838   0.05823
                          0.03058  -0.00906                      -8.86979   0.08297
 12 -34.40588 -45.82785   8.66709   0.73822  -4.71446 -16.13643  -6.72564   0.43660
                          0.35345  -0.06377                      -6.73003   0.43978
 13 -14.68906 -20.21952   4.26222   0.73201   0.26616  -5.26429  -0.65997   0.09617
                          0.08689  -0.02568                      -0.64737   0.09994
 14 -17.95337 -22.09116   3.16482   0.76943   4.87802   0.74022   4.12939   0.00323
                          0.00186  -0.00185                       4.13564   0.00392
 15 -18.52812 -22.48301   3.05065   0.77111   5.41408   1.45919   4.71681   0.00179
                          0.00086  -0.00125                       4.72199   0.00235
 16 -19.16291 -22.86261   2.91433   0.77318   5.92184   2.22214   5.31461   0.00109
                          0.00056  -0.00083                       5.31828   0.00140
 17 -19.78151 -23.31021   2.84558   0.77463   6.81221   3.28351   6.28305   0.00058
                          0.00044  -0.00034                       6.28560   0.00065
 18 -19.93973 -23.62397   2.96754   0.77388   6.81456   3.13032   6.25992   0.00066
                          0.00046  -0.00043                       6.26280   0.00077
 19 -16.37176 -12.01304  -3.48112   0.79297  10.11373  14.47245  10.80965   0.00406
                          0.00691  -0.00161                      10.80669   0.00152
 20 -15.81034 -10.37697  -4.30972   0.80266  12.28307  17.71644  13.18498  -0.00301
                          0.00054  -0.00306                      13.17809  -0.00522
 21 -14.97874  -8.68548  -5.19354   0.77116  15.83142  22.12468  16.67907  -0.03790
                         -0.02928  -0.01394                      16.67120  -0.04071
 22 -13.32749  -7.61786  -4.80293   0.81061  15.83644  21.54607  16.57122  -0.02522
                         -0.01987  -0.01005                      16.56644  -0.02668
 23 -14.14857  -7.95272  -5.13231   0.79762  17.47821  23.67406  18.32594  -0.04617
                         -0.03774  -0.01510                      18.31896  -0.04851
 24 -14.07305  -7.82898  -5.18714   0.79843  17.94902  24.19310  18.79220  -0.05142
                         -0.04237  -0.01665                      18.78525  -0.05385
 25 -14.21166  -7.80306  -5.31778   0.79042  17.99473  24.40333  18.85599  -0.06072
                         -0.05156  -0.01830                      18.84852  -0.06328
 26 -14.55183  -7.94958  -5.45695   0.78687  19.16989  25.77214  20.06955  -0.08028
                         -0.06985  -0.02211                      20.06110  -0.08319
 27 -12.39866  -6.47663  -5.25225   0.79984  20.59695  26.51898  21.13003  -0.09680
                         -0.09864  -0.02673                      21.12718  -0.09737
 28 -12.17909  -6.29452  -5.30363   0.79799  21.54482  27.42939  22.00420  -0.12421
                         -0.13263  -0.03163                      22.00196  -0.12437
 29 -10.81418  -4.53847  -5.91065   0.78625  24.52169  30.79740  24.79143  -0.26515
                         -0.31147  -0.05550                      24.79030  -0.26407
 30 -11.88690  -5.26871  -6.08563   0.77980  25.17908  31.79727  25.57274  -0.31031
                         -0.35651  -0.06066                      25.57025  -0.30892

Timing (quasiparticle equation):   0.44579

Timing:       134
