########################
######### SPEX #########
########################
Version 05.00  (Sep  5, 2019)
Execution time: Jan 18, 2020  16:16:23
Hostname: Ontology
MPI: 3,1


### subroutine: getinput ###

Basic parameters:
  Number of spins            =  1
            centers          =  4
            types            =  2
            equivalent atoms =  2  2
  Lattice parameter =      1.00000
  Lattice vectors   =      3.01411  -5.22060   0.00000
                           3.01411   5.22060   0.00000
                           0.00000   0.00000   9.80579
  Unit-cell volume  =    308.59778
  Reciprocal cutoff =      4.60000

Unit-cell geometry:
  # Ty  El              Coord.
  1  1  Ga   0.33333  -0.33333   0.00000
  2  1  Ga  -0.33333   0.33333   0.50000
  3  2  N    0.33333  -0.33333  -0.37700
  4  2  N   -0.33333   0.33333   0.12300

Symmetry information:
  Number of symmetry operations = 24
   #  Det           Axis           Angle   Syp  Inv
   1    1     --     --     --      --     Yes   1
   2   -1    1.00  -0.58  -0.00   180.00   No    2
   3   -1    1.00   0.58  -0.00   180.00   No    3
   4    1    0.00   0.00   1.00   120.00   Yes   9
   5    1    0.00   0.00   1.00   180.00   No    5
   6   -1    0.58   1.00  -0.00   180.00   Yes   6
   7   -1    1.00  -0.00  -0.00   180.00   Yes   7
   8    1    0.00   0.00   1.00    60.00   No   11
   9    1   -0.00  -0.00  -1.00   120.00   Yes   4
  10   -1   -0.00   1.00  -0.00   180.00   No   10
  11    1   -0.00  -0.00  -1.00    60.00   No    8
  12   -1   -0.58   1.00  -0.00   180.00   Yes  12
  13 - 24  Time reversal symmetries

##################
### Input file ###
##################
BZ       4 4 4
JOB      GW +:(1-30)
MPIKPT   
RESTART  
NBAND    200
KPT      +=(.21153,1.00000,0)

#  k point is converted from (0.21153,1.00000,0.00000) to (0.21153,0.00000,0.00000)

Info: Simpson and Lagrange integration is used.

Radial mesh and basis functions:
  Number of radial grid points:       759  429
  Number of radial basis functions:    19   18
  Angular momentum quantum number:      8    6
  Maximal index:                        3

Core states:
  Atom type  1  (Ga)
  nl      Energy
  1s  -375.34991
  2s   -45.88297
  3s    -4.96076
  2p   -39.88207
  3p    -3.15226
  Atom type  2  (N )
  nl      Energy
  1s   -13.54409
  Number of valence electrons:   36

Average Coulomb potential: -0.35487  ( -9.65657 eV )

Read wavefunctions from harddisc... done   ( Timing:    0.27 )

Maximal energy difference in deg. subspaces: 6.8E-12
Minimal energy difference between subspaces: 4.5E-06

Wave functions:
  Number of bands:             198 -  200  (  200 )
            k points (IBZ):     64  (  12 /  30 )
            G vectors:         746
  k points of IBZ:
    1  (0.00000,0.00000,0.00000)  [ 0.00000, 0.00000, 0.00000 ]
    2  (0.00000,0.00000,0.25000)  [ 0.00000, 0.00000, 0.02550 ]
    3  (0.00000,0.00000,0.50000)  [ 0.00000, 0.00000, 0.05099 ]
    4  (0.00000,0.25000,0.00000)  [ 0.04147, 0.02394, 0.00000 ]
    5  (0.00000,0.25000,0.25000)  [ 0.04147, 0.02394, 0.02550 ]
    6  (0.00000,0.25000,0.50000)  [ 0.04147, 0.02394, 0.05099 ]
    7  (0.00000,0.50000,0.00000)  [ 0.08294, 0.04789, 0.00000 ]
    8  (0.00000,0.50000,0.25000)  [ 0.08294, 0.04789, 0.02550 ]
    9  (0.00000,0.50000,0.50000)  [ 0.08294, 0.04789, 0.05099 ]
   10  (0.25000,0.25000,0.00000)  [ 0.08294, 0.00000, 0.00000 ]
   11  (0.25000,0.25000,0.25000)  [ 0.08294, 0.00000, 0.02550 ]
   12  (0.25000,0.25000,0.50000)  [ 0.08294, 0.00000, 0.05099 ]
  k points of EIBZ (shifted set):
   65  (0.21153,0.00000,0.00000)  [ 0.03509,-0.02026, 0.00000 ]
   66  (0.21153,0.00000,0.25000)  [ 0.03509,-0.02026, 0.02550 ]
   67  (0.21153,0.00000,0.50000)  [ 0.03509,-0.02026, 0.05099 ]
   68  (0.21153,0.25000,0.00000)  [ 0.07656, 0.00368, 0.00000 ]
   69  (0.21153,0.25000,0.25000)  [ 0.07656, 0.00368, 0.02550 ]
   70  (0.21153,0.25000,0.50000)  [ 0.07656, 0.00368, 0.05099 ]
   71  (0.21153,0.50000,0.00000)  [ 0.11803, 0.02763, 0.00000 ]
   72  (0.21153,0.50000,0.25000)  [ 0.11803, 0.02763, 0.02550 ]
   73  (0.21153,0.50000,0.50000)  [ 0.11803, 0.02763, 0.05099 ]
   74  (0.21153,0.75000,0.00000)  [ 0.15950, 0.05157, 0.00000 ]
   75  (0.21153,0.75000,0.25000)  [ 0.15950, 0.05157, 0.02550 ]
   76  (0.21153,0.75000,0.50000)  [ 0.15950, 0.05157, 0.05099 ]
   77  (0.46153,0.00000,0.00000)  [ 0.07656,-0.04420, 0.00000 ]
   78  (0.46153,0.00000,0.25000)  [ 0.07656,-0.04420, 0.02550 ]
   79  (0.46153,0.00000,0.50000)  [ 0.07656,-0.04420, 0.05099 ]
   80  (0.46153,0.25000,0.00000)  [ 0.11803,-0.02026, 0.00000 ]
   81  (0.46153,0.25000,0.25000)  [ 0.11803,-0.02026, 0.02550 ]
   82  (0.46153,0.25000,0.50000)  [ 0.11803,-0.02026, 0.05099 ]
   83  (0.46153,0.50000,0.00000)  [ 0.15950, 0.00368, 0.00000 ]
   84  (0.46153,0.50000,0.25000)  [ 0.15950, 0.00368, 0.02550 ]
   85  (0.46153,0.50000,0.50000)  [ 0.15950, 0.00368, 0.05099 ]
   86  (0.71153,0.00000,0.00000)  [ 0.11803,-0.06815, 0.00000 ]
   87  (0.71153,0.00000,0.25000)  [ 0.11803,-0.06815, 0.02550 ]
   88  (0.71153,0.00000,0.50000)  [ 0.11803,-0.06815, 0.05099 ]
   89  (0.71153,0.25000,0.00000)  [ 0.15950,-0.04420, 0.00000 ]
   90  (0.71153,0.25000,0.25000)  [ 0.15950,-0.04420, 0.02550 ]
   91  (0.71153,0.25000,0.50000)  [ 0.15950,-0.04420, 0.05099 ]
   92  (0.96153,0.00000,0.00000)  [ 0.15950,-0.09209, 0.00000 ]
   93  (0.96153,0.00000,0.25000)  [ 0.15950,-0.09209, 0.02550 ]
   94  (0.96153,0.00000,0.50000)  [ 0.15950,-0.09209, 0.05099 ]

Generate wavefunctions at equivalent k points... done   ( Timing:   0.26 )

Size of array cpw:   209.8 MB
Size of array cmt:   260.9 MB

The system is not a metal.
The Fermi energy is placed in the center of the band gap.
KS energy gap:    0.07059528 Ha   (  1.92099521 eV )
Fermi energy:     0.29316457 Ha   (  7.97741378 eV )
Maximal energy:   5.57793645 Ha
Electron count error of the shifted k-point set:  0.0000000000000000

Wave-function checksum: -7.762409016663E-02


### subroutine: checkinput ###

Overlap <core|core>
Atom type  1
1s  1.000000
2s -0.000000  1.000000
3s  0.000000 -0.000001  0.999961
2p  0.999418
3p -0.000329  0.999458
Atom type  2
1s  0.999983

Overlap <core|basis>
Atom type  1
         u(s)    udot(s)
1s  0.000000  0.000000
2s  0.000001  0.000000
3s  0.004767 -0.007551
         u(p)    udot(p)
2p -0.000106 -0.000031
3p  0.017150 -0.021254
Atom type  2
         u(s)    udot(s)
1s  0.003209 -0.002046

Average overlap <core|val>
Atom type  1
1s  0.000000
2s  0.000000
3s  0.000679
2p  0.000010  0.000010  0.000010
3p  0.002210  0.002205  0.002210
Atom type  2
1s  0.000234

Maximum overlap <core|val> at (band/kpoint)
Atom type  1
1s  0.000000 (033/ 001)
2s  0.000001 (033/ 001)
3s  0.004352 (156/ 003)
2p  0.000067 (024/ 003)  0.000064 (024/ 092)  0.000071 (026/ 003)
3p  0.011531 (124/ 094)  0.014817 (111/ 001)  0.011531 (124/ 094)
Atom type  2
1s  0.001675 (001/ 094)

Overlap <basis|basis>
Atom type  1
   u(s)  1.000000
udot(s) -0.000000  0.129862
   u(p)  1.000000
udot(p) -0.000000  0.075237
   u(d)  1.000000
udot(d)  0.000000  0.733838
 ulo(d)  0.410292 -0.767526  1.000000
   u(f)  1.000000
udot(f)  0.000000  0.020278
   u(g)  1.000000
udot(g)  0.000000  0.006703
   u(h)  1.000000
udot(h) -0.000000  0.003149
   u(i)  1.000000
udot(i) -0.000000  0.001726
   u(j)  1.000000
udot(j) -0.000000  0.001039
   u(k)  1.000000
udot(k)  0.000000  0.000667
Atom type  2
   u(s)  1.000000
udot(s) -0.000000  0.023146
   u(p)  1.000000
udot(p)  0.000000  0.036192
   u(d)  1.000000
udot(d)  0.000000  0.003612
   u(f)  1.000000
udot(f) -0.000000  0.001183
   u(g)  1.000000
udot(g)  0.000000  0.000520
   u(h)  1.000000
udot(h) -0.000000  0.000271
   u(i)  1.000000
udot(i) -0.000000  0.000157


### subroutine: mixedbasis ( Mode: vv ) ###

Mixed basis
  Plane-wave basis:
    Number of unique G vectors:   353
    Maximal number of G vectors:  233

  MT basis read in from spex.mb (mode: vv).
    Total number of product-basis functions:  264



##### Job index:  1 #####


### subroutine: correlation ###

< GW self-energy >
Calculate periodic function...done   ( Timing:    0.04 )

=========

K point (   1 ):   0.00000   0.00000   0.00000

Coulomb matrix read from spex.cor
Inverse dielectric matrices read from spex.cor
Invert dielectric tensor... done   ( Timing:    0.02 )
Hermiticity of transformed Coulomb matrix: 5.1E-11

Add contribution to self-energy... done
                               Timings
  MT wave-func. products:      1.44853
  PW wave-func. products:      0.43418
  Matrix-vector products:      2.02407
  Transformations:             0.27102
  Exchange self-energy:        0.15434
  Frequency integration:       0.07941
  Tetrahedron weights:         0.00000
  Gamma-point correction:      0.40352
  MPI idle time:               0.01213      0.02000
  Other:                       0.08784
  ------------------------------------
  Total:                       4.91504

=========

K point (   2 ):   0.00000   0.00000   0.25000

Coulomb matrix read from spex.cor
Inverse dielectric matrices read from spex.cor
Hermiticity of transformed Coulomb matrix: 5.9E-10

Add contribution to self-energy... done
                               Timings
  MT wave-func. products:      1.32775
  PW wave-func. products:      0.39144
  Matrix-vector products:      2.34630
  Transformations:             0.23566
  Exchange self-energy:        0.13043
  Frequency integration:       0.03469
  Tetrahedron weights:         0.00000
  MPI idle time:               0.00687      0.02523
  Other:                       0.24377
  ------------------------------------
  Total:                       4.71693

=========

K point (   3 ):   0.00000   0.00000   0.50000

Coulomb matrix read from spex.cor
Inverse dielectric matrices read from spex.cor
Hermiticity of transformed Coulomb matrix: 1.8E-10

Add contribution to self-energy... done
                               Timings
  MT wave-func. products:      1.42616
  PW wave-func. products:      0.35823
  Matrix-vector products:      2.19855
  Transformations:             0.22970
  Exchange self-energy:        0.13439
  Frequency integration:       0.01713
  Tetrahedron weights:         0.00000
  MPI idle time:               0.01125      0.01125
  Other:                       0.17639
  ------------------------------------
  Total:                       4.55180

=========

K point (   4 ):   0.00000   0.25000   0.00000

Coulomb matrix read from spex.cor
Inverse dielectric matrices read from spex.cor
Hermiticity of transformed Coulomb matrix: 8.5E-11

Add contribution to self-energy... done
                               Timings
  MT wave-func. products:      3.24495
  PW wave-func. products:      0.87726
  Matrix-vector products:      8.80351
  Transformations:             1.05982
  Exchange self-energy:        0.17948
  Frequency integration:       0.17116
  Tetrahedron weights:         0.00000
  MPI idle time:               0.01378      0.03880
  Other:                       0.67008
  ------------------------------------
  Total:                      15.02003

=========

K point (   5 ):   0.00000   0.25000   0.25000

Coulomb matrix read from spex.cor
Inverse dielectric matrices read from spex.cor
Hermiticity of transformed Coulomb matrix: 9.7E-11

Add contribution to self-energy... done
                               Timings
  MT wave-func. products:      3.26025
  PW wave-func. products:      0.87379
  Matrix-vector products:      7.95787
  Transformations:             1.08194
  Exchange self-energy:        0.22216
  Frequency integration:       0.16465
  Tetrahedron weights:         0.00000
  MPI idle time:               0.02934      0.02934
  Other:                       0.88994
  ------------------------------------
  Total:                      14.47993

=========

K point (   6 ):   0.00000   0.25000   0.50000

Coulomb matrix read from spex.cor
Inverse dielectric matrices read from spex.cor
Hermiticity of transformed Coulomb matrix: 9.8E-11

Add contribution to self-energy... done
                               Timings
  MT wave-func. products:      3.13710
  PW wave-func. products:      0.87672
  Matrix-vector products:      9.45083
  Transformations:             1.15579
  Exchange self-energy:        0.46195
  Frequency integration:       0.16744
  Tetrahedron weights:         0.00000
  MPI idle time:               0.00007      0.01817
  Other:                       0.68778
  ------------------------------------
  Total:                      15.93768

=========

K point (   7 ):   0.00000   0.50000   0.00000

Coulomb matrix read from spex.cor
Inverse dielectric matrices read from spex.cor
Hermiticity of transformed Coulomb matrix: 1.0E-10

Add contribution to self-energy... done
                               Timings
  MT wave-func. products:      2.03291
  PW wave-func. products:      0.51799
  Matrix-vector products:      4.43153
  Transformations:             0.51409
  Exchange self-energy:        0.16190
  Frequency integration:       0.06018
  Tetrahedron weights:         0.00000
  MPI idle time:               0.00004      0.01711
  Other:                       0.33787
  ------------------------------------
  Total:                       8.05651

=========

K point (   8 ):   0.00000   0.50000   0.25000

Coulomb matrix read from spex.cor
Inverse dielectric matrices read from spex.cor
Hermiticity of transformed Coulomb matrix: 5.3E-11

Add contribution to self-energy... done
                               Timings
  MT wave-func. products:      2.26884
  PW wave-func. products:      0.47042
  Matrix-vector products:      3.81886
  Transformations:             0.52180
  Exchange self-energy:        0.18267
  Frequency integration:       0.06691
  Tetrahedron weights:         0.00000
  MPI idle time:               0.01479      0.01730
  Other:                       0.27142
  ------------------------------------
  Total:                       7.61572

=========

K point (   9 ):   0.00000   0.50000   0.50000

Coulomb matrix read from spex.cor
Inverse dielectric matrices read from spex.cor
Hermiticity of transformed Coulomb matrix: 4.1E-11

Add contribution to self-energy... done
                               Timings
  MT wave-func. products:      2.22327
  PW wave-func. products:      0.46532
  Matrix-vector products:      4.57659
  Transformations:             0.50645
  Exchange self-energy:        0.11935
  Frequency integration:       0.08054
  Tetrahedron weights:         0.00000
  MPI idle time:               0.00002      0.01302
  Other:                       0.28751
  ------------------------------------
  Total:                       8.25905

=========

K point (  10 ):   0.25000   0.25000   0.00000

Coulomb matrix read from spex.cor
Inverse dielectric matrices read from spex.cor
Hermiticity of transformed Coulomb matrix: 3.6E-11

Add contribution to self-energy... done
                               Timings
  MT wave-func. products:      2.83859
  PW wave-func. products:      0.67970
  Matrix-vector products:      6.60670
  Transformations:             0.80444
  Exchange self-energy:        0.16219
  Frequency integration:       0.15121
  Tetrahedron weights:         0.00000
  MPI idle time:               0.00003      0.01320
  Other:                       0.48188
  ------------------------------------
  Total:                      11.72473

=========

K point (  11 ):   0.25000   0.25000   0.25000

Coulomb matrix read from spex.cor
Inverse dielectric matrices read from spex.cor
Hermiticity of transformed Coulomb matrix: 5.4E-11

Add contribution to self-energy... done
                               Timings
  MT wave-func. products:      2.61366
  PW wave-func. products:      0.67287
  Matrix-vector products:      5.60348
  Transformations:             0.85506
  Exchange self-energy:        0.32787
  Frequency integration:       0.14899
  Tetrahedron weights:         0.00000
  MPI idle time:               0.00918      0.01606
  Other:                       0.55034
  ------------------------------------
  Total:                      10.78145

=========

K point (  12 ):   0.25000   0.25000   0.50000

Coulomb matrix read from spex.cor
Inverse dielectric matrices read from spex.cor
Hermiticity of transformed Coulomb matrix: 6.5E-11

Add contribution to self-energy... done
                               Timings
  MT wave-func. products:      2.71467
  PW wave-func. products:      0.67134
  Matrix-vector products:     10.29417
  Transformations:             0.83489
  Exchange self-energy:        0.16654
  Frequency integration:       0.26083
  Tetrahedron weights:         0.00000
  MPI idle time:               0.01417      0.01485
  Other:                       0.58418
  ------------------------------------
  Total:                      15.54078


### subroutine: exchange_core ###

        k point       band      exchange (core contribution)
  (0.212,0.000,0.000)   1     -2.7668334
  (0.212,0.000,0.000)   2     -8.5088258
  (0.212,0.000,0.000)   3    -17.8147072
  (0.212,0.000,0.000)   4    -17.8753919
  (0.212,0.000,0.000)   5    -17.8448756
  (0.212,0.000,0.000)   6    -18.1105128
  (0.212,0.000,0.000)   7    -16.9307574
  (0.212,0.000,0.000)   8    -18.3618871
  (0.212,0.000,0.000)   9    -18.4625544
  (0.212,0.000,0.000)  10    -18.2808145
  (0.212,0.000,0.000)  11    -18.6754633
  (0.212,0.000,0.000)  12    -11.9809498
  (0.212,0.000,0.000)  13     -1.4118055
  (0.212,0.000,0.000)  14     -1.8857632
  (0.212,0.000,0.000)  15     -2.5122735
  (0.212,0.000,0.000)  16     -1.6855060
  (0.212,0.000,0.000)  17     -1.9846620
  (0.212,0.000,0.000)  18     -2.0557834
  (0.212,0.000,0.000)  19     -1.7896211
  (0.212,0.000,0.000)  20     -2.2078667
  (0.212,0.000,0.000)  21     -1.5251937
  (0.212,0.000,0.000)  22     -1.7332355
  (0.212,0.000,0.000)  23     -1.7683122
  (0.212,0.000,0.000)  24     -2.0249960
  (0.212,0.000,0.000)  25     -1.8208933
  (0.212,0.000,0.000)  26     -1.8950799
  (0.212,0.000,0.000)  27     -1.6533179
  (0.212,0.000,0.000)  28     -1.4938360
  (0.212,0.000,0.000)  29     -1.2945118
  (0.212,0.000,0.000)  30     -1.7955202
Timing:   0.09




### subroutine: quasiparticle ###

Number of mesh points even: No constraint will be used.

List of k points
    0   0.21153   0.00000   0.00000  (additional)



#####################
### K POINT:    0 ###
#####################


--- DIAGONAL ELEMENTS [eV] ---

 Bd       vxc    sigmax    sigmac         Z        KS        HF          GW lin/dir
  1 -18.76579 -28.70125   8.22437   0.73581  -8.57681 -18.51228  -9.74581   0.95331
                          1.10634  -0.08138                      -9.74764   0.92909
  2 -28.31802 -39.68128   8.82812   0.72500  -7.96797 -19.33123  -9.78403   0.53119
                          0.60619  -0.03617                      -9.72619   0.50840
  3 -42.37357 -55.68034   9.50483   0.73691  -6.38980 -19.69657  -9.19033   0.11468
                          0.07315  -0.01598                      -9.09045   0.14030
  4 -42.48579 -55.80807   9.51830   0.73669  -6.37123 -19.69351  -9.17246   0.11255
                          0.07114  -0.01581                      -9.07228   0.13846
  5 -42.39751 -55.67965   9.47734   0.73768  -6.31509 -19.59723  -9.12071   0.11108
                          0.07018  -0.01559                      -9.02070   0.13676
  6 -42.87202 -56.23527   9.53156   0.73824  -6.28167 -19.64493  -9.10941   0.10535
                          0.06566  -0.01484                      -9.00807   0.13098
  7 -40.88582 -53.89457   9.35446   0.73506  -6.24182 -19.25056  -8.92543   0.16386
                          0.11410  -0.02189                      -8.83541   0.18847
  8 -43.17991 -56.52274   9.43597   0.74252  -6.20001 -19.54283  -9.10067   0.05727
                          0.03009  -0.00894                      -8.99207   0.08165
  9 -43.36523 -56.73131   9.45180   0.74273  -6.16252 -19.52859  -9.06951   0.05480
                          0.02827  -0.00864                      -8.96038   0.07922
 10 -43.08113 -56.39614   9.44439   0.74172  -6.11367 -19.42868  -8.98409   0.07602
                          0.04396  -0.01122                      -8.87927   0.10070
 11 -43.75937 -57.17249   9.49416   0.74288  -6.06384 -19.47695  -8.97489   0.05689
                          0.02959  -0.00891                      -8.86611   0.08165
 12 -33.89366 -45.17600   8.59449   0.73875  -4.55700 -15.83934  -6.52045   0.43198
                          0.36065  -0.06159                      -6.51265   0.42874
 13 -14.97546 -20.36892   4.15518   0.73539   0.61212  -4.78134  -0.29692   0.07971
                          0.07106  -0.02217                      -0.28508   0.08311
 14 -17.03637 -21.54647   3.39156   0.76209   3.62324  -0.88685   2.77085   0.01111
                          0.00757  -0.00478                       2.77978   0.01265
 15 -18.91359 -22.98030   3.13387   0.76844   4.68293   0.61622   3.96610   0.00408
                          0.00246  -0.00235                       3.97172   0.00488
 16 -18.01526 -22.23479   3.25568   0.76803   5.25578   1.03625   4.51552   0.00204
                          0.00115  -0.00120                       4.52171   0.00253
 17 -19.37995 -23.00911   2.89394   0.77409   6.52679   2.89764   5.95767   0.00060
                          0.00044  -0.00035                       5.96075   0.00069
 18 -19.70597 -23.50186   3.04157   0.77300   6.64719   2.85130   6.06410   0.00079
                          0.00055  -0.00049                       6.06737   0.00092
 19 -16.15252 -11.40471  -3.78934   0.79263  10.95524  15.70306  11.71498   0.00104
                          0.00466  -0.00277                      11.71089  -0.00126
 20 -15.46348  -9.88619  -4.44818   0.80375  12.89586  18.47315  13.80337  -0.00564
                         -0.00148  -0.00394                      13.79621  -0.00783
 21 -14.12418  -8.30592  -4.80464   0.79378  14.77905  20.59731  15.58352  -0.02000
                         -0.01393  -0.00883                      15.57731  -0.02201
 22 -14.58329  -8.73016  -4.88080   0.79004  15.75611  21.60924  16.52404  -0.02910
                         -0.02284  -0.01137                      16.51825  -0.03097
 23 -14.58415  -8.13639  -5.32269   0.78485  17.28606  23.73382  18.16829  -0.05511
                         -0.04549  -0.01725                      18.16026  -0.05795
 24 -13.98980  -7.79934  -5.13756   0.80005  17.71959  23.91005  18.56130  -0.04998
                         -0.04152  -0.01592                      18.55448  -0.05227
 25 -13.77280  -7.49872  -5.33422   0.79066  18.51684  24.79092  19.25861  -0.07006
                         -0.06362  -0.02103                      19.25297  -0.07189
 26 -14.85420  -8.01274  -5.68520   0.77537  19.52567  26.36713  20.41967  -0.10401
                         -0.09415  -0.02682                      20.41068  -0.10699
 27 -13.23356  -7.13923  -5.24069   0.79745  19.77900  25.87334  20.45787  -0.08374
                         -0.07990  -0.02346                      20.45333  -0.08505
 28 -12.62148  -6.62316  -5.30872   0.79942  22.24244  28.24077  22.78935  -0.13149
                         -0.13690  -0.03198                      22.78628  -0.13191
 29 -11.60974  -4.97207  -6.11241   0.77627  23.50696  30.14463  23.89829  -0.25962
                         -0.29708  -0.05522                      23.89589  -0.25863
 30 -13.09952  -5.74935  -6.61745   0.76814  26.67908  34.02926  27.19748  -0.47867
                         -0.54545  -0.08146                      27.19222  -0.47573

Timing (quasiparticle equation):   0.43362

Timing:       123
