########################
######### SPEX #########
########################
Version 05.00  (Sep  5, 2019)
Execution time: Jan 18, 2020  17:41:35
Hostname: Ontology
MPI: 3,1


### subroutine: getinput ###

Basic parameters:
  Number of spins            =  1
            centers          =  4
            types            =  2
            equivalent atoms =  2  2
  Lattice parameter =      1.00000
  Lattice vectors   =      3.01411  -5.22060   0.00000
                           3.01411   5.22060   0.00000
                           0.00000   0.00000   9.80579
  Unit-cell volume  =    308.59778
  Reciprocal cutoff =      4.60000

Unit-cell geometry:
  # Ty  El              Coord.
  1  1  Ga   0.33333  -0.33333   0.00000
  2  1  Ga  -0.33333   0.33333   0.50000
  3  2  N    0.33333  -0.33333  -0.37700
  4  2  N   -0.33333   0.33333   0.12300

Symmetry information:
  Number of symmetry operations = 24
   #  Det           Axis           Angle   Syp  Inv
   1    1     --     --     --      --     Yes   1
   2   -1    1.00  -0.58  -0.00   180.00   No    2
   3   -1    1.00   0.58  -0.00   180.00   No    3
   4    1    0.00   0.00   1.00   120.00   Yes   9
   5    1    0.00   0.00   1.00   180.00   No    5
   6   -1    0.58   1.00  -0.00   180.00   Yes   6
   7   -1    1.00  -0.00  -0.00   180.00   Yes   7
   8    1    0.00   0.00   1.00    60.00   No   11
   9    1   -0.00  -0.00  -1.00   120.00   Yes   4
  10   -1   -0.00   1.00  -0.00   180.00   No   10
  11    1   -0.00  -0.00  -1.00    60.00   No    8
  12   -1   -0.58   1.00  -0.00   180.00   Yes  12
  13 - 24  Time reversal symmetries

##################
### Input file ###
##################
BZ       4 4 4
JOB      GW +:(1-30)
MPIKPT   
RESTART  
NBAND    200
KPT      +=(.35555,.35555,0)


Info: Simpson and Lagrange integration is used.

Radial mesh and basis functions:
  Number of radial grid points:       759  429
  Number of radial basis functions:    19   18
  Angular momentum quantum number:      8    6
  Maximal index:                        3

Core states:
  Atom type  1  (Ga)
  nl      Energy
  1s  -375.34991
  2s   -45.88297
  3s    -4.96076
  2p   -39.88207
  3p    -3.15226
  Atom type  2  (N )
  nl      Energy
  1s   -13.54409
  Number of valence electrons:   36

Average Coulomb potential: -0.35487  ( -9.65657 eV )

Read wavefunctions from harddisc... done   ( Timing:    0.30 )

Maximal energy difference in deg. subspaces: 1.0E-13
Minimal energy difference between subspaces: 6.3E-06

Wave functions:
  Number of bands:             198 -  200  (  200 )
            k points (IBZ):     64  (  12 /  30 )
            G vectors:         744
  k points of IBZ:
    1  (0.00000,0.00000,0.00000)  [ 0.00000, 0.00000, 0.00000 ]
    2  (0.00000,0.00000,0.25000)  [ 0.00000, 0.00000, 0.02550 ]
    3  (0.00000,0.00000,0.50000)  [ 0.00000, 0.00000, 0.05099 ]
    4  (0.00000,0.25000,0.00000)  [ 0.04147, 0.02394, 0.00000 ]
    5  (0.00000,0.25000,0.25000)  [ 0.04147, 0.02394, 0.02550 ]
    6  (0.00000,0.25000,0.50000)  [ 0.04147, 0.02394, 0.05099 ]
    7  (0.00000,0.50000,0.00000)  [ 0.08294, 0.04789, 0.00000 ]
    8  (0.00000,0.50000,0.25000)  [ 0.08294, 0.04789, 0.02550 ]
    9  (0.00000,0.50000,0.50000)  [ 0.08294, 0.04789, 0.05099 ]
   10  (0.25000,0.25000,0.00000)  [ 0.08294, 0.00000, 0.00000 ]
   11  (0.25000,0.25000,0.25000)  [ 0.08294, 0.00000, 0.02550 ]
   12  (0.25000,0.25000,0.50000)  [ 0.08294, 0.00000, 0.05099 ]
  k points of EIBZ (shifted set):
   65  (0.35555,0.35555,0.00000)  [ 0.11796, 0.00000, 0.00000 ]
   66  (0.35555,0.35555,0.25000)  [ 0.11796, 0.00000, 0.02550 ]
   67  (0.35555,0.35555,0.50000)  [ 0.11796, 0.00000, 0.05099 ]
   68  (0.35555,0.60555,0.00000)  [ 0.15943, 0.02394, 0.00000 ]
   69  (0.35555,0.60555,0.25000)  [ 0.15943, 0.02394, 0.02550 ]
   70  (0.35555,0.60555,0.50000)  [ 0.15943, 0.02394, 0.05099 ]
   71  (0.35555,0.85555,0.00000)  [ 0.20090, 0.04789, 0.00000 ]
   72  (0.35555,0.85555,0.25000)  [ 0.20090, 0.04789, 0.02550 ]
   73  (0.35555,0.85555,0.50000)  [ 0.20090, 0.04789, 0.05099 ]
   74  (0.35555,0.10555,0.00000)  [ 0.07649,-0.02394, 0.00000 ]
   75  (0.35555,0.10555,0.25000)  [ 0.07649,-0.02394, 0.02550 ]
   76  (0.35555,0.10555,0.50000)  [ 0.07649,-0.02394, 0.05099 ]
   77  (0.60555,0.60555,0.00000)  [ 0.20090, 0.00000, 0.00000 ]
   78  (0.60555,0.60555,0.25000)  [ 0.20090, 0.00000, 0.02550 ]
   79  (0.60555,0.60555,0.50000)  [ 0.20090, 0.00000, 0.05099 ]
   80  (0.60555,0.85555,0.00000)  [ 0.24238, 0.02394, 0.00000 ]
   81  (0.60555,0.85555,0.25000)  [ 0.24238, 0.02394, 0.02550 ]
   82  (0.60555,0.85555,0.50000)  [ 0.24238, 0.02394, 0.05099 ]
   83  (0.60555,0.10555,0.00000)  [ 0.11796,-0.04789, 0.00000 ]
   84  (0.60555,0.10555,0.25000)  [ 0.11796,-0.04789, 0.02550 ]
   85  (0.60555,0.10555,0.50000)  [ 0.11796,-0.04789, 0.05099 ]
   86  (0.85555,0.85555,0.00000)  [ 0.28385, 0.00000, 0.00000 ]
   87  (0.85555,0.85555,0.25000)  [ 0.28385, 0.00000, 0.02550 ]
   88  (0.85555,0.85555,0.50000)  [ 0.28385, 0.00000, 0.05099 ]
   89  (0.85555,0.10555,0.00000)  [ 0.15943,-0.07183, 0.00000 ]
   90  (0.85555,0.10555,0.25000)  [ 0.15943,-0.07183, 0.02550 ]
   91  (0.85555,0.10555,0.50000)  [ 0.15943,-0.07183, 0.05099 ]
   92  (0.10555,0.10555,0.00000)  [ 0.03502, 0.00000, 0.00000 ]
   93  (0.10555,0.10555,0.25000)  [ 0.03502, 0.00000, 0.02550 ]
   94  (0.10555,0.10555,0.50000)  [ 0.03502, 0.00000, 0.05099 ]

Generate wavefunctions at equivalent k points... done   ( Timing:   0.26 )

Size of array cpw:   209.8 MB
Size of array cmt:   260.9 MB

The system is not a metal.
The Fermi energy is placed in the center of the band gap.
KS energy gap:    0.07059528 Ha   (  1.92099521 eV )
Fermi energy:     0.29316457 Ha   (  7.97741378 eV )
Maximal energy:   5.58545823 Ha
Electron count error of the shifted k-point set:  0.0000000000000000

Wave-function checksum: -6.933479374221E-02


### subroutine: checkinput ###

Overlap <core|core>
Atom type  1
1s  1.000000
2s -0.000000  1.000000
3s  0.000000 -0.000001  0.999961
2p  0.999418
3p -0.000329  0.999458
Atom type  2
1s  0.999983

Overlap <core|basis>
Atom type  1
         u(s)    udot(s)
1s  0.000000  0.000000
2s  0.000001  0.000000
3s  0.004767 -0.007551
         u(p)    udot(p)
2p -0.000106 -0.000031
3p  0.017150 -0.021254
Atom type  2
         u(s)    udot(s)
1s  0.003209 -0.002046

Average overlap <core|val>
Atom type  1
1s  0.000000
2s  0.000000
3s  0.000679
2p  0.000010  0.000010  0.000010
3p  0.002208  0.002205  0.002208
Atom type  2
1s  0.000234

Maximum overlap <core|val> at (band/kpoint)
Atom type  1
1s  0.000000 (033/ 001)
2s  0.000001 (033/ 001)
3s  0.004396 (156/ 003)
2p  0.000056 (026/ 073)  0.000064 (024/ 001)  0.000057 (026/ 127)
3p  0.012171 (121/ 003)  0.014817 (111/ 001)  0.011162 (124/ 003)
Atom type  2
1s  0.001662 (002/ 127)

Overlap <basis|basis>
Atom type  1
   u(s)  1.000000
udot(s) -0.000000  0.129862
   u(p)  1.000000
udot(p)  0.000000  0.075237
   u(d)  1.000000
udot(d) -0.000000  0.733838
 ulo(d)  0.410292 -0.767526  1.000000
   u(f)  1.000000
udot(f) -0.000000  0.020278
   u(g)  1.000000
udot(g) -0.000000  0.006703
   u(h)  1.000000
udot(h) -0.000000  0.003149
   u(i)  1.000000
udot(i)  0.000000  0.001726
   u(j)  1.000000
udot(j) -0.000000  0.001039
   u(k)  1.000000
udot(k) -0.000000  0.000667
Atom type  2
   u(s)  1.000000
udot(s)  0.000000  0.023146
   u(p)  1.000000
udot(p)  0.000000  0.036192
   u(d)  1.000000
udot(d) -0.000000  0.003612
   u(f)  1.000000
udot(f)  0.000000  0.001183
   u(g)  1.000000
udot(g) -0.000000  0.000520
   u(h)  1.000000
udot(h) -0.000000  0.000271
   u(i)  1.000000
udot(i) -0.000000  0.000157


### subroutine: mixedbasis ( Mode: vv ) ###

Mixed basis
  Plane-wave basis:
    Number of unique G vectors:   358
    Maximal number of G vectors:  233

  MT basis read in from spex.mb (mode: vv).
    Total number of product-basis functions:  264



##### Job index:  1 #####


### subroutine: correlation ###

< GW self-energy >
Calculate periodic function...done   ( Timing:    0.04 )

=========

K point (   1 ):   0.00000   0.00000   0.00000

Coulomb matrix read from spex.cor
Inverse dielectric matrices read from spex.cor
Invert dielectric tensor... done   ( Timing:    0.02 )
Hermiticity of transformed Coulomb matrix: 5.1E-11

Add contribution to self-energy... done
                               Timings
  MT wave-func. products:      1.44003
  PW wave-func. products:      0.40330
  Matrix-vector products:      2.51755
  Transformations:             0.25262
  Exchange self-energy:        0.16298
  Frequency integration:       0.05050
  Tetrahedron weights:         0.00000
  Gamma-point correction:      0.40200
  MPI idle time:               0.00585      0.00585
  Other:                       0.14065
  ------------------------------------
  Total:                       5.37548

=========

K point (   2 ):   0.00000   0.00000   0.25000

Coulomb matrix read from spex.cor
Inverse dielectric matrices read from spex.cor
Hermiticity of transformed Coulomb matrix: 5.9E-10

Add contribution to self-energy... done
                               Timings
  MT wave-func. products:      1.54514
  PW wave-func. products:      0.50202
  Matrix-vector products:      2.07171
  Transformations:             0.25338
  Exchange self-energy:        0.14501
  Frequency integration:       0.02665
  Tetrahedron weights:         0.00000
  MPI idle time:               0.01992      0.01992
  Other:                       0.17311
  ------------------------------------
  Total:                       4.73694

=========

K point (   3 ):   0.00000   0.00000   0.50000

Coulomb matrix read from spex.cor
Inverse dielectric matrices read from spex.cor
Hermiticity of transformed Coulomb matrix: 1.8E-10

Add contribution to self-energy... done
                               Timings
  MT wave-func. products:      1.31758
  PW wave-func. products:      0.38502
  Matrix-vector products:      2.13422
  Transformations:             0.25153
  Exchange self-energy:        0.11680
  Frequency integration:       0.04125
  Tetrahedron weights:         0.00000
  MPI idle time:               0.01716      0.02160
  Other:                       0.18042
  ------------------------------------
  Total:                       4.44398

=========

K point (   4 ):   0.00000   0.25000   0.00000

Coulomb matrix read from spex.cor
Inverse dielectric matrices read from spex.cor
Hermiticity of transformed Coulomb matrix: 8.5E-11

Add contribution to self-energy... done
                               Timings
  MT wave-func. products:      2.40368
  PW wave-func. products:      0.66883
  Matrix-vector products:      7.34703
  Transformations:             0.82947
  Exchange self-energy:        0.21710
  Frequency integration:       0.10890
  Tetrahedron weights:         0.00000
  MPI idle time:               0.02998      0.02998
  Other:                       0.57460
  ------------------------------------
  Total:                      12.17959

=========

K point (   5 ):   0.00000   0.25000   0.25000

Coulomb matrix read from spex.cor
Inverse dielectric matrices read from spex.cor
Hermiticity of transformed Coulomb matrix: 9.7E-11

Add contribution to self-energy... done
                               Timings
  MT wave-func. products:      2.65423
  PW wave-func. products:      0.70107
  Matrix-vector products:      6.36756
  Transformations:             0.79390
  Exchange self-energy:        0.17891
  Frequency integration:       0.18360
  Tetrahedron weights:         0.00000
  MPI idle time:               0.00485      0.02810
  Other:                       0.50702
  ------------------------------------
  Total:                      11.39115

=========

K point (   6 ):   0.00000   0.25000   0.50000

Coulomb matrix read from spex.cor
Inverse dielectric matrices read from spex.cor
Hermiticity of transformed Coulomb matrix: 9.8E-11

Add contribution to self-energy... done
                               Timings
  MT wave-func. products:      2.62764
  PW wave-func. products:      0.69463
  Matrix-vector products:      7.41583
  Transformations:             0.81775
  Exchange self-energy:        0.18244
  Frequency integration:       0.20563
  Tetrahedron weights:         0.00000
  MPI idle time:               0.00002      0.03015
  Other:                       0.48798
  ------------------------------------
  Total:                      12.43192

=========

K point (   7 ):   0.00000   0.50000   0.00000

Coulomb matrix read from spex.cor
Inverse dielectric matrices read from spex.cor
Hermiticity of transformed Coulomb matrix: 1.0E-10

Add contribution to self-energy... done
                               Timings
  MT wave-func. products:      1.91489
  PW wave-func. products:      0.62453
  Matrix-vector products:      4.43657
  Transformations:             0.55618
  Exchange self-energy:        0.15580
  Frequency integration:       0.07974
  Tetrahedron weights:         0.00000
  MPI idle time:               0.01340      0.01340
  Other:                       0.33072
  ------------------------------------
  Total:                       8.11184

=========

K point (   8 ):   0.00000   0.50000   0.25000

Coulomb matrix read from spex.cor
Inverse dielectric matrices read from spex.cor
Hermiticity of transformed Coulomb matrix: 5.3E-11

Add contribution to self-energy... done
                               Timings
  MT wave-func. products:      2.28364
  PW wave-func. products:      0.62588
  Matrix-vector products:      4.39700
  Transformations:             0.53241
  Exchange self-energy:        0.21397
  Frequency integration:       0.10957
  Tetrahedron weights:         0.00000
  MPI idle time:               0.00867      0.01734
  Other:                       0.35084
  ------------------------------------
  Total:                       8.52197

=========

K point (   9 ):   0.00000   0.50000   0.50000

Coulomb matrix read from spex.cor
Inverse dielectric matrices read from spex.cor
Hermiticity of transformed Coulomb matrix: 4.1E-11

Add contribution to self-energy... done
                               Timings
  MT wave-func. products:      2.32290
  PW wave-func. products:      0.50284
  Matrix-vector products:      4.27559
  Transformations:             0.54620
  Exchange self-energy:        0.13902
  Frequency integration:       0.11084
  Tetrahedron weights:         0.00000
  MPI idle time:               0.00002      0.03179
  Other:                       0.47718
  ------------------------------------
  Total:                       8.37459

=========

K point (  10 ):   0.25000   0.25000   0.00000

Coulomb matrix read from spex.cor
Inverse dielectric matrices read from spex.cor
Hermiticity of transformed Coulomb matrix: 3.6E-11

Add contribution to self-energy... done
                               Timings
  MT wave-func. products:      3.74249
  PW wave-func. products:      1.00022
  Matrix-vector products:      8.62982
  Transformations:             1.16722
  Exchange self-energy:        0.32405
  Frequency integration:       0.18985
  Tetrahedron weights:         0.00000
  MPI idle time:               0.05325      0.05325
  Other:                       0.78368
  ------------------------------------
  Total:                      15.89059

=========

K point (  11 ):   0.25000   0.25000   0.25000

Coulomb matrix read from spex.cor
Inverse dielectric matrices read from spex.cor
Hermiticity of transformed Coulomb matrix: 5.4E-11

Add contribution to self-energy... done
                               Timings
  MT wave-func. products:      5.07354
  PW wave-func. products:      1.13816
  Matrix-vector products:      9.34035
  Transformations:             1.15277
  Exchange self-energy:        0.29103
  Frequency integration:       0.27428
  Tetrahedron weights:         0.00000
  MPI idle time:               0.02641      0.03432
  Other:                       0.56172
  ------------------------------------
  Total:                      17.85827

=========

K point (  12 ):   0.25000   0.25000   0.50000

Coulomb matrix read from spex.cor
Inverse dielectric matrices read from spex.cor
Hermiticity of transformed Coulomb matrix: 6.5E-11

Add contribution to self-energy... done
                               Timings
  MT wave-func. products:      4.56737
  PW wave-func. products:      1.10561
  Matrix-vector products:     15.33281
  Transformations:             1.20999
  Exchange self-energy:        0.27629
  Frequency integration:       0.35413
  Tetrahedron weights:         0.00000
  MPI idle time:               0.01128      0.02121
  Other:                       0.86914
  ------------------------------------
  Total:                      23.72661


### subroutine: exchange_core ###

        k point       band      exchange (core contribution)
  (0.356,0.356,0.000)   1     -8.5595186
  (0.356,0.356,0.000)   2     -9.0233083
  (0.356,0.356,0.000)   3    -17.7306995
  (0.356,0.356,0.000)   4    -18.1804303
  (0.356,0.356,0.000)   5    -18.2845190
  (0.356,0.356,0.000)   6    -18.3619912
  (0.356,0.356,0.000)   7    -18.3705741
  (0.356,0.356,0.000)   8    -18.4091277
  (0.356,0.356,0.000)   9    -18.5175911
  (0.356,0.356,0.000)  10    -18.5676936
  (0.356,0.356,0.000)  11    -11.8671210
  (0.356,0.356,0.000)  12    -11.4688262
  (0.356,0.356,0.000)  13     -1.6511466
  (0.356,0.356,0.000)  14     -1.9163511
  (0.356,0.356,0.000)  15     -1.2129993
  (0.356,0.356,0.000)  16     -1.5604153
  (0.356,0.356,0.000)  17     -1.5979652
  (0.356,0.356,0.000)  18     -1.7541487
  (0.356,0.356,0.000)  19     -1.5204839
  (0.356,0.356,0.000)  20     -2.0291688
  (0.356,0.356,0.000)  21     -2.0627922
  (0.356,0.356,0.000)  22     -1.4715054
  (0.356,0.356,0.000)  23     -1.7810983
  (0.356,0.356,0.000)  24     -1.7019207
  (0.356,0.356,0.000)  25     -2.3053179
  (0.356,0.356,0.000)  26     -1.8341440
  (0.356,0.356,0.000)  27     -1.5684838
  (0.356,0.356,0.000)  28     -2.1590958
  (0.356,0.356,0.000)  29     -2.0584772
  (0.356,0.356,0.000)  30     -1.9458802
Timing:   0.09




### subroutine: quasiparticle ###

Number of mesh points even: No constraint will be used.

List of k points
    0   0.35555   0.35555   0.00000  (additional)



#####################
### K POINT:    0 ###
#####################


--- DIAGONAL ELEMENTS [eV] ---

 Bd       vxc    sigmax    sigmac         Z        KS        HF          GW lin/dir
  1 -28.41422 -39.77938   8.83686   0.72415  -7.95006 -19.31522  -9.75904   0.52785
                          0.60182  -0.03640                      -9.70143   0.50651
  2 -29.16366 -40.64745   8.88765   0.72290  -7.91574 -19.39953  -9.77359   0.49520
                          0.56491  -0.03345                      -9.71105   0.47736
  3 -42.15290 -55.40728   9.44300   0.73767  -6.41879 -19.67316  -9.22933   0.10526
                          0.06565  -0.01491                      -9.12817   0.13097
  4 -42.98834 -56.35087   9.52373   0.73878  -6.23582 -19.59834  -9.07097   0.10092
                          0.06208  -0.01434                      -8.96917   0.12664
  5 -43.13188 -56.50328   9.51116   0.73988  -6.20129 -19.57269  -9.05669   0.08984
                          0.05369  -0.01298                      -8.95320   0.11533
  6 -43.26697 -56.68123   9.54782   0.73964  -6.19854 -19.61279  -9.05758   0.09255
                          0.05560  -0.01330                      -8.95403   0.11820
  7 -43.20114 -56.56422   9.46253   0.74187  -6.18967 -19.55275  -9.08302   0.06568
                          0.03584  -0.01002                      -8.97555   0.09063
  8 -43.27733 -56.65525   9.47769   0.74174  -6.17891 -19.55683  -9.07150   0.06758
                          0.03718  -0.01026                      -8.96429   0.09261
  9 -43.48350 -56.89201   9.50222   0.74182  -6.13280 -19.54131  -9.03020   0.06681
                          0.03653  -0.01016                      -8.92279   0.09194
 10 -43.57391 -56.96320   9.48321   0.74220  -6.09008 -19.47937  -8.98887   0.06146
                          0.03259  -0.00954                      -8.88093   0.08672
 11 -33.70575 -44.92376   8.56070   0.73711  -4.52554 -15.74355  -6.46210   0.42851
                          0.35815  -0.06191                      -6.45307   0.42816
 12 -33.22044 -44.30176   8.50028   0.73495  -4.33493 -15.41625  -6.21002   0.42096
                          0.35934  -0.06078                      -6.19411   0.42185
 13 -15.85530 -20.98247   3.94019   0.74422   1.44738  -3.67979   0.56466   0.04971
                          0.04243  -0.01528                       0.57510   0.05240
 14 -16.71124 -21.69899   3.88848   0.74681   1.81177  -3.17598   0.99124   0.03840
                          0.03305  -0.01247                       1.00002   0.04034
 15 -14.96348 -19.93278   3.72012   0.74898   1.97726  -2.99205   1.04203   0.03893
                          0.03111  -0.01251                       1.05369   0.04182
 16 -16.64176 -21.18285   3.41803   0.76059   3.84108  -0.70002   2.98690   0.00823
                          0.00551  -0.00360                       2.99634   0.00944
 17 -16.93845 -21.31802   3.30588   0.76405   4.29151  -0.08805   3.47118   0.00526
                          0.00328  -0.00257                       3.47956   0.00623
 18 -17.31532 -21.75340   3.33586   0.76560   4.40866  -0.02942   3.56480   0.00484
                          0.00294  -0.00235                       3.57346   0.00579
 19 -11.83928  -7.41209  -4.05529   0.82424  12.28368  16.71087  12.59022  -0.00133
                         -0.00074  -0.00196                      12.58945  -0.00146
 20 -17.50995 -10.95029  -4.95881   0.77561  14.65490  21.21456  15.89640  -0.02579
                         -0.01414  -0.00926                      15.88126  -0.03142
 21 -17.53021 -10.90656  -4.98609   0.77599  14.98951  21.61316  16.26009  -0.02828
                         -0.01604  -0.00967                      16.24409  -0.03409
 22 -15.17223  -9.20262  -4.96015   0.77517  15.40780  21.37740  16.19001  -0.03036
                         -0.02333  -0.01216                      16.18353  -0.03261
 23 -15.20778  -8.98314  -5.12479   0.78283  16.81468  23.03931  17.67512  -0.04492
                         -0.03640  -0.01493                      17.66758  -0.04751
 24 -15.38822  -9.02939  -5.23126   0.77718  17.03554  23.39437  17.91120  -0.05022
                         -0.04114  -0.01618                      17.90313  -0.05302
 25 -14.88946  -7.86099  -6.03989   0.76700  19.46300  26.49147  20.21579  -0.14861
                         -0.14540  -0.03751                      20.20871  -0.15069
 26 -14.32564  -7.44836  -5.91447   0.76925  19.73894  26.61622  20.47512  -0.13382
                         -0.13154  -0.03390                      20.46854  -0.13561
 27 -13.77034  -7.03208  -5.84228   0.77230  20.21806  26.95632  20.90548  -0.13426
                         -0.13470  -0.03374                      20.89981  -0.13559
 28 -14.55122  -7.57334  -5.96155   0.78196  25.13167  32.10955  25.90967  -0.29472
                         -0.30578  -0.05472                      25.90203  -0.29530
 29 -14.40086  -7.25906  -6.17008   0.77490  25.44118  32.58298  26.17296  -0.33039
                         -0.35046  -0.06052                      26.16545  -0.33030
 30 -14.04335  -6.86198  -6.23808   0.77654  26.46678  33.64815  27.17148  -0.38491
                         -0.41407  -0.06717                      27.16410  -0.38409

Timing (quasiparticle equation):   0.44978

Timing:       135
