########################
######### SPEX #########
########################
Version 05.00  (Sep  5, 2019)
Execution time: Jan 17, 2020  23:23:24
Hostname: login18-1.hpc.itc.rwth-aachen.de
MPI: 1,1


### subroutine: getinput ###

Basic parameters:
  Number of spins            =  1
            centers          =  4
            types            =  2
            equivalent atoms =  2  2
  Lattice parameter =      1.00000
  Lattice vectors   =      3.01411  -5.22060   0.00000
                           3.01411   5.22060   0.00000
                           0.00000   0.00000   9.80579
  Unit-cell volume  =    308.59778
  Reciprocal cutoff =      4.60000

Unit-cell geometry:
  # Ty  El              Coord.
  1  1  Ga   0.33333  -0.33333   0.00000
  2  1  Ga  -0.33333   0.33333   0.50000
  3  2  N    0.33333  -0.33333  -0.37700
  4  2  N   -0.33333   0.33333   0.12300

Symmetry information:
  Number of symmetry operations = 24
   #  Det           Axis           Angle   Syp  Inv
   1    1     --     --     --      --     Yes   1
   2   -1    1.00  -0.58   0.00   180.00   No    2
   3   -1    1.00   0.58   0.00   180.00   No    3
   4    1    0.00   0.00   1.00   120.00   Yes   9
   5    1    0.00   0.00   1.00   180.00   No    5
   6   -1    0.58   1.00   0.00   180.00   Yes   6
   7   -1    1.00   0.00   0.00   180.00   Yes   7
   8    1    0.00   0.00   1.00    60.00   No   11
   9    1    0.00   0.00  -1.00   120.00   Yes   4
  10   -1    0.00   1.00   0.00   180.00   No   10
  11    1    0.00   0.00  -1.00    60.00   No    8
  12   -1   -0.58   1.00   0.00   180.00   Yes  12
  13 - 24  Time reversal symmetries

##################
### Input file ###
##################
BZ       4 4 4
JOB      GW +:(1-10)
NBAND    200
RESTART  
KPT      +=(.81111,.81111,0)
 

Info: Simpson and Lagrange integration is used.

Radial mesh and basis functions:
  Number of radial grid points:       759  429
  Number of radial basis functions:    19   18
  Angular momentum quantum number:      8    6
  Maximal index:                        3

Core states:
  Atom type  1  (Ga)
  nl      Energy
  1s  -375.34991
  2s   -45.88297
  3s    -4.96076
  2p   -39.88207
  3p    -3.15226
  Atom type  2  (N )
  nl      Energy
  1s   -13.54409
  Number of valence electrons:   36

Average Coulomb potential: -0.35487  ( -9.65657 eV )

Read wavefunctions from harddisc... done   ( Timing:    0.21 )

Maximal energy difference in deg. subspaces: 9.9E-14
Minimal energy difference between subspaces: 1.9E-05

Wave functions:
  Number of bands:             198 -  200  (  200 )
            k points (IBZ):     64  (  12 /  30 )
            G vectors:         730
  k points of IBZ:
    1  (0.00000,0.00000,0.00000)  [ 0.00000, 0.00000, 0.00000 ]
    2  (0.00000,0.00000,0.25000)  [ 0.00000, 0.00000, 0.02550 ]
    3  (0.00000,0.00000,0.50000)  [ 0.00000, 0.00000, 0.05099 ]
    4  (0.00000,0.25000,0.00000)  [ 0.04147, 0.02394, 0.00000 ]
    5  (0.00000,0.25000,0.25000)  [ 0.04147, 0.02394, 0.02550 ]
    6  (0.00000,0.25000,0.50000)  [ 0.04147, 0.02394, 0.05099 ]
    7  (0.00000,0.50000,0.00000)  [ 0.08294, 0.04789, 0.00000 ]
    8  (0.00000,0.50000,0.25000)  [ 0.08294, 0.04789, 0.02550 ]
    9  (0.00000,0.50000,0.50000)  [ 0.08294, 0.04789, 0.05099 ]
   10  (0.25000,0.25000,0.00000)  [ 0.08294, 0.00000, 0.00000 ]
   11  (0.25000,0.25000,0.25000)  [ 0.08294, 0.00000, 0.02550 ]
   12  (0.25000,0.25000,0.50000)  [ 0.08294, 0.00000, 0.05099 ]
  k points of EIBZ (shifted set):
   65  (0.81111,0.81111,0.00000)  [ 0.26910, 0.00000, 0.00000 ]
   66  (0.81111,0.81111,0.25000)  [ 0.26910, 0.00000, 0.02550 ]
   67  (0.81111,0.81111,0.50000)  [ 0.26910, 0.00000, 0.05099 ]
   68  (0.81111,0.06111,0.00000)  [ 0.14469,-0.07183, 0.00000 ]
   69  (0.81111,0.06111,0.25000)  [ 0.14469,-0.07183, 0.02550 ]
   70  (0.81111,0.06111,0.50000)  [ 0.14469,-0.07183, 0.05099 ]
   71  (0.81111,0.31111,0.00000)  [ 0.18616,-0.04789, 0.00000 ]
   72  (0.81111,0.31111,0.25000)  [ 0.18616,-0.04789, 0.02550 ]
   73  (0.81111,0.31111,0.50000)  [ 0.18616,-0.04789, 0.05099 ]
   74  (0.81111,0.56111,0.00000)  [ 0.22763,-0.02394, 0.00000 ]
   75  (0.81111,0.56111,0.25000)  [ 0.22763,-0.02394, 0.02550 ]
   76  (0.81111,0.56111,0.50000)  [ 0.22763,-0.02394, 0.05099 ]
   77  (0.06111,0.06111,0.00000)  [ 0.02027, 0.00000, 0.00000 ]
   78  (0.06111,0.06111,0.25000)  [ 0.02027, 0.00000, 0.02550 ]
   79  (0.06111,0.06111,0.50000)  [ 0.02027, 0.00000, 0.05099 ]
   80  (0.06111,0.31111,0.00000)  [ 0.06175, 0.02394, 0.00000 ]
   81  (0.06111,0.31111,0.25000)  [ 0.06175, 0.02394, 0.02550 ]
   82  (0.06111,0.31111,0.50000)  [ 0.06175, 0.02394, 0.05099 ]
   83  (0.06111,0.56111,0.00000)  [ 0.10322, 0.04789, 0.00000 ]
   84  (0.06111,0.56111,0.25000)  [ 0.10322, 0.04789, 0.02550 ]
   85  (0.06111,0.56111,0.50000)  [ 0.10322, 0.04789, 0.05099 ]
   86  (0.31111,0.31111,0.00000)  [ 0.10322, 0.00000, 0.00000 ]
   87  (0.31111,0.31111,0.25000)  [ 0.10322, 0.00000, 0.02550 ]
   88  (0.31111,0.31111,0.50000)  [ 0.10322, 0.00000, 0.05099 ]
   89  (0.31111,0.56111,0.00000)  [ 0.14469, 0.02394, 0.00000 ]
   90  (0.31111,0.56111,0.25000)  [ 0.14469, 0.02394, 0.02550 ]
   91  (0.31111,0.56111,0.50000)  [ 0.14469, 0.02394, 0.05099 ]
   92  (0.56111,0.56111,0.00000)  [ 0.18616, 0.00000, 0.00000 ]
   93  (0.56111,0.56111,0.25000)  [ 0.18616, 0.00000, 0.02550 ]
   94  (0.56111,0.56111,0.50000)  [ 0.18616, 0.00000, 0.05099 ]

Generate wavefunctions at equivalent k points... done   ( Timing:   0.30 )

Size of array cpw:   209.8 MB
Size of array cmt:   260.9 MB

The system is not a metal.
The Fermi energy is placed in the center of the band gap.
KS energy gap:    0.07059528 Ha   (  1.92099521 eV )
Fermi energy:     0.29316457 Ha   (  7.97741378 eV )
Maximal energy:   5.57248232 Ha
Electron count error of the shifted k-point set:  0.0000000000000000

Wave-function checksum: -1.474359030990E-01


### subroutine: checkinput ###

Overlap <core|core>
Atom type  1
1s  1.000000 
2s -0.000000  1.000000 
3s  0.000000 -0.000001  0.999961 
2p  0.999418 
3p -0.000329  0.999458 
Atom type  2
1s  0.999983 

Overlap <core|basis>
Atom type  1
         u(s)    udot(s)
1s  0.000000  0.000000 
2s  0.000001  0.000000 
3s  0.004767 -0.007551 
         u(p)    udot(p)
2p -0.000106 -0.000031 
3p  0.017150 -0.021254 
Atom type  2
         u(s)    udot(s)
1s  0.003209 -0.002046 

Average overlap <core|val>
Atom type  1
1s  0.000000
2s  0.000000
3s  0.000679
2p  0.000010  0.000010  0.000010
3p  0.002209  0.002205  0.002207
Atom type  2
1s  0.000234

Maximum overlap <core|val> at (band/kpoint)
Atom type  1
1s  0.000000 (021/ 094)
2s  0.000001 (021/ 094)
3s  0.003697 (156/ 003)
2p  0.000057 (031/ 088)  0.000064 (024/ 001)  0.000059 (025/ 100)
3p  0.011526 (121/ 003)  0.014817 (111/ 001)  0.011787 (124/ 003)
Atom type  2
1s  0.001554 (002/ 003)

Overlap <basis|basis>
Atom type  1
   u(s)  1.000000 
udot(s) -0.000000  0.129862 
   u(p)  1.000000 
udot(p) -0.000000  0.075237 
   u(d)  1.000000 
udot(d) -0.000000  0.733838 
 ulo(d)  0.410292 -0.767526  1.000000 
   u(f)  1.000000 
udot(f) -0.000000  0.020278 
   u(g)  1.000000 
udot(g) -0.000000  0.006703 
   u(h)  1.000000 
udot(h)  0.000000  0.003149 
   u(i)  1.000000 
udot(i) -0.000000  0.001726 
   u(j)  1.000000 
udot(j) -0.000000  0.001039 
   u(k)  1.000000 
udot(k)  0.000000  0.000667 
Atom type  2
   u(s)  1.000000 
udot(s)  0.000000  0.023146 
   u(p)  1.000000 
udot(p)  0.000000  0.036192 
   u(d)  1.000000 
udot(d)  0.000000  0.003612 
   u(f)  1.000000 
udot(f)  0.000000  0.001183 
   u(g)  1.000000 
udot(g) -0.000000  0.000520 
   u(h)  1.000000 
udot(h) -0.000000  0.000271 
   u(i)  1.000000 
udot(i)  0.000000  0.000157 


### subroutine: mixedbasis ( Mode: vv ) ###

Mixed basis
  Plane-wave basis:
    Number of unique G vectors:   348
    Maximal number of G vectors:  233

  MT basis read in from spex.mb (mode: vv).
    Total number of product-basis functions:  264



##### Job index:  1 #####


### subroutine: correlation ###

< GW self-energy >
Calculate periodic function...done   ( Timing:    0.08 )

=========

K point (   1 ):   0.00000   0.00000   0.00000

Coulomb matrix read from spex.cor
Inverse dielectric matrices read from spex.cor 
Invert dielectric tensor... done   ( Timing:    0.02 )
Hermiticity of transformed Coulomb matrix: 6.8E-11

Add contribution to self-energy... done
                               Timings
  MT wave-func. products:      0.11199
  PW wave-func. products:      0.25010
  Matrix-vector products:      0.33573
  Transformations:             0.08289
  Exchange self-energy:        0.06881
  Frequency integration:       0.01746
  Tetrahedron weights:         0.00000
  Gamma-point correction:      1.35026
  MPI idle time:               0.00004      0.00004
  Other:                       0.05262
  ------------------------------------
  Total:                       2.26991

=========

K point (   2 ):   0.00000   0.00000   0.25000

Coulomb matrix read from spex.cor
Inverse dielectric matrices read from spex.cor 
Hermiticity of transformed Coulomb matrix: 8.7E-10

Add contribution to self-energy... done
                               Timings
  MT wave-func. products:      0.10865
  PW wave-func. products:      0.23395
  Matrix-vector products:      0.31871
  Transformations:             0.07806
  Exchange self-energy:        0.05089
  Frequency integration:       0.01750
  Tetrahedron weights:         0.00000
  MPI idle time:               0.00001      0.00001
  Other:                       0.04796
  ------------------------------------
  Total:                       0.85573

=========

K point (   3 ):   0.00000   0.00000   0.50000

Coulomb matrix read from spex.cor
Inverse dielectric matrices read from spex.cor 
Hermiticity of transformed Coulomb matrix: 2.4E-10

Add contribution to self-energy... done
                               Timings
  MT wave-func. products:      0.11399
  PW wave-func. products:      0.23939
  Matrix-vector products:      0.51175
  Transformations:             0.07422
  Exchange self-energy:        0.04783
  Frequency integration:       0.01779
  Tetrahedron weights:         0.00000
  MPI idle time:               0.00002      0.00002
  Other:                       0.04940
  ------------------------------------
  Total:                       1.05438

=========

K point (   4 ):   0.00000   0.25000   0.00000

Coulomb matrix read from spex.cor
Inverse dielectric matrices read from spex.cor 
Hermiticity of transformed Coulomb matrix: 1.5E-10

Add contribution to self-energy... done
                               Timings
  MT wave-func. products:      0.25529
  PW wave-func. products:      0.57446
  Matrix-vector products:      1.56570
  Transformations:             0.23995
  Exchange self-energy:        0.08312
  Frequency integration:       0.05198
  Tetrahedron weights:         0.00000
  MPI idle time:               0.00004      0.00004
  Other:                       0.13052
  ------------------------------------
  Total:                       2.90106

=========

K point (   5 ):   0.00000   0.25000   0.25000

Coulomb matrix read from spex.cor
Inverse dielectric matrices read from spex.cor 
Hermiticity of transformed Coulomb matrix: 1.5E-10

Add contribution to self-energy... done
                               Timings
  MT wave-func. products:      0.26489
  PW wave-func. products:      0.57975
  Matrix-vector products:      1.61868
  Transformations:             0.24411
  Exchange self-energy:        0.08348
  Frequency integration:       0.05243
  Tetrahedron weights:         0.00000
  MPI idle time:               0.00003      0.00003
  Other:                       0.13208
  ------------------------------------
  Total:                       2.97546

=========

K point (   6 ):   0.00000   0.25000   0.50000

Coulomb matrix read from spex.cor
Inverse dielectric matrices read from spex.cor 
Hermiticity of transformed Coulomb matrix: 1.4E-10

Add contribution to self-energy... done
                               Timings
  MT wave-func. products:      0.25920
  PW wave-func. products:      0.58176
  Matrix-vector products:      1.62171
  Transformations:             0.24562
  Exchange self-energy:        0.08248
  Frequency integration:       0.05301
  Tetrahedron weights:         0.00000
  MPI idle time:               0.00002      0.00002
  Other:                       0.13249
  ------------------------------------
  Total:                       2.97629

=========

K point (   7 ):   0.00000   0.50000   0.00000

Coulomb matrix read from spex.cor
Inverse dielectric matrices read from spex.cor 
Hermiticity of transformed Coulomb matrix: 1.3E-10

Add contribution to self-energy... done
                               Timings
  MT wave-func. products:      0.18414
  PW wave-func. products:      0.41284
  Matrix-vector products:      0.66746
  Transformations:             0.16759
  Exchange self-energy:        0.07121
  Frequency integration:       0.03486
  Tetrahedron weights:         0.00000
  MPI idle time:               0.00003      0.00003
  Other:                       0.08920
  ------------------------------------
  Total:                       1.62735

=========

K point (   8 ):   0.00000   0.50000   0.25000

Coulomb matrix read from spex.cor
Inverse dielectric matrices read from spex.cor 
Hermiticity of transformed Coulomb matrix: 7.9E-11

Add contribution to self-energy... done
                               Timings
  MT wave-func. products:      0.17901
  PW wave-func. products:      0.41022
  Matrix-vector products:      0.65375
  Transformations:             0.15770
  Exchange self-energy:        0.06550
  Frequency integration:       0.03414
  Tetrahedron weights:         0.00000
  MPI idle time:               0.00002      0.00002
  Other:                       0.08688
  ------------------------------------
  Total:                       1.58723

=========

K point (   9 ):   0.00000   0.50000   0.50000

Coulomb matrix read from spex.cor
Inverse dielectric matrices read from spex.cor 
Hermiticity of transformed Coulomb matrix: 5.5E-11

Add contribution to self-energy... done
                               Timings
  MT wave-func. products:      0.18471
  PW wave-func. products:      0.39856
  Matrix-vector products:      1.05709
  Transformations:             0.15804
  Exchange self-energy:        0.06300
  Frequency integration:       0.03434
  Tetrahedron weights:         0.00000
  MPI idle time:               0.00002      0.00002
  Other:                       0.08872
  ------------------------------------
  Total:                       1.98447

=========

K point (  10 ):   0.25000   0.25000   0.00000

Coulomb matrix read from spex.cor
Inverse dielectric matrices read from spex.cor 
Hermiticity of transformed Coulomb matrix: 5.5E-11

Add contribution to self-energy... done
                               Timings
  MT wave-func. products:      0.33357
  PW wave-func. products:      0.73176
  Matrix-vector products:      1.93954
  Transformations:             0.30915
  Exchange self-energy:        0.09192
  Frequency integration:       0.06943
  Tetrahedron weights:         0.00000
  MPI idle time:               0.00002      0.00002
  Other:                       0.16891
  ------------------------------------
  Total:                       3.64431

=========

K point (  11 ):   0.25000   0.25000   0.25000

Coulomb matrix read from spex.cor
Inverse dielectric matrices read from spex.cor 
Hermiticity of transformed Coulomb matrix: 8.0E-11

Add contribution to self-energy... done
                               Timings
  MT wave-func. products:      0.33618
  PW wave-func. products:      0.74976
  Matrix-vector products:      2.01476
  Transformations:             0.31016
  Exchange self-energy:        0.10107
  Frequency integration:       0.06921
  Tetrahedron weights:         0.00000
  MPI idle time:               0.00004      0.00004
  Other:                       0.16959
  ------------------------------------
  Total:                       3.75076

=========

K point (  12 ):   0.25000   0.25000   0.50000

Coulomb matrix read from spex.cor
Inverse dielectric matrices read from spex.cor 
Hermiticity of transformed Coulomb matrix: 9.9E-11

Add contribution to self-energy... done
                               Timings
  MT wave-func. products:      0.33308
  PW wave-func. products:      0.75177
  Matrix-vector products:      3.80484
  Transformations:             0.31938
  Exchange self-energy:        0.10056
  Frequency integration:       0.07120
  Tetrahedron weights:         0.00000
  MPI idle time:               0.00002      0.00002
  Other:                       0.16945
  ------------------------------------
  Total:                       5.55030


### subroutine: exchange_core ###

        k point       band      exchange (core contribution)
  (0.811,0.811,0.000)   1     -4.9637166
  (0.811,0.811,0.000)   2     -9.1597733
  (0.811,0.811,0.000)   3    -17.8388843
  (0.811,0.811,0.000)   4    -17.9734978
  (0.811,0.811,0.000)   5    -18.1178376
  (0.811,0.811,0.000)   6    -18.1050439
  (0.811,0.811,0.000)   7    -18.3173849
  (0.811,0.811,0.000)   8    -18.4338487
  (0.811,0.811,0.000)   9    -18.5128785
  (0.811,0.811,0.000)  10    -18.4209035
Timing:   0.13




### subroutine: quasiparticle ###

Number of mesh points even: No constraint will be used.

List of k points
    0   0.81111   0.81111   0.00000  (additional) 



#####################
### K POINT:    0 ###
#####################


--- DIAGONAL ELEMENTS [eV] ---

 Bd       vxc    sigmax    sigmac         Z        KS        HF          GW lin/dir 
  1 -22.52267 -32.98018   8.44987   0.73253  -8.24842 -18.70594  -9.66276   0.78671 
                          0.90304  -0.06237                      -9.64515   0.75439 
  2 -29.37593 -40.89801   8.90155   0.72315  -7.91401 -19.43610  -9.79104   0.48702 
                          0.55596  -0.03243                      -9.72674   0.46946 
  3 -42.37878 -55.66710   9.47667   0.73751  -6.37765 -19.66597  -9.18779   0.10640 
                          0.06651  -0.01505                      -9.08687   0.13211 
  4 -42.65254 -55.99306   9.52542   0.73744  -6.33063 -19.67114  -9.14294   0.11148 
                          0.07044  -0.01561                      -9.04254   0.13722 
  5 -42.84323 -56.18891   9.50027   0.73894  -6.26640 -19.61208  -9.10712   0.09594 
                          0.05811  -0.01378                      -9.00442   0.12178 
  6 -42.83438 -56.18158   9.51365   0.73870  -6.23767 -19.58488  -9.06856   0.10359 
                          0.06426  -0.01464                      -8.96708   0.12924 
  7 -43.09747 -56.43170   9.43060   0.74233  -6.21289 -19.54713  -9.11038   0.05874 
                          0.03111  -0.00913                      -9.00195   0.08324 
  8 -43.32099 -56.69757   9.47485   0.74199  -6.15394 -19.53052  -9.04862   0.06705 
                          0.03685  -0.01018                      -8.94144   0.09201 
  9 -43.48340 -56.87841   9.49070   0.74198  -6.12861 -19.52362  -9.02518   0.06476 
                          0.03512  -0.00991                      -8.91770   0.08976 
 10 -43.34444 -56.69612   9.47353   0.74165  -6.08543 -19.43711  -8.96118   0.07428 
                          0.04249  -0.01103                      -8.85581   0.09923 

Timing (quasiparticle equation):   0.10690

Timing:        33
