########################
######### SPEX #########
########################
Version 05.00  (Sep  5, 2019)
Execution time: Jan 18, 2020  17:00:02
Hostname: Ontology
MPI: 3,1


### subroutine: getinput ###

Basic parameters:
  Number of spins            =  1
            centers          =  4
            types            =  2
            equivalent atoms =  2  2
  Lattice parameter =      1.00000
  Lattice vectors   =      3.01411  -5.22060   0.00000
                           3.01411   5.22060   0.00000
                           0.00000   0.00000   9.80579
  Unit-cell volume  =    308.59778
  Reciprocal cutoff =      4.60000

Unit-cell geometry:
  # Ty  El              Coord.
  1  1  Ga   0.33333  -0.33333   0.00000
  2  1  Ga  -0.33333   0.33333   0.50000
  3  2  N    0.33333  -0.33333  -0.37700
  4  2  N   -0.33333   0.33333   0.12300

Symmetry information:
  Number of symmetry operations = 24
   #  Det           Axis           Angle   Syp  Inv
   1    1     --     --     --      --     Yes   1
   2   -1    1.00  -0.58  -0.00   180.00   No    2
   3   -1    1.00   0.58  -0.00   180.00   No    3
   4    1    0.00   0.00   1.00   120.00   Yes   9
   5    1    0.00   0.00   1.00   180.00   No    5
   6   -1    0.58   1.00  -0.00   180.00   Yes   6
   7   -1    1.00  -0.00  -0.00   180.00   Yes   7
   8    1    0.00   0.00   1.00    60.00   No   11
   9    1   -0.00  -0.00  -1.00   120.00   Yes   4
  10   -1   -0.00   1.00  -0.00   180.00   No   10
  11    1   -0.00  -0.00  -1.00    60.00   No    8
  12   -1   -0.58   1.00  -0.00   180.00   Yes  12
  13 - 24  Time reversal symmetries

##################
### Input file ###
##################
BZ       4 4 4
JOB      GW +:(1-30)
MPIKPT   
RESTART  
NBAND    200
KPT      +=(.87777,.87777,0)


Info: Simpson and Lagrange integration is used.

Radial mesh and basis functions:
  Number of radial grid points:       759  429
  Number of radial basis functions:    19   18
  Angular momentum quantum number:      8    6
  Maximal index:                        3

Core states:
  Atom type  1  (Ga)
  nl      Energy
  1s  -375.34991
  2s   -45.88297
  3s    -4.96076
  2p   -39.88207
  3p    -3.15226
  Atom type  2  (N )
  nl      Energy
  1s   -13.54409
  Number of valence electrons:   36

Average Coulomb potential: -0.35487  ( -9.65657 eV )

Read wavefunctions from harddisc... done   ( Timing:    0.31 )

Maximal energy difference in deg. subspaces: 2.6E-12
Minimal energy difference between subspaces: 1.9E-05

Wave functions:
  Number of bands:             198 -  200  (  200 )
            k points (IBZ):     64  (  12 /  30 )
            G vectors:         752
  k points of IBZ:
    1  (0.00000,0.00000,0.00000)  [ 0.00000, 0.00000, 0.00000 ]
    2  (0.00000,0.00000,0.25000)  [ 0.00000, 0.00000, 0.02550 ]
    3  (0.00000,0.00000,0.50000)  [ 0.00000, 0.00000, 0.05099 ]
    4  (0.00000,0.25000,0.00000)  [ 0.04147, 0.02394, 0.00000 ]
    5  (0.00000,0.25000,0.25000)  [ 0.04147, 0.02394, 0.02550 ]
    6  (0.00000,0.25000,0.50000)  [ 0.04147, 0.02394, 0.05099 ]
    7  (0.00000,0.50000,0.00000)  [ 0.08294, 0.04789, 0.00000 ]
    8  (0.00000,0.50000,0.25000)  [ 0.08294, 0.04789, 0.02550 ]
    9  (0.00000,0.50000,0.50000)  [ 0.08294, 0.04789, 0.05099 ]
   10  (0.25000,0.25000,0.00000)  [ 0.08294, 0.00000, 0.00000 ]
   11  (0.25000,0.25000,0.25000)  [ 0.08294, 0.00000, 0.02550 ]
   12  (0.25000,0.25000,0.50000)  [ 0.08294, 0.00000, 0.05099 ]
  k points of EIBZ (shifted set):
   65  (0.87777,0.87777,0.00000)  [ 0.29122, 0.00000, 0.00000 ]
   66  (0.87777,0.87777,0.25000)  [ 0.29122, 0.00000, 0.02550 ]
   67  (0.87777,0.87777,0.50000)  [ 0.29122, 0.00000, 0.05099 ]
   68  (0.87777,0.12777,0.00000)  [ 0.16681,-0.07183, 0.00000 ]
   69  (0.87777,0.12777,0.25000)  [ 0.16681,-0.07183, 0.02550 ]
   70  (0.87777,0.12777,0.50000)  [ 0.16681,-0.07183, 0.05099 ]
   71  (0.87777,0.37777,0.00000)  [ 0.20828,-0.04789, 0.00000 ]
   72  (0.87777,0.37777,0.25000)  [ 0.20828,-0.04789, 0.02550 ]
   73  (0.87777,0.37777,0.50000)  [ 0.20828,-0.04789, 0.05099 ]
   74  (0.87777,0.62777,0.00000)  [ 0.24975,-0.02394, 0.00000 ]
   75  (0.87777,0.62777,0.25000)  [ 0.24975,-0.02394, 0.02550 ]
   76  (0.87777,0.62777,0.50000)  [ 0.24975,-0.02394, 0.05099 ]
   77  (0.12777,0.12777,0.00000)  [ 0.04239, 0.00000, 0.00000 ]
   78  (0.12777,0.12777,0.25000)  [ 0.04239, 0.00000, 0.02550 ]
   79  (0.12777,0.12777,0.50000)  [ 0.04239, 0.00000, 0.05099 ]
   80  (0.12777,0.37777,0.00000)  [ 0.08386, 0.02394, 0.00000 ]
   81  (0.12777,0.37777,0.25000)  [ 0.08386, 0.02394, 0.02550 ]
   82  (0.12777,0.37777,0.50000)  [ 0.08386, 0.02394, 0.05099 ]
   83  (0.12777,0.62777,0.00000)  [ 0.12533, 0.04789, 0.00000 ]
   84  (0.12777,0.62777,0.25000)  [ 0.12533, 0.04789, 0.02550 ]
   85  (0.12777,0.62777,0.50000)  [ 0.12533, 0.04789, 0.05099 ]
   86  (0.37777,0.37777,0.00000)  [ 0.12533, 0.00000, 0.00000 ]
   87  (0.37777,0.37777,0.25000)  [ 0.12533, 0.00000, 0.02550 ]
   88  (0.37777,0.37777,0.50000)  [ 0.12533, 0.00000, 0.05099 ]
   89  (0.37777,0.62777,0.00000)  [ 0.16681, 0.02394, 0.00000 ]
   90  (0.37777,0.62777,0.25000)  [ 0.16681, 0.02394, 0.02550 ]
   91  (0.37777,0.62777,0.50000)  [ 0.16681, 0.02394, 0.05099 ]
   92  (0.62777,0.62777,0.00000)  [ 0.20828, 0.00000, 0.00000 ]
   93  (0.62777,0.62777,0.25000)  [ 0.20828, 0.00000, 0.02550 ]
   94  (0.62777,0.62777,0.50000)  [ 0.20828, 0.00000, 0.05099 ]

Generate wavefunctions at equivalent k points... done   ( Timing:   0.27 )

Size of array cpw:   209.8 MB
Size of array cmt:   260.9 MB

The system is not a metal.
The Fermi energy is placed in the center of the band gap.
KS energy gap:    0.07059528 Ha   (  1.92099521 eV )
Fermi energy:     0.29316457 Ha   (  7.97741378 eV )
Maximal energy:   5.57997353 Ha
Electron count error of the shifted k-point set:  0.0000000000000000

Wave-function checksum: -1.098676701426E-02


### subroutine: checkinput ###

Overlap <core|core>
Atom type  1
1s  1.000000
2s -0.000000  1.000000
3s  0.000000 -0.000001  0.999961
2p  0.999418
3p -0.000329  0.999458
Atom type  2
1s  0.999983

Overlap <core|basis>
Atom type  1
         u(s)    udot(s)
1s  0.000000  0.000000
2s  0.000001  0.000000
3s  0.004767 -0.007551
         u(p)    udot(p)
2p -0.000106 -0.000031
3p  0.017150 -0.021254
Atom type  2
         u(s)    udot(s)
1s  0.003209 -0.002046

Average overlap <core|val>
Atom type  1
1s  0.000000
2s  0.000000
3s  0.000679
2p  0.000010  0.000010  0.000010
3p  0.002209  0.002206  0.002209
Atom type  2
1s  0.000234

Maximum overlap <core|val> at (band/kpoint)
Atom type  1
1s  0.000000 (033/ 001)
2s  0.000001 (033/ 001)
3s  0.004363 (156/ 003)
2p  0.000055 (024/ 003)  0.000064 (024/ 001)  0.000059 (023/ 003)
3p  0.010975 (124/ 003)  0.014817 (111/ 001)  0.011078 (124/ 003)
Atom type  2
1s  0.001610 (002/ 079)

Overlap <basis|basis>
Atom type  1
   u(s)  1.000000
udot(s) -0.000000  0.129862
   u(p)  1.000000
udot(p) -0.000000  0.075237
   u(d)  1.000000
udot(d)  0.000000  0.733838
 ulo(d)  0.410292 -0.767526  1.000000
   u(f)  1.000000
udot(f)  0.000000  0.020278
   u(g)  1.000000
udot(g)  0.000000  0.006703
   u(h)  1.000000
udot(h) -0.000000  0.003149
   u(i)  1.000000
udot(i) -0.000000  0.001726
   u(j)  1.000000
udot(j) -0.000000  0.001039
   u(k)  1.000000
udot(k)  0.000000  0.000667
Atom type  2
   u(s)  1.000000
udot(s) -0.000000  0.023146
   u(p)  1.000000
udot(p)  0.000000  0.036192
   u(d)  1.000000
udot(d)  0.000000  0.003612
   u(f)  1.000000
udot(f) -0.000000  0.001183
   u(g)  1.000000
udot(g)  0.000000  0.000520
   u(h)  1.000000
udot(h) -0.000000  0.000271
   u(i)  1.000000
udot(i) -0.000000  0.000157


### subroutine: mixedbasis ( Mode: vv ) ###

Mixed basis
  Plane-wave basis:
    Number of unique G vectors:   362
    Maximal number of G vectors:  233

  MT basis read in from spex.mb (mode: vv).
    Total number of product-basis functions:  264



##### Job index:  1 #####


### subroutine: correlation ###

< GW self-energy >
Calculate periodic function...done   ( Timing:    0.04 )

=========

K point (   1 ):   0.00000   0.00000   0.00000

Coulomb matrix read from spex.cor
Inverse dielectric matrices read from spex.cor
Invert dielectric tensor... done   ( Timing:    0.02 )
Hermiticity of transformed Coulomb matrix: 5.1E-11

Add contribution to self-energy... done
                               Timings
  MT wave-func. products:      1.82414
  PW wave-func. products:      0.41358
  Matrix-vector products:      2.42522
  Transformations:             0.30224
  Exchange self-energy:        0.17478
  Frequency integration:       0.06312
  Tetrahedron weights:         0.00000
  Gamma-point correction:      0.45082
  MPI idle time:               0.01007      0.01848
  Other:                       0.16021
  ------------------------------------
  Total:                       5.82419

=========

K point (   2 ):   0.00000   0.00000   0.25000

Coulomb matrix read from spex.cor
Inverse dielectric matrices read from spex.cor
Hermiticity of transformed Coulomb matrix: 5.9E-10

Add contribution to self-energy... done
                               Timings
  MT wave-func. products:      1.91118
  PW wave-func. products:      0.45665
  Matrix-vector products:      2.16169
  Transformations:             0.24638
  Exchange self-energy:        0.14010
  Frequency integration:       0.01915
  Tetrahedron weights:         0.00000
  MPI idle time:               0.00928      0.01374
  Other:                       0.12307
  ------------------------------------
  Total:                       5.06750

=========

K point (   3 ):   0.00000   0.00000   0.50000

Coulomb matrix read from spex.cor
Inverse dielectric matrices read from spex.cor
Hermiticity of transformed Coulomb matrix: 1.8E-10

Add contribution to self-energy... done
                               Timings
  MT wave-func. products:      1.68164
  PW wave-func. products:      0.40532
  Matrix-vector products:      2.48757
  Transformations:             0.23112
  Exchange self-energy:        0.12917
  Frequency integration:       0.02103
  Tetrahedron weights:         0.00000
  MPI idle time:               0.02578      0.02578
  Other:                       0.17724
  ------------------------------------
  Total:                       5.15887

=========

K point (   4 ):   0.00000   0.25000   0.00000

Coulomb matrix read from spex.cor
Inverse dielectric matrices read from spex.cor
Hermiticity of transformed Coulomb matrix: 8.5E-11

Add contribution to self-energy... done
                               Timings
  MT wave-func. products:      3.09568
  PW wave-func. products:      0.75750
  Matrix-vector products:      7.10313
  Transformations:             0.90260
  Exchange self-energy:        0.19695
  Frequency integration:       0.10232
  Tetrahedron weights:         0.00000
  MPI idle time:               0.00003      0.02254
  Other:                       0.45529
  ------------------------------------
  Total:                      12.61350

=========

K point (   5 ):   0.00000   0.25000   0.25000

Coulomb matrix read from spex.cor
Inverse dielectric matrices read from spex.cor
Hermiticity of transformed Coulomb matrix: 9.7E-11

Add contribution to self-energy... done
                               Timings
  MT wave-func. products:      3.36154
  PW wave-func. products:      0.81865
  Matrix-vector products:      7.18563
  Transformations:             0.91589
  Exchange self-energy:        0.17815
  Frequency integration:       0.16539
  Tetrahedron weights:         0.00000
  MPI idle time:               0.00003      0.01587
  Other:                       0.53583
  ------------------------------------
  Total:                      13.16112

=========

K point (   6 ):   0.00000   0.25000   0.50000

Coulomb matrix read from spex.cor
Inverse dielectric matrices read from spex.cor
Hermiticity of transformed Coulomb matrix: 9.8E-11

Add contribution to self-energy... done
                               Timings
  MT wave-func. products:      2.83803
  PW wave-func. products:      0.72490
  Matrix-vector products:      7.09548
  Transformations:             0.84307
  Exchange self-energy:        0.17790
  Frequency integration:       0.20595
  Tetrahedron weights:         0.00000
  MPI idle time:               0.01394      0.01724
  Other:                       0.42393
  ------------------------------------
  Total:                      12.32320

=========

K point (   7 ):   0.00000   0.50000   0.00000

Coulomb matrix read from spex.cor
Inverse dielectric matrices read from spex.cor
Hermiticity of transformed Coulomb matrix: 1.0E-10

Add contribution to self-energy... done
                               Timings
  MT wave-func. products:      2.36530
  PW wave-func. products:      0.57743
  Matrix-vector products:      4.44279
  Transformations:             0.55801
  Exchange self-energy:        0.19473
  Frequency integration:       0.09893
  Tetrahedron weights:         0.00000
  MPI idle time:               0.01486      0.02008
  Other:                       0.31402
  ------------------------------------
  Total:                       8.56607

=========

K point (   8 ):   0.00000   0.50000   0.25000

Coulomb matrix read from spex.cor
Inverse dielectric matrices read from spex.cor
Hermiticity of transformed Coulomb matrix: 5.3E-11

Add contribution to self-energy... done
                               Timings
  MT wave-func. products:      2.36161
  PW wave-func. products:      0.58595
  Matrix-vector products:      4.36558
  Transformations:             0.55096
  Exchange self-energy:        0.15755
  Frequency integration:       0.04648
  Tetrahedron weights:         0.00000
  MPI idle time:               0.03880      0.03880
  Other:                       0.30461
  ------------------------------------
  Total:                       8.41154

=========

K point (   9 ):   0.00000   0.50000   0.50000

Coulomb matrix read from spex.cor
Inverse dielectric matrices read from spex.cor
Hermiticity of transformed Coulomb matrix: 4.1E-11

Add contribution to self-energy... done
                               Timings
  MT wave-func. products:      2.59370
  PW wave-func. products:      0.56890
  Matrix-vector products:      4.93482
  Transformations:             0.51596
  Exchange self-energy:        0.18127
  Frequency integration:       0.07517
  Tetrahedron weights:         0.00000
  MPI idle time:               0.00006      0.02294
  Other:                       0.24489
  ------------------------------------
  Total:                       9.11478

=========

K point (  10 ):   0.25000   0.25000   0.00000

Coulomb matrix read from spex.cor
Inverse dielectric matrices read from spex.cor
Hermiticity of transformed Coulomb matrix: 3.6E-11

Add contribution to self-energy... done
                               Timings
  MT wave-func. products:      3.98932
  PW wave-func. products:      1.03216
  Matrix-vector products:      9.27111
  Transformations:             1.12712
  Exchange self-energy:        0.20863
  Frequency integration:       0.16181
  Tetrahedron weights:         0.00000
  MPI idle time:               0.02991      0.02991
  Other:                       0.59434
  ------------------------------------
  Total:                      16.41441

=========

K point (  11 ):   0.25000   0.25000   0.25000

Coulomb matrix read from spex.cor
Inverse dielectric matrices read from spex.cor
Hermiticity of transformed Coulomb matrix: 5.4E-11

Add contribution to self-energy... done
                               Timings
  MT wave-func. products:      3.74554
  PW wave-func. products:      1.05138
  Matrix-vector products:      9.35244
  Transformations:             1.15921
  Exchange self-energy:        0.23064
  Frequency integration:       0.13400
  Tetrahedron weights:         0.00000
  MPI idle time:               0.02531      0.02531
  Other:                       0.59145
  ------------------------------------
  Total:                      16.28997

=========

K point (  12 ):   0.25000   0.25000   0.50000

Coulomb matrix read from spex.cor
Inverse dielectric matrices read from spex.cor
Hermiticity of transformed Coulomb matrix: 6.5E-11

Add contribution to self-energy... done
                               Timings
  MT wave-func. products:      4.11650
  PW wave-func. products:      1.00853
  Matrix-vector products:     14.65691
  Transformations:             1.27823
  Exchange self-energy:        0.25703
  Frequency integration:       0.32581
  Tetrahedron weights:         0.00000
  MPI idle time:               0.04021      0.04504
  Other:                       0.80249
  ------------------------------------
  Total:                      22.48570


### subroutine: exchange_core ###

        k point       band      exchange (core contribution)
  (0.878,0.878,0.000)   1     -2.7655220
  (0.878,0.878,0.000)   2     -8.5085968
  (0.878,0.878,0.000)   3    -17.8363624
  (0.878,0.878,0.000)   4    -17.8535668
  (0.878,0.878,0.000)   5    -17.9960891
  (0.878,0.878,0.000)   6    -17.7318580
  (0.878,0.878,0.000)   7    -17.0576335
  (0.878,0.878,0.000)   8    -18.3713539
  (0.878,0.878,0.000)   9    -18.4524682
  (0.878,0.878,0.000)  10    -18.4841116
  (0.878,0.878,0.000)  11    -18.5779982
  (0.878,0.878,0.000)  12    -11.9795019
  (0.878,0.878,0.000)  13     -1.4098499
  (0.878,0.878,0.000)  14     -1.8642714
  (0.878,0.878,0.000)  15     -2.3148318
  (0.878,0.878,0.000)  16     -1.9057248
  (0.878,0.878,0.000)  17     -2.0650734
  (0.878,0.878,0.000)  18     -1.9885503
  (0.878,0.878,0.000)  19     -1.7861149
  (0.878,0.878,0.000)  20     -2.1601341
  (0.878,0.878,0.000)  21     -1.8628945
  (0.878,0.878,0.000)  22     -1.4368651
  (0.878,0.878,0.000)  23     -1.6787515
  (0.878,0.878,0.000)  24     -2.0017503
  (0.878,0.878,0.000)  25     -1.9028924
  (0.878,0.878,0.000)  26     -1.9594814
  (0.878,0.878,0.000)  27     -1.7349117
  (0.878,0.878,0.000)  28     -1.3730642
  (0.878,0.878,0.000)  29     -1.0618718
  (0.878,0.878,0.000)  30     -1.4608118
Timing:   0.09




### subroutine: quasiparticle ###

Number of mesh points even: No constraint will be used.

List of k points
    0   0.87777   0.87777   0.00000  (additional)



#####################
### K POINT:    0 ###
#####################


--- DIAGONAL ELEMENTS [eV] ---

 Bd       vxc    sigmax    sigmac         Z        KS        HF          GW lin/dir
  1 -18.76469 -28.69439   8.23199   0.73559  -8.57546 -18.50516  -9.73174   0.95894
                          1.11150  -0.08325                      -9.73382   0.93615
  2 -28.31801 -39.67727   8.83373   0.72544  -7.96772 -19.32697  -9.77694   0.53794
                          0.61100  -0.03749                      -9.72075   0.51482
  3 -42.41631 -55.73225   9.51318   0.73686  -6.38379 -19.69973  -9.18471   0.11523
                          0.07353  -0.01605                      -9.08484   0.14091
  4 -42.44369 -55.75342   9.50803   0.73670  -6.37636 -19.68609  -9.17595   0.11160
                          0.07034  -0.01572                      -9.07578   0.13755
  5 -42.64874 -55.97710   9.49848   0.73820  -6.31385 -19.64222  -9.14015   0.10298
                          0.06370  -0.01461                      -9.03848   0.12876
  6 -42.21486 -55.46678   9.46840   0.73716  -6.30385 -19.55577  -9.09164   0.11916
                          0.07666  -0.01656                      -8.99311   0.14478
  7 -41.12473 -54.16601   9.37788   0.73523  -6.21745 -19.25873  -8.90847   0.16148
                          0.11193  -0.02161                      -8.81813   0.18621
  8 -43.19799 -56.54225   9.43508   0.74258  -6.19702 -19.54129  -9.09963   0.05633
                          0.02941  -0.00882                      -8.99081   0.08071
  9 -43.34989 -56.72009   9.45898   0.74249  -6.16535 -19.53555  -9.06912   0.05792
                          0.03041  -0.00904                      -8.96049   0.08250
 10 -43.41024 -56.78216   9.46544   0.74243  -6.12379 -19.49570  -9.02376   0.06223
                          0.03342  -0.00958                      -8.91596   0.08708
 11 -43.59934 -56.98442   9.48132   0.74260  -6.05857 -19.44365  -8.95719   0.06247
                          0.03379  -0.00958                      -8.84970   0.08719
 12 -33.89280 -45.17062   8.59752   0.73758  -4.55457 -15.83239  -6.50927   0.43070
                          0.35829  -0.06209                      -6.50174   0.43011
 13 -14.97347 -20.37221   4.15994   0.73532   0.61321  -4.78552  -0.29611   0.08006
                          0.07139  -0.02225                      -0.28426   0.08347
 14 -17.16475 -21.64203   3.38074   0.76326   3.84815  -0.62914   3.01123   0.00925
                          0.00630  -0.00406                       3.01973   0.01052
 15 -18.33158 -22.60487   3.25467   0.76586   4.39605   0.12275   3.61593   0.00606
                          0.00361  -0.00323                       3.62290   0.00727
 16 -18.40395 -22.35403   3.07185   0.77067   5.34170   1.39162   4.66488   0.00183
                          0.00101  -0.00120                       4.66977   0.00228
 17 -19.50854 -23.21757   2.95001   0.77415   6.48208   2.77305   5.89449   0.00067
                          0.00045  -0.00042                       5.89779   0.00080
 18 -19.41448 -23.06023   2.90907   0.77391   6.54308   2.89732   5.97295   0.00057
                          0.00040  -0.00035                       5.97606   0.00068
 19 -16.32109 -11.55855  -3.78456   0.79164  11.04426  15.80680  11.81848   0.00067
                          0.00430  -0.00280                      11.81421  -0.00161
 20 -16.17786 -10.44139  -4.48486   0.79658  13.18169  18.91815  14.17868  -0.00781
                         -0.00253  -0.00463                      14.16999  -0.01061
 21 -13.62234  -8.02708  -4.68301   0.80934  15.11059  20.70586  15.84880  -0.01914
                         -0.01430  -0.00829                      15.84403  -0.02054
 22 -14.19511  -8.43131  -4.84694   0.78716  15.14175  20.90556  15.86329  -0.02357
                         -0.01797  -0.01028                      15.85807  -0.02527
 23 -14.05356  -7.74666  -5.27230   0.78971  17.49404  23.80093  18.31026  -0.05482
                         -0.04672  -0.01732                      18.30360  -0.05710
 24 -13.96118  -7.85692  -5.13798   0.79728  17.60990  23.71416  18.37957  -0.05110
                         -0.04383  -0.01672                      18.37379  -0.05302
 25 -14.80992  -8.24869  -5.40210   0.78313  18.00745  24.56868  18.91413  -0.06545
                         -0.05503  -0.01929                      18.90544  -0.06849
 26 -14.47408  -7.87248  -5.48949   0.78654  19.71355  26.31515  20.58613  -0.09506
                         -0.08552  -0.02499                      20.57814  -0.09774
 27 -13.60275  -7.18125  -5.50739   0.78841  20.68880  27.11030  21.40639  -0.11119
                         -0.10765  -0.02879                      21.40090  -0.11269
 28 -12.37077  -6.33340  -5.41341   0.79152  20.90657  26.94394  21.39644  -0.12055
                         -0.12755  -0.03139                      21.39380  -0.12085
 29 -10.97027  -4.46156  -6.08073   0.78398  25.59874  32.10745  25.90969  -0.32866
                         -0.38430  -0.06397                      25.90805  -0.32709
 30 -12.31311  -5.56187  -6.14195   0.77902  25.62548  32.37672  26.07592  -0.33636
                         -0.38225  -0.06332                      26.07267  -0.33486

Timing (quasiparticle equation):   0.44650

Timing:       137
