########################
######### SPEX #########
########################
Version 05.00  (Sep  5, 2019)
Execution time: Jan 16, 2020  17:12:31
Hostname: login18-1.hpc.itc.rwth-aachen.de
MPI: 1,1


### subroutine: getinput ###

Basic parameters:
  Number of spins            =  1
            centers          =  4
            types            =  2
            equivalent atoms =  2  2
  Lattice parameter =      1.00000
  Lattice vectors   =      3.01411  -5.22060   0.00000
                           3.01411   5.22060   0.00000
                           0.00000   0.00000   9.80579
  Unit-cell volume  =    308.59778
  Reciprocal cutoff =      4.60000

Unit-cell geometry:
  # Ty  El              Coord.
  1  1  Ga   0.33333  -0.33333   0.00000
  2  1  Ga  -0.33333   0.33333   0.50000
  3  2  N    0.33333  -0.33333  -0.37700
  4  2  N   -0.33333   0.33333   0.12300

Symmetry information:
  Number of symmetry operations = 24
   #  Det           Axis           Angle   Syp  Inv
   1    1     --     --     --      --     Yes   1
   2   -1    1.00  -0.58   0.00   180.00   No    2
   3   -1    1.00   0.58   0.00   180.00   No    3
   4    1    0.00   0.00   1.00   120.00   Yes   9
   5    1    0.00   0.00   1.00   180.00   No    5
   6   -1    0.58   1.00   0.00   180.00   Yes   6
   7   -1    1.00   0.00   0.00   180.00   Yes   7
   8    1    0.00   0.00   1.00    60.00   No   11
   9    1    0.00   0.00  -1.00   120.00   Yes   4
  10   -1    0.00   1.00   0.00   180.00   No   10
  11    1    0.00   0.00  -1.00    60.00   No    8
  12   -1   -0.58   1.00   0.00   180.00   Yes  12
  13 - 24  Time reversal symmetries

##################
### Input file ###
##################
BZ       4 4 4
JOB      GW +:(1-10)
NBAND    200
RESTART  
KPT      +=(0,.92307,0)
 

Info: Simpson and Lagrange integration is used.

Radial mesh and basis functions:
  Number of radial grid points:       759  429
  Number of radial basis functions:    19   18
  Angular momentum quantum number:      8    6
  Maximal index:                        3

Core states:
  Atom type  1  (Ga)
  nl      Energy
  1s  -375.34991
  2s   -45.88297
  3s    -4.96076
  2p   -39.88207
  3p    -3.15226
  Atom type  2  (N )
  nl      Energy
  1s   -13.54409
  Number of valence electrons:   36

Average Coulomb potential: -0.35487  ( -9.65657 eV )

Read wavefunctions from harddisc... done   ( Timing:    0.25 )

Maximal energy difference in deg. subspaces: 2.0E-13
Minimal energy difference between subspaces: 5.9E-06

Wave functions:
  Number of bands:             198 -  200  (  200 )
            k points (IBZ):     64  (  12 /  30 )
            G vectors:         743
  k points of IBZ:
    1  (0.00000,0.00000,0.00000)  [ 0.00000, 0.00000, 0.00000 ]
    2  (0.00000,0.00000,0.25000)  [ 0.00000, 0.00000, 0.02550 ]
    3  (0.00000,0.00000,0.50000)  [ 0.00000, 0.00000, 0.05099 ]
    4  (0.00000,0.25000,0.00000)  [ 0.04147, 0.02394, 0.00000 ]
    5  (0.00000,0.25000,0.25000)  [ 0.04147, 0.02394, 0.02550 ]
    6  (0.00000,0.25000,0.50000)  [ 0.04147, 0.02394, 0.05099 ]
    7  (0.00000,0.50000,0.00000)  [ 0.08294, 0.04789, 0.00000 ]
    8  (0.00000,0.50000,0.25000)  [ 0.08294, 0.04789, 0.02550 ]
    9  (0.00000,0.50000,0.50000)  [ 0.08294, 0.04789, 0.05099 ]
   10  (0.25000,0.25000,0.00000)  [ 0.08294, 0.00000, 0.00000 ]
   11  (0.25000,0.25000,0.25000)  [ 0.08294, 0.00000, 0.02550 ]
   12  (0.25000,0.25000,0.50000)  [ 0.08294, 0.00000, 0.05099 ]
  k points of EIBZ (shifted set):
   65  (0.00000,0.92307,0.00000)  [ 0.15312, 0.08841, 0.00000 ]
   66  (0.00000,0.92307,0.25000)  [ 0.15312, 0.08841, 0.02550 ]
   67  (0.00000,0.92307,0.50000)  [ 0.15312, 0.08841, 0.05099 ]
   68  (0.00000,0.17307,0.00000)  [ 0.02871, 0.01658, 0.00000 ]
   69  (0.00000,0.17307,0.25000)  [ 0.02871, 0.01658, 0.02550 ]
   70  (0.00000,0.17307,0.50000)  [ 0.02871, 0.01658, 0.05099 ]
   71  (0.00000,0.42307,0.00000)  [ 0.07018, 0.04052, 0.00000 ]
   72  (0.00000,0.42307,0.25000)  [ 0.07018, 0.04052, 0.02550 ]
   73  (0.00000,0.42307,0.50000)  [ 0.07018, 0.04052, 0.05099 ]
   74  (0.00000,0.67307,0.00000)  [ 0.11165, 0.06446, 0.00000 ]
   75  (0.00000,0.67307,0.25000)  [ 0.11165, 0.06446, 0.02550 ]
   76  (0.00000,0.67307,0.50000)  [ 0.11165, 0.06446, 0.05099 ]
   77  (0.25000,0.92307,0.00000)  [ 0.19460, 0.06446, 0.00000 ]
   78  (0.25000,0.92307,0.25000)  [ 0.19460, 0.06446, 0.02550 ]
   79  (0.25000,0.92307,0.50000)  [ 0.19460, 0.06446, 0.05099 ]
   80  (0.25000,0.17307,0.00000)  [ 0.07018,-0.00737, 0.00000 ]
   81  (0.25000,0.17307,0.25000)  [ 0.07018,-0.00737, 0.02550 ]
   82  (0.25000,0.17307,0.50000)  [ 0.07018,-0.00737, 0.05099 ]
   83  (0.25000,0.42307,0.00000)  [ 0.11165, 0.01658, 0.00000 ]
   84  (0.25000,0.42307,0.25000)  [ 0.11165, 0.01658, 0.02550 ]
   85  (0.25000,0.42307,0.50000)  [ 0.11165, 0.01658, 0.05099 ]
   86  (0.25000,0.67307,0.00000)  [ 0.15312, 0.04052, 0.00000 ]
   87  (0.25000,0.67307,0.25000)  [ 0.15312, 0.04052, 0.02550 ]
   88  (0.25000,0.67307,0.50000)  [ 0.15312, 0.04052, 0.05099 ]
   89  (0.50000,0.92307,0.00000)  [ 0.23607, 0.04052, 0.00000 ]
   90  (0.50000,0.92307,0.25000)  [ 0.23607, 0.04052, 0.02550 ]
   91  (0.50000,0.92307,0.50000)  [ 0.23607, 0.04052, 0.05099 ]
   92  (0.50000,0.17307,0.00000)  [ 0.11165,-0.03131, 0.00000 ]
   93  (0.50000,0.17307,0.25000)  [ 0.11165,-0.03131, 0.02550 ]
   94  (0.50000,0.17307,0.50000)  [ 0.11165,-0.03131, 0.05099 ]

Generate wavefunctions at equivalent k points... done   ( Timing:   0.35 )

Size of array cpw:   209.8 MB
Size of array cmt:   260.9 MB

The system is not a metal.
The Fermi energy is placed in the center of the band gap.
KS energy gap:    0.07059528 Ha   (  1.92099521 eV )
Fermi energy:     0.29316457 Ha   (  7.97741378 eV )
Maximal energy:   5.57248232 Ha
Electron count error of the shifted k-point set:  0.0000000000000000

Wave-function checksum: -1.822323146036E-02


### subroutine: checkinput ###

Overlap <core|core>
Atom type  1
1s  1.000000 
2s -0.000000  1.000000 
3s  0.000000 -0.000001  0.999961 
2p  0.999418 
3p -0.000329  0.999458 
Atom type  2
1s  0.999983 

Overlap <core|basis>
Atom type  1
         u(s)    udot(s)
1s  0.000000  0.000000 
2s  0.000001  0.000000 
3s  0.004767 -0.007551 
         u(p)    udot(p)
2p -0.000106 -0.000031 
3p  0.017150 -0.021254 
Atom type  2
         u(s)    udot(s)
1s  0.003209 -0.002046 

Average overlap <core|val>
Atom type  1
1s  0.000000
2s  0.000000
3s  0.000679
2p  0.000010  0.000010  0.000010
3p  0.002208  0.002205  0.002208
Atom type  2
1s  0.000234

Maximum overlap <core|val> at (band/kpoint)
Atom type  1
1s  0.000000 (022/ 009)
2s  0.000001 (022/ 009)
3s  0.003767 (156/ 003)
2p  0.000060 (025/ 003)  0.000064 (024/ 001)  0.000067 (026/ 003)
3p  0.012494 (122/ 003)  0.014817 (111/ 001)  0.013262 (124/ 003)
Atom type  2
1s  0.001618 (002/ 070)

Overlap <basis|basis>
Atom type  1
   u(s)  1.000000 
udot(s)  0.000000  0.129862 
   u(p)  1.000000 
udot(p) -0.000000  0.075237 
   u(d)  1.000000 
udot(d) -0.000000  0.733838 
 ulo(d)  0.410292 -0.767526  1.000000 
   u(f)  1.000000 
udot(f) -0.000000  0.020278 
   u(g)  1.000000 
udot(g) -0.000000  0.006703 
   u(h)  1.000000 
udot(h)  0.000000  0.003149 
   u(i)  1.000000 
udot(i) -0.000000  0.001726 
   u(j)  1.000000 
udot(j)  0.000000  0.001039 
   u(k)  1.000000 
udot(k) -0.000000  0.000667 
Atom type  2
   u(s)  1.000000 
udot(s)  0.000000  0.023146 
   u(p)  1.000000 
udot(p)  0.000000  0.036192 
   u(d)  1.000000 
udot(d)  0.000000  0.003612 
   u(f)  1.000000 
udot(f)  0.000000  0.001183 
   u(g)  1.000000 
udot(g)  0.000000  0.000520 
   u(h)  1.000000 
udot(h) -0.000000  0.000271 
   u(i)  1.000000 
udot(i)  0.000000  0.000157 


### subroutine: mixedbasis ( Mode: vv ) ###

Mixed basis
  Plane-wave basis:
    Number of unique G vectors:   351
    Maximal number of G vectors:  233

  MT basis read in from spex.mb (mode: vv).
    Total number of product-basis functions:  264



##### Job index:  1 #####


### subroutine: correlation ###

< GW self-energy >
Calculate periodic function...done   ( Timing:    0.09 )

=========

K point (   1 ):   0.00000   0.00000   0.00000

Coulomb matrix read from spex.cor
Inverse dielectric matrices read from spex.cor 
Invert dielectric tensor... done   ( Timing:    0.02 )
Hermiticity of transformed Coulomb matrix: 6.8E-11

Add contribution to self-energy... done
                               Timings
  MT wave-func. products:      0.13511
  PW wave-func. products:      0.30598
  Matrix-vector products:      0.39102
  Transformations:             0.09723
  Exchange self-energy:        0.08470
  Frequency integration:       0.02009
  Tetrahedron weights:         0.00000
  Gamma-point correction:      1.52173
  MPI idle time:               0.00006      0.00006
  Other:                       0.06394
  ------------------------------------
  Total:                       2.61987

=========

K point (   2 ):   0.00000   0.00000   0.25000

Coulomb matrix read from spex.cor
Inverse dielectric matrices read from spex.cor 
Hermiticity of transformed Coulomb matrix: 8.7E-10

Add contribution to self-energy... done
                               Timings
  MT wave-func. products:      0.12828
  PW wave-func. products:      0.27546
  Matrix-vector products:      0.35560
  Transformations:             0.09058
  Exchange self-energy:        0.06419
  Frequency integration:       0.02205
  Tetrahedron weights:         0.00000
  MPI idle time:               0.00003      0.00003
  Other:                       0.05812
  ------------------------------------
  Total:                       0.99431

=========

K point (   3 ):   0.00000   0.00000   0.50000

Coulomb matrix read from spex.cor
Inverse dielectric matrices read from spex.cor 
Hermiticity of transformed Coulomb matrix: 2.4E-10

Add contribution to self-energy... done
                               Timings
  MT wave-func. products:      0.12875
  PW wave-func. products:      0.26704
  Matrix-vector products:      0.58290
  Transformations:             0.08785
  Exchange self-energy:        0.05458
  Frequency integration:       0.02054
  Tetrahedron weights:         0.00000
  MPI idle time:               0.00004      0.00004
  Other:                       0.05646
  ------------------------------------
  Total:                       1.19817

=========

K point (   4 ):   0.00000   0.25000   0.00000

Coulomb matrix read from spex.cor
Inverse dielectric matrices read from spex.cor 
Hermiticity of transformed Coulomb matrix: 1.5E-10

Add contribution to self-energy... done
                               Timings
  MT wave-func. products:      0.38681
  PW wave-func. products:      0.85978
  Matrix-vector products:      2.35409
  Transformations:             0.36003
  Exchange self-energy:        0.11274
  Frequency integration:       0.08007
  Tetrahedron weights:         0.00000
  MPI idle time:               0.00004      0.00004
  Other:                       0.19851
  ------------------------------------
  Total:                       4.35208

=========

K point (   5 ):   0.00000   0.25000   0.25000

Coulomb matrix read from spex.cor
Inverse dielectric matrices read from spex.cor 
Hermiticity of transformed Coulomb matrix: 1.5E-10

Add contribution to self-energy... done
                               Timings
  MT wave-func. products:      0.38545
  PW wave-func. products:      0.88525
  Matrix-vector products:      2.43479
  Transformations:             0.36545
  Exchange self-energy:        0.11380
  Frequency integration:       0.08020
  Tetrahedron weights:         0.00000
  MPI idle time:               0.00007      0.00007
  Other:                       0.19924
  ------------------------------------
  Total:                       4.46424

=========

K point (   6 ):   0.00000   0.25000   0.50000

Coulomb matrix read from spex.cor
Inverse dielectric matrices read from spex.cor 
Hermiticity of transformed Coulomb matrix: 1.4E-10

Add contribution to self-energy... done
                               Timings
  MT wave-func. products:      0.37761
  PW wave-func. products:      0.89204
  Matrix-vector products:      2.39863
  Transformations:             0.36856
  Exchange self-energy:        0.11667
  Frequency integration:       0.08291
  Tetrahedron weights:         0.00000
  MPI idle time:               0.00002      0.00002
  Other:                       0.19930
  ------------------------------------
  Total:                       4.43575

=========

K point (   7 ):   0.00000   0.50000   0.00000

Coulomb matrix read from spex.cor
Inverse dielectric matrices read from spex.cor 
Hermiticity of transformed Coulomb matrix: 1.3E-10

Add contribution to self-energy... done
                               Timings
  MT wave-func. products:      0.21247
  PW wave-func. products:      0.48263
  Matrix-vector products:      0.73394
  Transformations:             0.18883
  Exchange self-energy:        0.08022
  Frequency integration:       0.03996
  Tetrahedron weights:         0.00000
  MPI idle time:               0.00004      0.00004
  Other:                       0.10179
  ------------------------------------
  Total:                       1.83988

=========

K point (   8 ):   0.00000   0.50000   0.25000

Coulomb matrix read from spex.cor
Inverse dielectric matrices read from spex.cor 
Hermiticity of transformed Coulomb matrix: 7.9E-11

Add contribution to self-energy... done
                               Timings
  MT wave-func. products:      0.21353
  PW wave-func. products:      0.47689
  Matrix-vector products:      0.72044
  Transformations:             0.18505
  Exchange self-energy:        0.07619
  Frequency integration:       0.04005
  Tetrahedron weights:         0.00000
  MPI idle time:               0.00002      0.00002
  Other:                       0.10146
  ------------------------------------
  Total:                       1.81362

=========

K point (   9 ):   0.00000   0.50000   0.50000

Coulomb matrix read from spex.cor
Inverse dielectric matrices read from spex.cor 
Hermiticity of transformed Coulomb matrix: 5.5E-11

Add contribution to self-energy... done
                               Timings
  MT wave-func. products:      0.21468
  PW wave-func. products:      0.45026
  Matrix-vector products:      1.15156
  Transformations:             0.17937
  Exchange self-energy:        0.07158
  Frequency integration:       0.04007
  Tetrahedron weights:         0.00000
  MPI idle time:               0.00002      0.00002
  Other:                       0.10271
  ------------------------------------
  Total:                       2.21025

=========

K point (  10 ):   0.25000   0.25000   0.00000

Coulomb matrix read from spex.cor
Inverse dielectric matrices read from spex.cor 
Hermiticity of transformed Coulomb matrix: 5.5E-11

Add contribution to self-energy... done
                               Timings
  MT wave-func. products:      0.29876
  PW wave-func. products:      0.63704
  Matrix-vector products:      1.64551
  Transformations:             0.27452
  Exchange self-energy:        0.09125
  Frequency integration:       0.05998
  Tetrahedron weights:         0.00000
  MPI idle time:               0.00004      0.00004
  Other:                       0.14976
  ------------------------------------
  Total:                       3.15687

=========

K point (  11 ):   0.25000   0.25000   0.25000

Coulomb matrix read from spex.cor
Inverse dielectric matrices read from spex.cor 
Hermiticity of transformed Coulomb matrix: 8.0E-11

Add contribution to self-energy... done
                               Timings
  MT wave-func. products:      0.30226
  PW wave-func. products:      0.68306
  Matrix-vector products:      1.77120
  Transformations:             0.28069
  Exchange self-energy:        0.09667
  Frequency integration:       0.06030
  Tetrahedron weights:         0.00000
  MPI idle time:               0.00005      0.00005
  Other:                       0.15329
  ------------------------------------
  Total:                       3.34752

=========

K point (  12 ):   0.25000   0.25000   0.50000

Coulomb matrix read from spex.cor
Inverse dielectric matrices read from spex.cor 
Hermiticity of transformed Coulomb matrix: 9.9E-11

Add contribution to self-energy... done
                               Timings
  MT wave-func. products:      0.29837
  PW wave-func. products:      0.67220
  Matrix-vector products:      3.26200
  Transformations:             0.28469
  Exchange self-energy:        0.09413
  Frequency integration:       0.06194
  Tetrahedron weights:         0.00000
  MPI idle time:               0.00004      0.00004
  Other:                       0.14810
  ------------------------------------
  Total:                       4.82148


### subroutine: exchange_core ###

        k point       band      exchange (core contribution)
  (0.000,0.923,0.000)   1     -1.7137806
  (0.000,0.923,0.000)   2     -7.8059508
  (0.000,0.923,0.000)   3    -17.7448272
  (0.000,0.923,0.000)   4    -17.7809766
  (0.000,0.923,0.000)   5    -17.6605699
  (0.000,0.923,0.000)   6    -17.9297189
  (0.000,0.923,0.000)   7    -17.9514707
  (0.000,0.923,0.000)   8    -18.4427025
  (0.000,0.923,0.000)   9    -18.4541620
  (0.000,0.923,0.000)  10    -18.6180437
Timing:   0.15




### subroutine: quasiparticle ###

Number of mesh points even: No constraint will be used.

List of k points
    0   0.00000   0.92307   0.00000  (additional) 



#####################
### K POINT:    0 ###
#####################


--- DIAGONAL ELEMENTS [eV] ---

 Bd       vxc    sigmax    sigmac         Z        KS        HF          GW lin/dir 
  1 -16.84801 -26.56435   8.15288   0.73603  -8.89819 -18.61453  -9.92951   1.06086 
                          1.23609  -0.09662                      -9.93568   1.04745 
  2 -27.16006 -38.34450   8.75653   0.72773  -8.03962 -19.22406  -9.77780   0.59135 
                          0.66964  -0.04285                      -9.73038   0.56361 
  3 -42.25579 -55.55616   9.50451   0.73642  -6.42926 -19.72963  -9.22339   0.11636 
                          0.07446  -0.01621                      -9.12366   0.14204 
  4 -42.32826 -55.63780   9.51397   0.73615  -6.41101 -19.72055  -9.20393   0.11514 
                          0.07320  -0.01614                      -9.10407   0.14109 
  5 -42.11861 -55.38445   9.48877   0.73597  -6.39956 -19.66540  -9.17804   0.12072 
                          0.07777  -0.01681                      -9.07940   0.14657 
  6 -42.55520 -55.87471   9.50119   0.73771  -6.35226 -19.67178  -9.16808   0.10694 
                          0.06700  -0.01506                      -9.06715   0.13255 
  7 -42.59729 -55.92733   9.50970   0.73772  -6.34725 -19.67729  -9.16456   0.10786 
                          0.06776  -0.01515                      -9.06363   0.13343 
  8 -43.32749 -56.68254   9.44043   0.74289  -6.17439 -19.52944  -9.08230   0.05316 
                          0.02711  -0.00844                      -8.97306   0.07745 
  9 -43.34792 -56.70752   9.44289   0.74292  -6.17021 -19.52981  -9.07979   0.05297 
                          0.02700  -0.00840                      -8.97042   0.07725 
 10 -43.65630 -57.05733   9.48723   0.74274  -6.08204 -19.48306  -8.98867   0.05954 
                          0.03149  -0.00924                      -8.88045   0.08430 

Timing (quasiparticle equation):   0.12473

Timing:        37
