########################
######### SPEX #########
########################
Version 05.00  (Sep  5, 2019)
Execution time: Jan 17, 2020  23:33:59
Hostname: login18-1.hpc.itc.rwth-aachen.de
MPI: 1,1


### subroutine: getinput ###

Basic parameters:
  Number of spins            =  1
            centers          =  4
            types            =  2
            equivalent atoms =  2  2
  Lattice parameter =      1.00000
  Lattice vectors   =      3.01411  -5.22060   0.00000
                           3.01411   5.22060   0.00000
                           0.00000   0.00000   9.80579
  Unit-cell volume  =    308.59778
  Reciprocal cutoff =      4.60000

Unit-cell geometry:
  # Ty  El              Coord.
  1  1  Ga   0.33333  -0.33333   0.00000
  2  1  Ga  -0.33333   0.33333   0.50000
  3  2  N    0.33333  -0.33333  -0.37700
  4  2  N   -0.33333   0.33333   0.12300

Symmetry information:
  Number of symmetry operations = 24
   #  Det           Axis           Angle   Syp  Inv
   1    1     --     --     --      --     Yes   1
   2   -1    1.00  -0.58   0.00   180.00   No    2
   3   -1    1.00   0.58   0.00   180.00   No    3
   4    1    0.00   0.00   1.00   120.00   Yes   9
   5    1    0.00   0.00   1.00   180.00   No    5
   6   -1    0.58   1.00   0.00   180.00   Yes   6
   7   -1    1.00   0.00   0.00   180.00   Yes   7
   8    1    0.00   0.00   1.00    60.00   No   11
   9    1    0.00   0.00  -1.00   120.00   Yes   4
  10   -1    0.00   1.00   0.00   180.00   No   10
  11    1    0.00   0.00  -1.00    60.00   No    8
  12   -1   -0.58   1.00   0.00   180.00   Yes  12
  13 - 24  Time reversal symmetries

##################
### Input file ###
##################
BZ       4 4 4
JOB      GW +:(1-10)
NBAND    200
RESTART  
KPT      +=(.66666,.66666,0)
 

Info: Simpson and Lagrange integration is used.

Radial mesh and basis functions:
  Number of radial grid points:       759  429
  Number of radial basis functions:    19   18
  Angular momentum quantum number:      8    6
  Maximal index:                        3

Core states:
  Atom type  1  (Ga)
  nl      Energy
  1s  -375.34991
  2s   -45.88297
  3s    -4.96076
  2p   -39.88207
  3p    -3.15226
  Atom type  2  (N )
  nl      Energy
  1s   -13.54409
  Number of valence electrons:   36

Average Coulomb potential: -0.35487  ( -9.65657 eV )

Read wavefunctions from harddisc... done   ( Timing:    0.22 )

Maximal energy difference in deg. subspaces: 7.0E-14
Minimal energy difference between subspaces: 7.7E-08

Wave functions:
  Number of bands:             198 -  200  (  200 )
            k points (IBZ):     64  (  12 /  30 )
            G vectors:         765
  k points of IBZ:
    1  (0.00000,0.00000,0.00000)  [ 0.00000, 0.00000, 0.00000 ]
    2  (0.00000,0.00000,0.25000)  [ 0.00000, 0.00000, 0.02550 ]
    3  (0.00000,0.00000,0.50000)  [ 0.00000, 0.00000, 0.05099 ]
    4  (0.00000,0.25000,0.00000)  [ 0.04147, 0.02394, 0.00000 ]
    5  (0.00000,0.25000,0.25000)  [ 0.04147, 0.02394, 0.02550 ]
    6  (0.00000,0.25000,0.50000)  [ 0.04147, 0.02394, 0.05099 ]
    7  (0.00000,0.50000,0.00000)  [ 0.08294, 0.04789, 0.00000 ]
    8  (0.00000,0.50000,0.25000)  [ 0.08294, 0.04789, 0.02550 ]
    9  (0.00000,0.50000,0.50000)  [ 0.08294, 0.04789, 0.05099 ]
   10  (0.25000,0.25000,0.00000)  [ 0.08294, 0.00000, 0.00000 ]
   11  (0.25000,0.25000,0.25000)  [ 0.08294, 0.00000, 0.02550 ]
   12  (0.25000,0.25000,0.50000)  [ 0.08294, 0.00000, 0.05099 ]
  k points of EIBZ (shifted set):
   65  (0.66666,0.66666,0.00000)  [ 0.22118, 0.00000, 0.00000 ]
   66  (0.66666,0.66666,0.25000)  [ 0.22118, 0.00000, 0.02550 ]
   67  (0.66666,0.66666,0.50000)  [ 0.22118, 0.00000, 0.05099 ]
   68  (0.66666,0.91666,0.00000)  [ 0.26265, 0.02394, 0.00000 ]
   69  (0.66666,0.91666,0.25000)  [ 0.26265, 0.02394, 0.02550 ]
   70  (0.66666,0.91666,0.50000)  [ 0.26265, 0.02394, 0.05099 ]
   71  (0.66666,0.16666,0.00000)  [ 0.13824,-0.04789, 0.00000 ]
   72  (0.66666,0.16666,0.25000)  [ 0.13824,-0.04789, 0.02550 ]
   73  (0.66666,0.16666,0.50000)  [ 0.13824,-0.04789, 0.05099 ]
   74  (0.66666,0.41666,0.00000)  [ 0.17971,-0.02394, 0.00000 ]
   75  (0.66666,0.41666,0.25000)  [ 0.17971,-0.02394, 0.02550 ]
   76  (0.66666,0.41666,0.50000)  [ 0.17971,-0.02394, 0.05099 ]
   77  (0.91666,0.91666,0.00000)  [ 0.30412, 0.00000, 0.00000 ]
   78  (0.91666,0.91666,0.25000)  [ 0.30412, 0.00000, 0.02550 ]
   79  (0.91666,0.91666,0.50000)  [ 0.30412, 0.00000, 0.05099 ]
   80  (0.91666,0.16666,0.00000)  [ 0.17971,-0.07183, 0.00000 ]
   81  (0.91666,0.16666,0.25000)  [ 0.17971,-0.07183, 0.02550 ]
   82  (0.91666,0.16666,0.50000)  [ 0.17971,-0.07183, 0.05099 ]
   83  (0.91666,0.41666,0.00000)  [ 0.22118,-0.04789, 0.00000 ]
   84  (0.91666,0.41666,0.25000)  [ 0.22118,-0.04789, 0.02550 ]
   85  (0.91666,0.41666,0.50000)  [ 0.22118,-0.04789, 0.05099 ]
   86  (0.16666,0.16666,0.00000)  [ 0.05529, 0.00000, 0.00000 ]
   87  (0.16666,0.16666,0.25000)  [ 0.05529, 0.00000, 0.02550 ]
   88  (0.16666,0.16666,0.50000)  [ 0.05529, 0.00000, 0.05099 ]
   89  (0.16666,0.41666,0.00000)  [ 0.09676, 0.02394, 0.00000 ]
   90  (0.16666,0.41666,0.25000)  [ 0.09676, 0.02394, 0.02550 ]
   91  (0.16666,0.41666,0.50000)  [ 0.09676, 0.02394, 0.05099 ]
   92  (0.41666,0.41666,0.00000)  [ 0.13824, 0.00000, 0.00000 ]
   93  (0.41666,0.41666,0.25000)  [ 0.13824, 0.00000, 0.02550 ]
   94  (0.41666,0.41666,0.50000)  [ 0.13824, 0.00000, 0.05099 ]

Generate wavefunctions at equivalent k points... done   ( Timing:   0.29 )

Size of array cpw:   209.8 MB
Size of array cmt:   260.9 MB

The system is not a metal.
The Fermi energy is placed in the center of the band gap.
KS energy gap:    0.07059528 Ha   (  1.92099521 eV )
Fermi energy:     0.29316457 Ha   (  7.97741378 eV )
Maximal energy:   5.58386914 Ha
Electron count error of the shifted k-point set:  0.0000000000000000

Wave-function checksum:  1.349738600066E-02


### subroutine: checkinput ###

Overlap <core|core>
Atom type  1
1s  1.000000 
2s -0.000000  1.000000 
3s  0.000000 -0.000001  0.999961 
2p  0.999418 
3p -0.000329  0.999458 
Atom type  2
1s  0.999983 

Overlap <core|basis>
Atom type  1
         u(s)    udot(s)
1s  0.000000  0.000000 
2s  0.000001  0.000000 
3s  0.004767 -0.007551 
         u(p)    udot(p)
2p -0.000106 -0.000031 
3p  0.017150 -0.021254 
Atom type  2
         u(s)    udot(s)
1s  0.003209 -0.002046 

Average overlap <core|val>
Atom type  1
1s  0.000000
2s  0.000000
3s  0.000679
2p  0.000010  0.000010  0.000010
3p  0.002206  0.002204  0.002207
Atom type  2
1s  0.000234

Maximum overlap <core|val> at (band/kpoint)
Atom type  1
1s  0.000000 (022/ 009)
2s  0.000001 (022/ 009)
3s  0.003767 (156/ 003)
2p  0.000067 (027/ 067)  0.000064 (024/ 001)  0.000067 (026/ 003)
3p  0.012494 (122/ 003)  0.014817 (111/ 001)  0.013262 (124/ 003)
Atom type  2
1s  0.001652 (001/ 079)

Overlap <basis|basis>
Atom type  1
   u(s)  1.000000 
udot(s)  0.000000  0.129862 
   u(p)  1.000000 
udot(p) -0.000000  0.075237 
   u(d)  1.000000 
udot(d) -0.000000  0.733838 
 ulo(d)  0.410292 -0.767526  1.000000 
   u(f)  1.000000 
udot(f) -0.000000  0.020278 
   u(g)  1.000000 
udot(g) -0.000000  0.006703 
   u(h)  1.000000 
udot(h)  0.000000  0.003149 
   u(i)  1.000000 
udot(i) -0.000000  0.001726 
   u(j)  1.000000 
udot(j)  0.000000  0.001039 
   u(k)  1.000000 
udot(k) -0.000000  0.000667 
Atom type  2
   u(s)  1.000000 
udot(s)  0.000000  0.023146 
   u(p)  1.000000 
udot(p)  0.000000  0.036192 
   u(d)  1.000000 
udot(d)  0.000000  0.003612 
   u(f)  1.000000 
udot(f)  0.000000  0.001183 
   u(g)  1.000000 
udot(g)  0.000000  0.000520 
   u(h)  1.000000 
udot(h) -0.000000  0.000271 
   u(i)  1.000000 
udot(i)  0.000000  0.000157 


### subroutine: mixedbasis ( Mode: vv ) ###

Mixed basis
  Plane-wave basis:
    Number of unique G vectors:   369
    Maximal number of G vectors:  233

  MT basis read in from spex.mb (mode: vv).
    Total number of product-basis functions:  264



##### Job index:  1 #####


### subroutine: correlation ###

< GW self-energy >
Calculate periodic function...done   ( Timing:    0.08 )

=========

K point (   1 ):   0.00000   0.00000   0.00000

Coulomb matrix read from spex.cor
Inverse dielectric matrices read from spex.cor 
Invert dielectric tensor... done   ( Timing:    0.02 )
Hermiticity of transformed Coulomb matrix: 6.8E-11

Add contribution to self-energy... done
                               Timings
  MT wave-func. products:      0.11122
  PW wave-func. products:      0.25108
  Matrix-vector products:      0.33959
  Transformations:             0.08497
  Exchange self-energy:        0.06571
  Frequency integration:       0.01772
  Tetrahedron weights:         0.00000
  Gamma-point correction:      1.37756
  MPI idle time:               0.00007      0.00007
  Other:                       0.05168
  ------------------------------------
  Total:                       2.29961

=========

K point (   2 ):   0.00000   0.00000   0.25000

Coulomb matrix read from spex.cor
Inverse dielectric matrices read from spex.cor 
Hermiticity of transformed Coulomb matrix: 8.7E-10

Add contribution to self-energy... done
                               Timings
  MT wave-func. products:      0.11101
  PW wave-func. products:      0.24745
  Matrix-vector products:      0.33653
  Transformations:             0.08008
  Exchange self-energy:        0.05091
  Frequency integration:       0.01798
  Tetrahedron weights:         0.00000
  MPI idle time:               0.00002      0.00002
  Other:                       0.04914
  ------------------------------------
  Total:                       0.89311

=========

K point (   3 ):   0.00000   0.00000   0.50000

Coulomb matrix read from spex.cor
Inverse dielectric matrices read from spex.cor 
Hermiticity of transformed Coulomb matrix: 2.4E-10

Add contribution to self-energy... done
                               Timings
  MT wave-func. products:      0.11348
  PW wave-func. products:      0.23870
  Matrix-vector products:      0.51398
  Transformations:             0.07989
  Exchange self-energy:        0.04764
  Frequency integration:       0.01778
  Tetrahedron weights:         0.00000
  MPI idle time:               0.00002      0.00002
  Other:                       0.04954
  ------------------------------------
  Total:                       1.06103

=========

K point (   4 ):   0.00000   0.25000   0.00000

Coulomb matrix read from spex.cor
Inverse dielectric matrices read from spex.cor 
Hermiticity of transformed Coulomb matrix: 1.5E-10

Add contribution to self-energy... done
                               Timings
  MT wave-func. products:      0.26373
  PW wave-func. products:      0.61505
  Matrix-vector products:      1.65658
  Transformations:             0.24241
  Exchange self-energy:        0.08428
  Frequency integration:       0.05367
  Tetrahedron weights:         0.00000
  MPI idle time:               0.00004      0.00004
  Other:                       0.13318
  ------------------------------------
  Total:                       3.04895

=========

K point (   5 ):   0.00000   0.25000   0.25000

Coulomb matrix read from spex.cor
Inverse dielectric matrices read from spex.cor 
Hermiticity of transformed Coulomb matrix: 1.5E-10

Add contribution to self-energy... done
                               Timings
  MT wave-func. products:      0.26087
  PW wave-func. products:      0.61106
  Matrix-vector products:      1.64653
  Transformations:             0.24751
  Exchange self-energy:        0.08404
  Frequency integration:       0.05314
  Tetrahedron weights:         0.00000
  MPI idle time:               0.00002      0.00002
  Other:                       0.13321
  ------------------------------------
  Total:                       3.03639

=========

K point (   6 ):   0.00000   0.25000   0.50000

Coulomb matrix read from spex.cor
Inverse dielectric matrices read from spex.cor 
Hermiticity of transformed Coulomb matrix: 1.4E-10

Add contribution to self-energy... done
                               Timings
  MT wave-func. products:      0.25849
  PW wave-func. products:      0.62031
  Matrix-vector products:      1.69382
  Transformations:             0.25522
  Exchange self-energy:        0.08453
  Frequency integration:       0.05338
  Tetrahedron weights:         0.00000
  MPI idle time:               0.00004      0.00004
  Other:                       0.13407
  ------------------------------------
  Total:                       3.09987

=========

K point (   7 ):   0.00000   0.50000   0.00000

Coulomb matrix read from spex.cor
Inverse dielectric matrices read from spex.cor 
Hermiticity of transformed Coulomb matrix: 1.3E-10

Add contribution to self-energy... done
                               Timings
  MT wave-func. products:      0.18258
  PW wave-func. products:      0.44086
  Matrix-vector products:      0.69788
  Transformations:             0.16507
  Exchange self-energy:        0.07191
  Frequency integration:       0.03535
  Tetrahedron weights:         0.00000
  MPI idle time:               0.00002      0.00002
  Other:                       0.09069
  ------------------------------------
  Total:                       1.68436

=========

K point (   8 ):   0.00000   0.50000   0.25000

Coulomb matrix read from spex.cor
Inverse dielectric matrices read from spex.cor 
Hermiticity of transformed Coulomb matrix: 7.9E-11

Add contribution to self-energy... done
                               Timings
  MT wave-func. products:      0.18603
  PW wave-func. products:      0.44502
  Matrix-vector products:      0.68469
  Transformations:             0.16605
  Exchange self-energy:        0.06764
  Frequency integration:       0.03596
  Tetrahedron weights:         0.00000
  MPI idle time:               0.00002      0.00002
  Other:                       0.09091
  ------------------------------------
  Total:                       1.67632

=========

K point (   9 ):   0.00000   0.50000   0.50000

Coulomb matrix read from spex.cor
Inverse dielectric matrices read from spex.cor 
Hermiticity of transformed Coulomb matrix: 5.5E-11

Add contribution to self-energy... done
                               Timings
  MT wave-func. products:      0.18616
  PW wave-func. products:      0.41570
  Matrix-vector products:      1.05643
  Transformations:             0.15867
  Exchange self-energy:        0.06265
  Frequency integration:       0.03545
  Tetrahedron weights:         0.00000
  MPI idle time:               0.00002      0.00002
  Other:                       0.09045
  ------------------------------------
  Total:                       2.00553

=========

K point (  10 ):   0.25000   0.25000   0.00000

Coulomb matrix read from spex.cor
Inverse dielectric matrices read from spex.cor 
Hermiticity of transformed Coulomb matrix: 5.5E-11

Add contribution to self-energy... done
                               Timings
  MT wave-func. products:      0.33290
  PW wave-func. products:      0.80046
  Matrix-vector products:      2.06315
  Transformations:             0.32572
  Exchange self-energy:        0.10095
  Frequency integration:       0.07240
  Tetrahedron weights:         0.00000
  MPI idle time:               0.00005      0.00005
  Other:                       0.17826
  ------------------------------------
  Total:                       3.87389

=========

K point (  11 ):   0.25000   0.25000   0.25000

Coulomb matrix read from spex.cor
Inverse dielectric matrices read from spex.cor 
Hermiticity of transformed Coulomb matrix: 8.0E-11

Add contribution to self-energy... done
                               Timings
  MT wave-func. products:      0.33129
  PW wave-func. products:      0.80822
  Matrix-vector products:      2.08825
  Transformations:             0.32778
  Exchange self-energy:        0.10390
  Frequency integration:       0.07207
  Tetrahedron weights:         0.00000
  MPI idle time:               0.00002      0.00002
  Other:                       0.17643
  ------------------------------------
  Total:                       3.90797

=========

K point (  12 ):   0.25000   0.25000   0.50000

Coulomb matrix read from spex.cor
Inverse dielectric matrices read from spex.cor 
Hermiticity of transformed Coulomb matrix: 9.9E-11

Add contribution to self-energy... done
                               Timings
  MT wave-func. products:      0.32930
  PW wave-func. products:      0.81120
  Matrix-vector products:      3.84847
  Transformations:             0.33358
  Exchange self-energy:        0.10216
  Frequency integration:       0.07204
  Tetrahedron weights:         0.00000
  MPI idle time:               0.00004      0.00004
  Other:                       0.17033
  ------------------------------------
  Total:                       5.66712


### subroutine: exchange_core ###

        k point       band      exchange (core contribution)
  (0.667,0.667,0.000)   1     -8.8164652
  (0.667,0.667,0.000)   2     -8.8166113
  (0.667,0.667,0.000)   3    -17.7266315
  (0.667,0.667,0.000)   4    -18.2300829
  (0.667,0.667,0.000)   5    -18.2301049
  (0.667,0.667,0.000)   6    -18.3898008
  (0.667,0.667,0.000)   7    -18.3881013
  (0.667,0.667,0.000)   8    -18.3881129
  (0.667,0.667,0.000)   9    -18.5131252
  (0.667,0.667,0.000)  10    -18.5648481
Timing:   0.13




### subroutine: quasiparticle ###

Number of mesh points even: No constraint will be used.

List of k points
    0   0.66666   0.66666   0.00000  (additional) 



#####################
### K POINT:    0 ###
#####################


--- DIAGONAL ELEMENTS [eV] ---

 Bd       vxc    sigmax    sigmac         Z        KS        HF          GW lin/dir 
  1 -28.83002 -40.26039   8.86606   0.72343  -7.93063 -19.36100  -9.76539   0.51056 
                          0.58170  -0.03500                      -9.70532   0.49116 
  2 -28.83025 -40.26066   8.86606   0.72343  -7.93062 -19.36103  -9.76540   0.51055 
                          0.58169  -0.03500                      -9.70533   0.49115 
  3 -42.14510 -55.39889   9.44242   0.73764  -6.42053 -19.67432  -9.23099   0.10534 
                          0.06571  -0.01492                      -9.12981   0.13107 
  4 -43.07642 -56.44965   9.53096   0.73891  -6.21509 -19.58832  -9.05332   0.10024 
                          0.06149  -0.01426                      -8.95140   0.12600 
  5 -43.07646 -56.44969   9.53099   0.73891  -6.21508 -19.58831  -9.05329   0.10023 
                          0.06149  -0.01426                      -8.95138   0.12600 
  6 -43.28598 -56.70067   9.53642   0.74021  -6.19844 -19.61313  -9.06853   0.08599 
                          0.05069  -0.01250                      -8.96392   0.11145 
  7 -43.23075 -56.59660   9.46302   0.74197  -6.18402 -19.54988  -9.07948   0.06459 
                          0.03506  -0.00989                      -8.97183   0.08951 
  8 -43.23077 -56.59663   9.46301   0.74197  -6.18402 -19.54988  -9.07948   0.06459 
                          0.03506  -0.00989                      -8.97183   0.08951 
  9 -43.47219 -56.87938   9.50038   0.74184  -6.13667 -19.54387  -9.03455   0.06627 
                          0.03613  -0.01010                      -8.92706   0.09139 
 10 -43.56935 -56.95852   9.48337   0.74217  -6.09150 -19.48068  -8.98997   0.06173 
                          0.03277  -0.00958                      -8.88206   0.08701 

Timing (quasiparticle equation):   0.10781

Timing:        34
