%!PS-Adobe-2.0
%%Creator: gnuplot 4.6 patchlevel 2
%%CreationDate: Sat Jan 18 02:21:28 2020
%%DocumentFonts: (atend)
%%BoundingBox: 50 50 554 770
%%Orientation: Landscape
%%Pages: (atend)
%%EndComments
%%BeginProlog
/gnudict 256 dict def
gnudict begin
%
% The following true/false flags may be edited by hand if desired.
% The unit line width and grayscale image gamma correction may also be changed.
%
/Color true def
/Blacktext false def
/Solid false def
/Dashlength 1 def
/Landscape true def
/Level1 false def
/Rounded false def
/ClipToBoundingBox false def
/SuppressPDFMark false def
/TransparentPatterns false def
/gnulinewidth 5.000 def
/userlinewidth gnulinewidth def
/Gamma 1.0 def
/BackgroundColor {-1.000 -1.000 -1.000} def
%
/vshift -66 def
/dl1 {
  10.0 Dashlength mul mul
  Rounded { currentlinewidth 0.75 mul sub dup 0 le { pop 0.01 } if } if
} def
/dl2 {
  10.0 Dashlength mul mul
  Rounded { currentlinewidth 0.75 mul add } if
} def
/hpt_ 31.5 def
/vpt_ 31.5 def
/hpt hpt_ def
/vpt vpt_ def
/doclip {
  ClipToBoundingBox {
    newpath 50 50 moveto 554 50 lineto 554 770 lineto 50 770 lineto closepath
    clip
  } if
} def
%
% Gnuplot Prolog Version 4.6 (September 2012)
%
%/SuppressPDFMark true def
%
/M {moveto} bind def
/L {lineto} bind def
/R {rmoveto} bind def
/V {rlineto} bind def
/N {newpath moveto} bind def
/Z {closepath} bind def
/C {setrgbcolor} bind def
/f {rlineto fill} bind def
/g {setgray} bind def
/Gshow {show} def   % May be redefined later in the file to support UTF-8
/vpt2 vpt 2 mul def
/hpt2 hpt 2 mul def
/Lshow {currentpoint stroke M 0 vshift R 
	Blacktext {gsave 0 setgray show grestore} {show} ifelse} def
/Rshow {currentpoint stroke M dup stringwidth pop neg vshift R
	Blacktext {gsave 0 setgray show grestore} {show} ifelse} def
/Cshow {currentpoint stroke M dup stringwidth pop -2 div vshift R 
	Blacktext {gsave 0 setgray show grestore} {show} ifelse} def
/UP {dup vpt_ mul /vpt exch def hpt_ mul /hpt exch def
  /hpt2 hpt 2 mul def /vpt2 vpt 2 mul def} def
/DL {Color {setrgbcolor Solid {pop []} if 0 setdash}
 {pop pop pop 0 setgray Solid {pop []} if 0 setdash} ifelse} def
/BL {stroke userlinewidth 2 mul setlinewidth
	Rounded {1 setlinejoin 1 setlinecap} if} def
/AL {stroke userlinewidth 2 div setlinewidth
	Rounded {1 setlinejoin 1 setlinecap} if} def
/UL {dup gnulinewidth mul /userlinewidth exch def
	dup 1 lt {pop 1} if 10 mul /udl exch def} def
/PL {stroke userlinewidth setlinewidth
	Rounded {1 setlinejoin 1 setlinecap} if} def
3.8 setmiterlimit
% Default Line colors
/LCw {1 1 1} def
/LCb {0 0 0} def
/LCa {0 0 0} def
/LC0 {1 0 0} def
/LC1 {0 1 0} def
/LC2 {0 0 1} def
/LC3 {1 0 1} def
/LC4 {0 1 1} def
/LC5 {1 1 0} def
/LC6 {0 0 0} def
/LC7 {1 0.3 0} def
/LC8 {0.5 0.5 0.5} def
% Default Line Types
/LTw {PL [] 1 setgray} def
/LTb {BL [] LCb DL} def
/LTa {AL [1 udl mul 2 udl mul] 0 setdash LCa setrgbcolor} def
/LT0 {PL [] LC0 DL} def
/LT1 {PL [4 dl1 2 dl2] LC1 DL} def
/LT2 {PL [2 dl1 3 dl2] LC2 DL} def
/LT3 {PL [1 dl1 1.5 dl2] LC3 DL} def
/LT4 {PL [6 dl1 2 dl2 1 dl1 2 dl2] LC4 DL} def
/LT5 {PL [3 dl1 3 dl2 1 dl1 3 dl2] LC5 DL} def
/LT6 {PL [2 dl1 2 dl2 2 dl1 6 dl2] LC6 DL} def
/LT7 {PL [1 dl1 2 dl2 6 dl1 2 dl2 1 dl1 2 dl2] LC7 DL} def
/LT8 {PL [2 dl1 2 dl2 2 dl1 2 dl2 2 dl1 2 dl2 2 dl1 4 dl2] LC8 DL} def
/Pnt {stroke [] 0 setdash gsave 1 setlinecap M 0 0 V stroke grestore} def
/Dia {stroke [] 0 setdash 2 copy vpt add M
  hpt neg vpt neg V hpt vpt neg V
  hpt vpt V hpt neg vpt V closepath stroke
  Pnt} def
/Pls {stroke [] 0 setdash vpt sub M 0 vpt2 V
  currentpoint stroke M
  hpt neg vpt neg R hpt2 0 V stroke
 } def
/Box {stroke [] 0 setdash 2 copy exch hpt sub exch vpt add M
  0 vpt2 neg V hpt2 0 V 0 vpt2 V
  hpt2 neg 0 V closepath stroke
  Pnt} def
/Crs {stroke [] 0 setdash exch hpt sub exch vpt add M
  hpt2 vpt2 neg V currentpoint stroke M
  hpt2 neg 0 R hpt2 vpt2 V stroke} def
/TriU {stroke [] 0 setdash 2 copy vpt 1.12 mul add M
  hpt neg vpt -1.62 mul V
  hpt 2 mul 0 V
  hpt neg vpt 1.62 mul V closepath stroke
  Pnt} def
/Star {2 copy Pls Crs} def
/BoxF {stroke [] 0 setdash exch hpt sub exch vpt add M
  0 vpt2 neg V hpt2 0 V 0 vpt2 V
  hpt2 neg 0 V closepath fill} def
/TriUF {stroke [] 0 setdash vpt 1.12 mul add M
  hpt neg vpt -1.62 mul V
  hpt 2 mul 0 V
  hpt neg vpt 1.62 mul V closepath fill} def
/TriD {stroke [] 0 setdash 2 copy vpt 1.12 mul sub M
  hpt neg vpt 1.62 mul V
  hpt 2 mul 0 V
  hpt neg vpt -1.62 mul V closepath stroke
  Pnt} def
/TriDF {stroke [] 0 setdash vpt 1.12 mul sub M
  hpt neg vpt 1.62 mul V
  hpt 2 mul 0 V
  hpt neg vpt -1.62 mul V closepath fill} def
/DiaF {stroke [] 0 setdash vpt add M
  hpt neg vpt neg V hpt vpt neg V
  hpt vpt V hpt neg vpt V closepath fill} def
/Pent {stroke [] 0 setdash 2 copy gsave
  translate 0 hpt M 4 {72 rotate 0 hpt L} repeat
  closepath stroke grestore Pnt} def
/PentF {stroke [] 0 setdash gsave
  translate 0 hpt M 4 {72 rotate 0 hpt L} repeat
  closepath fill grestore} def
/Circle {stroke [] 0 setdash 2 copy
  hpt 0 360 arc stroke Pnt} def
/CircleF {stroke [] 0 setdash hpt 0 360 arc fill} def
/C0 {BL [] 0 setdash 2 copy moveto vpt 90 450 arc} bind def
/C1 {BL [] 0 setdash 2 copy moveto
	2 copy vpt 0 90 arc closepath fill
	vpt 0 360 arc closepath} bind def
/C2 {BL [] 0 setdash 2 copy moveto
	2 copy vpt 90 180 arc closepath fill
	vpt 0 360 arc closepath} bind def
/C3 {BL [] 0 setdash 2 copy moveto
	2 copy vpt 0 180 arc closepath fill
	vpt 0 360 arc closepath} bind def
/C4 {BL [] 0 setdash 2 copy moveto
	2 copy vpt 180 270 arc closepath fill
	vpt 0 360 arc closepath} bind def
/C5 {BL [] 0 setdash 2 copy moveto
	2 copy vpt 0 90 arc
	2 copy moveto
	2 copy vpt 180 270 arc closepath fill
	vpt 0 360 arc} bind def
/C6 {BL [] 0 setdash 2 copy moveto
	2 copy vpt 90 270 arc closepath fill
	vpt 0 360 arc closepath} bind def
/C7 {BL [] 0 setdash 2 copy moveto
	2 copy vpt 0 270 arc closepath fill
	vpt 0 360 arc closepath} bind def
/C8 {BL [] 0 setdash 2 copy moveto
	2 copy vpt 270 360 arc closepath fill
	vpt 0 360 arc closepath} bind def
/C9 {BL [] 0 setdash 2 copy moveto
	2 copy vpt 270 450 arc closepath fill
	vpt 0 360 arc closepath} bind def
/C10 {BL [] 0 setdash 2 copy 2 copy moveto vpt 270 360 arc closepath fill
	2 copy moveto
	2 copy vpt 90 180 arc closepath fill
	vpt 0 360 arc closepath} bind def
/C11 {BL [] 0 setdash 2 copy moveto
	2 copy vpt 0 180 arc closepath fill
	2 copy moveto
	2 copy vpt 270 360 arc closepath fill
	vpt 0 360 arc closepath} bind def
/C12 {BL [] 0 setdash 2 copy moveto
	2 copy vpt 180 360 arc closepath fill
	vpt 0 360 arc closepath} bind def
/C13 {BL [] 0 setdash 2 copy moveto
	2 copy vpt 0 90 arc closepath fill
	2 copy moveto
	2 copy vpt 180 360 arc closepath fill
	vpt 0 360 arc closepath} bind def
/C14 {BL [] 0 setdash 2 copy moveto
	2 copy vpt 90 360 arc closepath fill
	vpt 0 360 arc} bind def
/C15 {BL [] 0 setdash 2 copy vpt 0 360 arc closepath fill
	vpt 0 360 arc closepath} bind def
/Rec {newpath 4 2 roll moveto 1 index 0 rlineto 0 exch rlineto
	neg 0 rlineto closepath} bind def
/Square {dup Rec} bind def
/Bsquare {vpt sub exch vpt sub exch vpt2 Square} bind def
/S0 {BL [] 0 setdash 2 copy moveto 0 vpt rlineto BL Bsquare} bind def
/S1 {BL [] 0 setdash 2 copy vpt Square fill Bsquare} bind def
/S2 {BL [] 0 setdash 2 copy exch vpt sub exch vpt Square fill Bsquare} bind def
/S3 {BL [] 0 setdash 2 copy exch vpt sub exch vpt2 vpt Rec fill Bsquare} bind def
/S4 {BL [] 0 setdash 2 copy exch vpt sub exch vpt sub vpt Square fill Bsquare} bind def
/S5 {BL [] 0 setdash 2 copy 2 copy vpt Square fill
	exch vpt sub exch vpt sub vpt Square fill Bsquare} bind def
/S6 {BL [] 0 setdash 2 copy exch vpt sub exch vpt sub vpt vpt2 Rec fill Bsquare} bind def
/S7 {BL [] 0 setdash 2 copy exch vpt sub exch vpt sub vpt vpt2 Rec fill
	2 copy vpt Square fill Bsquare} bind def
/S8 {BL [] 0 setdash 2 copy vpt sub vpt Square fill Bsquare} bind def
/S9 {BL [] 0 setdash 2 copy vpt sub vpt vpt2 Rec fill Bsquare} bind def
/S10 {BL [] 0 setdash 2 copy vpt sub vpt Square fill 2 copy exch vpt sub exch vpt Square fill
	Bsquare} bind def
/S11 {BL [] 0 setdash 2 copy vpt sub vpt Square fill 2 copy exch vpt sub exch vpt2 vpt Rec fill
	Bsquare} bind def
/S12 {BL [] 0 setdash 2 copy exch vpt sub exch vpt sub vpt2 vpt Rec fill Bsquare} bind def
/S13 {BL [] 0 setdash 2 copy exch vpt sub exch vpt sub vpt2 vpt Rec fill
	2 copy vpt Square fill Bsquare} bind def
/S14 {BL [] 0 setdash 2 copy exch vpt sub exch vpt sub vpt2 vpt Rec fill
	2 copy exch vpt sub exch vpt Square fill Bsquare} bind def
/S15 {BL [] 0 setdash 2 copy Bsquare fill Bsquare} bind def
/D0 {gsave translate 45 rotate 0 0 S0 stroke grestore} bind def
/D1 {gsave translate 45 rotate 0 0 S1 stroke grestore} bind def
/D2 {gsave translate 45 rotate 0 0 S2 stroke grestore} bind def
/D3 {gsave translate 45 rotate 0 0 S3 stroke grestore} bind def
/D4 {gsave translate 45 rotate 0 0 S4 stroke grestore} bind def
/D5 {gsave translate 45 rotate 0 0 S5 stroke grestore} bind def
/D6 {gsave translate 45 rotate 0 0 S6 stroke grestore} bind def
/D7 {gsave translate 45 rotate 0 0 S7 stroke grestore} bind def
/D8 {gsave translate 45 rotate 0 0 S8 stroke grestore} bind def
/D9 {gsave translate 45 rotate 0 0 S9 stroke grestore} bind def
/D10 {gsave translate 45 rotate 0 0 S10 stroke grestore} bind def
/D11 {gsave translate 45 rotate 0 0 S11 stroke grestore} bind def
/D12 {gsave translate 45 rotate 0 0 S12 stroke grestore} bind def
/D13 {gsave translate 45 rotate 0 0 S13 stroke grestore} bind def
/D14 {gsave translate 45 rotate 0 0 S14 stroke grestore} bind def
/D15 {gsave translate 45 rotate 0 0 S15 stroke grestore} bind def
/DiaE {stroke [] 0 setdash vpt add M
  hpt neg vpt neg V hpt vpt neg V
  hpt vpt V hpt neg vpt V closepath stroke} def
/BoxE {stroke [] 0 setdash exch hpt sub exch vpt add M
  0 vpt2 neg V hpt2 0 V 0 vpt2 V
  hpt2 neg 0 V closepath stroke} def
/TriUE {stroke [] 0 setdash vpt 1.12 mul add M
  hpt neg vpt -1.62 mul V
  hpt 2 mul 0 V
  hpt neg vpt 1.62 mul V closepath stroke} def
/TriDE {stroke [] 0 setdash vpt 1.12 mul sub M
  hpt neg vpt 1.62 mul V
  hpt 2 mul 0 V
  hpt neg vpt -1.62 mul V closepath stroke} def
/PentE {stroke [] 0 setdash gsave
  translate 0 hpt M 4 {72 rotate 0 hpt L} repeat
  closepath stroke grestore} def
/CircE {stroke [] 0 setdash 
  hpt 0 360 arc stroke} def
/Opaque {gsave closepath 1 setgray fill grestore 0 setgray closepath} def
/DiaW {stroke [] 0 setdash vpt add M
  hpt neg vpt neg V hpt vpt neg V
  hpt vpt V hpt neg vpt V Opaque stroke} def
/BoxW {stroke [] 0 setdash exch hpt sub exch vpt add M
  0 vpt2 neg V hpt2 0 V 0 vpt2 V
  hpt2 neg 0 V Opaque stroke} def
/TriUW {stroke [] 0 setdash vpt 1.12 mul add M
  hpt neg vpt -1.62 mul V
  hpt 2 mul 0 V
  hpt neg vpt 1.62 mul V Opaque stroke} def
/TriDW {stroke [] 0 setdash vpt 1.12 mul sub M
  hpt neg vpt 1.62 mul V
  hpt 2 mul 0 V
  hpt neg vpt -1.62 mul V Opaque stroke} def
/PentW {stroke [] 0 setdash gsave
  translate 0 hpt M 4 {72 rotate 0 hpt L} repeat
  Opaque stroke grestore} def
/CircW {stroke [] 0 setdash 
  hpt 0 360 arc Opaque stroke} def
/BoxFill {gsave Rec 1 setgray fill grestore} def
/Density {
  /Fillden exch def
  currentrgbcolor
  /ColB exch def /ColG exch def /ColR exch def
  /ColR ColR Fillden mul Fillden sub 1 add def
  /ColG ColG Fillden mul Fillden sub 1 add def
  /ColB ColB Fillden mul Fillden sub 1 add def
  ColR ColG ColB setrgbcolor} def
/BoxColFill {gsave Rec PolyFill} def
/PolyFill {gsave Density fill grestore grestore} def
/h {rlineto rlineto rlineto gsave closepath fill grestore} bind def
%
% PostScript Level 1 Pattern Fill routine for rectangles
% Usage: x y w h s a XX PatternFill
%	x,y = lower left corner of box to be filled
%	w,h = width and height of box
%	  a = angle in degrees between lines and x-axis
%	 XX = 0/1 for no/yes cross-hatch
%
/PatternFill {gsave /PFa [ 9 2 roll ] def
  PFa 0 get PFa 2 get 2 div add PFa 1 get PFa 3 get 2 div add translate
  PFa 2 get -2 div PFa 3 get -2 div PFa 2 get PFa 3 get Rec
  TransparentPatterns {} {gsave 1 setgray fill grestore} ifelse
  clip
  currentlinewidth 0.5 mul setlinewidth
  /PFs PFa 2 get dup mul PFa 3 get dup mul add sqrt def
  0 0 M PFa 5 get rotate PFs -2 div dup translate
  0 1 PFs PFa 4 get div 1 add floor cvi
	{PFa 4 get mul 0 M 0 PFs V} for
  0 PFa 6 get ne {
	0 1 PFs PFa 4 get div 1 add floor cvi
	{PFa 4 get mul 0 2 1 roll M PFs 0 V} for
 } if
  stroke grestore} def
%
/languagelevel where
 {pop languagelevel} {1} ifelse
 2 lt
	{/InterpretLevel1 true def}
	{/InterpretLevel1 Level1 def}
 ifelse
%
% PostScript level 2 pattern fill definitions
%
/Level2PatternFill {
/Tile8x8 {/PaintType 2 /PatternType 1 /TilingType 1 /BBox [0 0 8 8] /XStep 8 /YStep 8}
	bind def
/KeepColor {currentrgbcolor [/Pattern /DeviceRGB] setcolorspace} bind def
<< Tile8x8
 /PaintProc {0.5 setlinewidth pop 0 0 M 8 8 L 0 8 M 8 0 L stroke} 
>> matrix makepattern
/Pat1 exch def
<< Tile8x8
 /PaintProc {0.5 setlinewidth pop 0 0 M 8 8 L 0 8 M 8 0 L stroke
	0 4 M 4 8 L 8 4 L 4 0 L 0 4 L stroke}
>> matrix makepattern
/Pat2 exch def
<< Tile8x8
 /PaintProc {0.5 setlinewidth pop 0 0 M 0 8 L
	8 8 L 8 0 L 0 0 L fill}
>> matrix makepattern
/Pat3 exch def
<< Tile8x8
 /PaintProc {0.5 setlinewidth pop -4 8 M 8 -4 L
	0 12 M 12 0 L stroke}
>> matrix makepattern
/Pat4 exch def
<< Tile8x8
 /PaintProc {0.5 setlinewidth pop -4 0 M 8 12 L
	0 -4 M 12 8 L stroke}
>> matrix makepattern
/Pat5 exch def
<< Tile8x8
 /PaintProc {0.5 setlinewidth pop -2 8 M 4 -4 L
	0 12 M 8 -4 L 4 12 M 10 0 L stroke}
>> matrix makepattern
/Pat6 exch def
<< Tile8x8
 /PaintProc {0.5 setlinewidth pop -2 0 M 4 12 L
	0 -4 M 8 12 L 4 -4 M 10 8 L stroke}
>> matrix makepattern
/Pat7 exch def
<< Tile8x8
 /PaintProc {0.5 setlinewidth pop 8 -2 M -4 4 L
	12 0 M -4 8 L 12 4 M 0 10 L stroke}
>> matrix makepattern
/Pat8 exch def
<< Tile8x8
 /PaintProc {0.5 setlinewidth pop 0 -2 M 12 4 L
	-4 0 M 12 8 L -4 4 M 8 10 L stroke}
>> matrix makepattern
/Pat9 exch def
/Pattern1 {PatternBgnd KeepColor Pat1 setpattern} bind def
/Pattern2 {PatternBgnd KeepColor Pat2 setpattern} bind def
/Pattern3 {PatternBgnd KeepColor Pat3 setpattern} bind def
/Pattern4 {PatternBgnd KeepColor Landscape {Pat5} {Pat4} ifelse setpattern} bind def
/Pattern5 {PatternBgnd KeepColor Landscape {Pat4} {Pat5} ifelse setpattern} bind def
/Pattern6 {PatternBgnd KeepColor Landscape {Pat9} {Pat6} ifelse setpattern} bind def
/Pattern7 {PatternBgnd KeepColor Landscape {Pat8} {Pat7} ifelse setpattern} bind def
} def
%
%
%End of PostScript Level 2 code
%
/PatternBgnd {
  TransparentPatterns {} {gsave 1 setgray fill grestore} ifelse
} def
%
% Substitute for Level 2 pattern fill codes with
% grayscale if Level 2 support is not selected.
%
/Level1PatternFill {
/Pattern1 {0.250 Density} bind def
/Pattern2 {0.500 Density} bind def
/Pattern3 {0.750 Density} bind def
/Pattern4 {0.125 Density} bind def
/Pattern5 {0.375 Density} bind def
/Pattern6 {0.625 Density} bind def
/Pattern7 {0.875 Density} bind def
} def
%
% Now test for support of Level 2 code
%
Level1 {Level1PatternFill} {Level2PatternFill} ifelse
%
/Symbol-Oblique /Symbol findfont [1 0 .167 1 0 0] makefont
dup length dict begin {1 index /FID eq {pop pop} {def} ifelse} forall
currentdict end definefont pop
/MFshow {
   { dup 5 get 3 ge
     { 5 get 3 eq {gsave} {grestore} ifelse }
     {dup dup 0 get findfont exch 1 get scalefont setfont
     [ currentpoint ] exch dup 2 get 0 exch R dup 5 get 2 ne {dup dup 6
     get exch 4 get {Gshow} {stringwidth pop 0 R} ifelse }if dup 5 get 0 eq
     {dup 3 get {2 get neg 0 exch R pop} {pop aload pop M} ifelse} {dup 5
     get 1 eq {dup 2 get exch dup 3 get exch 6 get stringwidth pop -2 div
     dup 0 R} {dup 6 get stringwidth pop -2 div 0 R 6 get
     show 2 index {aload pop M neg 3 -1 roll neg R pop pop} {pop pop pop
     pop aload pop M} ifelse }ifelse }ifelse }
     ifelse }
   forall} def
/Gswidth {dup type /stringtype eq {stringwidth} {pop (n) stringwidth} ifelse} def
/MFwidth {0 exch { dup 5 get 3 ge { 5 get 3 eq { 0 } { pop } ifelse }
 {dup 3 get{dup dup 0 get findfont exch 1 get scalefont setfont
     6 get Gswidth pop add} {pop} ifelse} ifelse} forall} def
/MLshow { currentpoint stroke M
  0 exch R
  Blacktext {gsave 0 setgray MFshow grestore} {MFshow} ifelse } bind def
/MRshow { currentpoint stroke M
  exch dup MFwidth neg 3 -1 roll R
  Blacktext {gsave 0 setgray MFshow grestore} {MFshow} ifelse } bind def
/MCshow { currentpoint stroke M
  exch dup MFwidth -2 div 3 -1 roll R
  Blacktext {gsave 0 setgray MFshow grestore} {MFshow} ifelse } bind def
/XYsave    { [( ) 1 2 true false 3 ()] } bind def
/XYrestore { [( ) 1 2 true false 4 ()] } bind def
Level1 SuppressPDFMark or 
{} {
/SDict 10 dict def
systemdict /pdfmark known not {
  userdict /pdfmark systemdict /cleartomark get put
} if
SDict begin [
  /Title ()
  /Subject (gnuplot plot)
  /Creator (gnuplot 4.6 patchlevel 2)
  /Author (vo580608)
%  /Producer (gnuplot)
%  /Keywords ()
  /CreationDate (Sat Jan 18 02:21:28 2020)
  /DOCINFO pdfmark
end
} ifelse
end
%%EndProlog
%%Page: 1 1
gnudict begin
gsave
doclip
50 50 translate
0.100 0.100 scale
90 rotate
0 -5040 translate
0 setgray
newpath
(Times-Roman) findfont 200 scalefont setfont
BackgroundColor 0 lt 3 1 roll 0 lt exch 0 lt or or not {gsave BackgroundColor C clippath fill grestore} if
1.000 UL
LTb
LCb setrgbcolor
740 689 M
63 0 V
6036 0 R
-63 0 V
stroke
620 689 M
[ [(Times-Roman) 200.0 0.0 true true 0 (-8)]
] -66.7 MRshow
1.000 UL
LTb
LCb setrgbcolor
740 1266 M
63 0 V
6036 0 R
-63 0 V
stroke
620 1266 M
[ [(Times-Roman) 200.0 0.0 true true 0 (-6)]
] -66.7 MRshow
1.000 UL
LTb
LCb setrgbcolor
740 1843 M
63 0 V
6036 0 R
-63 0 V
stroke
620 1843 M
[ [(Times-Roman) 200.0 0.0 true true 0 (-4)]
] -66.7 MRshow
1.000 UL
LTb
LCb setrgbcolor
740 2420 M
63 0 V
6036 0 R
-63 0 V
stroke
620 2420 M
[ [(Times-Roman) 200.0 0.0 true true 0 (-2)]
] -66.7 MRshow
1.000 UL
LTb
LCb setrgbcolor
740 2997 M
63 0 V
6036 0 R
-63 0 V
stroke
620 2997 M
[ [(Times-Roman) 200.0 0.0 true true 0 ( 0)]
] -66.7 MRshow
1.000 UL
LTb
LCb setrgbcolor
740 3574 M
63 0 V
6036 0 R
-63 0 V
stroke
620 3574 M
[ [(Times-Roman) 200.0 0.0 true true 0 ( 2)]
] -66.7 MRshow
1.000 UL
LTb
LCb setrgbcolor
740 4151 M
63 0 V
6036 0 R
-63 0 V
stroke
620 4151 M
[ [(Times-Roman) 200.0 0.0 true true 0 ( 4)]
] -66.7 MRshow
1.000 UL
LTb
LCb setrgbcolor
740 400 M
0 63 V
0 3976 R
0 -63 V
stroke
740 200 M
[ [(Times-Roman) 200.0 0.0 true true 0 ( )]
] -66.7 MCshow
1.000 UL
LTb
LCb setrgbcolor
1757 400 M
0 63 V
0 3976 R
0 -63 V
stroke
1757 200 M
[ [(Times-Roman) 200.0 0.0 true true 0 (M)]
] -66.7 MCshow
1.000 UL
LTb
LCb setrgbcolor
2344 400 M
0 63 V
0 3976 R
0 -63 V
stroke
2344 200 M
[ [(Times-Roman) 200.0 0.0 true true 0 (K)]
] -66.7 MCshow
1.000 UL
LTb
LCb setrgbcolor
3519 400 M
0 63 V
0 3976 R
0 -63 V
stroke
3519 200 M
[ [(Times-Roman) 200.0 0.0 true true 0 ( )]
] -66.7 MCshow
1.000 UL
LTb
LCb setrgbcolor
4060 400 M
0 63 V
0 3976 R
0 -63 V
stroke
4060 200 M
[ [(Times-Roman) 200.0 0.0 true true 0 (A)]
] -66.7 MCshow
1.000 UL
LTb
LCb setrgbcolor
5077 400 M
0 63 V
0 3976 R
0 -63 V
stroke
5077 200 M
[ [(Times-Roman) 200.0 0.0 true true 0 (L)]
] -66.7 MCshow
1.000 UL
LTb
LCb setrgbcolor
5665 400 M
0 63 V
0 3976 R
0 -63 V
stroke
5665 200 M
[ [(Times-Roman) 200.0 0.0 true true 0 (H)]
] -66.7 MCshow
1.000 UL
LTb
LCb setrgbcolor
6839 400 M
0 63 V
0 3976 R
0 -63 V
stroke
6839 200 M
[ [(Times-Roman) 200.0 0.0 true true 0 (A)]
] -66.7 MCshow
1.000 UL
LTb
LCb setrgbcolor
1.000 UL
LTb
LCb setrgbcolor
740 4439 N
740 400 L
6099 0 V
0 4039 V
-6099 0 V
Z stroke
LCb setrgbcolor
160 2419 M
currentpoint gsave translate -270 rotate 0 0 moveto
[ [(Times-Roman) 200.0 0.0 true true 0 (E - E)]
[(Times-Roman) 160.0 -60.0 true true 0 (F)]
[(Times-Roman) 200.0 0.0 true true 0 ( \(eV\))]
] -46.7 MCshow
grestore
LTb
LCb setrgbcolor
LTb
3789 4739 M
[ [(Times-Roman) 200.0 0.0 true true 0 (hP GaN)]
] -66.7 MCshow
1.000 UP
740 212 M
[ [(Symbol) 200.0 0.0 true true 0 (G)]
] -66.7 MCshow
3519 212 M
[ [(Symbol) 200.0 0.0 true true 0 (G)]
] -66.7 MCshow
1.000 UL
LTb
LCb setrgbcolor
740 400 M
0 4039 V
stroke
LTb
LCb setrgbcolor
1757 400 M
0 4039 V
stroke
LTb
LCb setrgbcolor
2344 400 M
0 4039 V
stroke
LTb
LCb setrgbcolor
3519 400 M
0 4039 V
stroke
LTb
LCb setrgbcolor
4060 400 M
0 4039 V
stroke
LTb
LCb setrgbcolor
5077 400 M
0 4039 V
stroke
LTb
LCb setrgbcolor
5665 400 M
0 4039 V
stroke
LTb
LCb setrgbcolor
6839 400 M
0 4039 V
stroke
LT2
LC2 setrgbcolor
740 2997 M
6099 0 V
stroke
LTb
LCb setrgbcolor
% Begin plot #1
0.500 UP
1.000 UL
LT0
LC0 setrgbcolor
/Times-Roman findfont 200 scalefont setfont
/vshift -66 def
740 975 CircleF
765 975 CircleF
791 977 CircleF
816 980 CircleF
842 985 CircleF
867 991 CircleF
893 998 CircleF
918 1006 CircleF
943 1016 CircleF
969 1027 CircleF
994 1039 CircleF
1020 1052 CircleF
1045 1066 CircleF
1071 1081 CircleF
1096 1097 CircleF
1121 1114 CircleF
1147 1132 CircleF
1172 1150 CircleF
1198 1169 CircleF
1223 1188 CircleF
1249 1207 CircleF
1274 1226 CircleF
1299 1244 CircleF
1325 1261 CircleF
1350 1275 CircleF
1376 1285 CircleF
1401 1291 CircleF
1427 1290 CircleF
1452 1283 CircleF
1477 1271 CircleF
1503 1256 CircleF
1528 1239 CircleF
1554 1221 CircleF
1579 1204 CircleF
1605 1189 CircleF
1630 1175 CircleF
1655 1164 CircleF
1681 1156 CircleF
1706 1150 CircleF
1732 1146 CircleF
1757 1145 CircleF
1783 1146 CircleF
1808 1148 CircleF
1834 1151 CircleF
1859 1155 CircleF
1885 1160 CircleF
1910 1167 CircleF
1936 1175 CircleF
1961 1184 CircleF
1987 1195 CircleF
2012 1207 CircleF
2038 1219 CircleF
2063 1234 CircleF
2089 1249 CircleF
2115 1266 CircleF
2140 1284 CircleF
2166 1303 CircleF
2191 1323 CircleF
2217 1345 CircleF
2242 1367 CircleF
2268 1391 CircleF
2293 1416 CircleF
2319 1442 CircleF
2344 1463 CircleF
2370 1451 CircleF
2395 1438 CircleF
2421 1425 CircleF
2446 1411 CircleF
2472 1399 CircleF
2497 1387 CircleF
2523 1377 CircleF
2549 1369 CircleF
2574 1362 CircleF
2600 1357 CircleF
2625 1353 CircleF
2651 1351 CircleF
2676 1350 CircleF
2702 1349 CircleF
2727 1348 CircleF
2753 1346 CircleF
2778 1342 CircleF
2804 1336 CircleF
2829 1327 CircleF
2855 1316 CircleF
2880 1302 CircleF
2906 1286 CircleF
2932 1268 CircleF
2957 1249 CircleF
2983 1230 CircleF
3008 1210 CircleF
3034 1190 CircleF
3059 1171 CircleF
3085 1152 CircleF
3110 1133 CircleF
3136 1115 CircleF
3161 1098 CircleF
3187 1082 CircleF
3212 1067 CircleF
3238 1052 CircleF
3263 1039 CircleF
3289 1028 CircleF
3314 1016 CircleF
3340 1006 CircleF
3366 998 CircleF
3391 991 CircleF
3417 985 CircleF
3442 981 CircleF
3468 977 CircleF
3493 975 CircleF
3519 975 CircleF
3543 977 CircleF
3568 986 CircleF
3593 1000 CircleF
3617 1020 CircleF
3642 1044 CircleF
3666 1074 CircleF
3691 1107 CircleF
3716 1145 CircleF
3740 1185 CircleF
3765 1229 CircleF
3789 1276 CircleF
3814 1324 CircleF
3839 1376 CircleF
3863 1429 CircleF
3888 1483 CircleF
3913 1539 CircleF
3937 1597 CircleF
3962 1656 CircleF
3986 1715 CircleF
4011 1775 CircleF
4036 1836 CircleF
4060 1897 CircleF
4086 1896 CircleF
4111 1896 CircleF
4137 1896 CircleF
4162 1895 CircleF
4187 1894 CircleF
4213 1893 CircleF
4238 1891 CircleF
4264 1888 CircleF
4289 1884 CircleF
4315 1879 CircleF
4340 1872 CircleF
4365 1863 CircleF
4391 1852 CircleF
4416 1838 CircleF
4442 1821 CircleF
4467 1800 CircleF
4492 1776 CircleF
4518 1749 CircleF
4543 1719 CircleF
4569 1686 CircleF
4594 1650 CircleF
4620 1612 CircleF
4645 1573 CircleF
4670 1534 CircleF
4696 1494 CircleF
4721 1453 CircleF
4747 1414 CircleF
4772 1375 CircleF
4798 1337 CircleF
4823 1301 CircleF
4848 1267 CircleF
4874 1236 CircleF
4899 1206 CircleF
4925 1180 CircleF
4950 1158 CircleF
4976 1139 CircleF
5001 1124 CircleF
5026 1113 CircleF
5052 1106 CircleF
5077 1104 CircleF
5103 1104 CircleF
5128 1106 CircleF
5154 1108 CircleF
5179 1112 CircleF
5205 1116 CircleF
5231 1121 CircleF
5256 1127 CircleF
5282 1133 CircleF
5307 1141 CircleF
5333 1148 CircleF
5358 1157 CircleF
5384 1166 CircleF
5409 1174 CircleF
5435 1183 CircleF
5460 1192 CircleF
5486 1200 CircleF
5511 1208 CircleF
5537 1214 CircleF
5562 1220 CircleF
5588 1224 CircleF
5613 1227 CircleF
5639 1229 CircleF
5665 1229 CircleF
5690 1229 CircleF
5716 1228 CircleF
5741 1228 CircleF
5767 1228 CircleF
5792 1230 CircleF
5818 1233 CircleF
5843 1238 CircleF
5869 1246 CircleF
5894 1255 CircleF
5920 1268 CircleF
5945 1283 CircleF
5971 1300 CircleF
5996 1320 CircleF
6022 1342 CircleF
6048 1366 CircleF
6073 1393 CircleF
6099 1421 CircleF
6124 1450 CircleF
6150 1481 CircleF
6175 1513 CircleF
6201 1545 CircleF
6226 1578 CircleF
6252 1611 CircleF
6277 1643 CircleF
6303 1675 CircleF
6328 1705 CircleF
6354 1733 CircleF
6379 1760 CircleF
6405 1784 CircleF
6430 1805 CircleF
6456 1824 CircleF
6482 1840 CircleF
6507 1853 CircleF
6533 1864 CircleF
6558 1872 CircleF
6584 1879 CircleF
6609 1884 CircleF
6635 1888 CircleF
6660 1891 CircleF
6686 1893 CircleF
6711 1894 CircleF
6737 1895 CircleF
6762 1896 CircleF
6788 1896 CircleF
6813 1896 CircleF
6839 1897 CircleF
740 2700 CircleF
765 2697 CircleF
791 2686 CircleF
816 2669 CircleF
842 2644 CircleF
867 2614 CircleF
893 2580 CircleF
918 2540 CircleF
943 2497 CircleF
969 2450 CircleF
994 2400 CircleF
1020 2347 CircleF
1045 2293 CircleF
1071 2237 CircleF
1096 2182 CircleF
1121 2125 CircleF
1147 2069 CircleF
1172 2013 CircleF
1198 1958 CircleF
1223 1905 CircleF
1249 1853 CircleF
1274 1803 CircleF
1299 1755 CircleF
1325 1712 CircleF
1350 1673 CircleF
1376 1639 CircleF
1401 1613 CircleF
1427 1594 CircleF
1452 1582 CircleF
1477 1577 CircleF
1503 1574 CircleF
1528 1570 CircleF
1554 1563 CircleF
1579 1552 CircleF
1605 1538 CircleF
1630 1523 CircleF
1655 1508 CircleF
1681 1496 CircleF
1706 1487 CircleF
1732 1481 CircleF
1757 1480 CircleF
1783 1480 CircleF
1808 1481 CircleF
1834 1482 CircleF
1859 1484 CircleF
1885 1486 CircleF
1910 1489 CircleF
1936 1492 CircleF
1961 1495 CircleF
1987 1499 CircleF
2012 1502 CircleF
2038 1505 CircleF
2063 1508 CircleF
2089 1511 CircleF
2115 1513 CircleF
2140 1513 CircleF
2166 1513 CircleF
2191 1511 CircleF
2217 1507 CircleF
2242 1501 CircleF
2268 1494 CircleF
2293 1485 CircleF
2319 1475 CircleF
2344 1463 CircleF
2370 1460 CircleF
2395 1451 CircleF
2421 1445 CircleF
2446 1441 CircleF
2472 1442 CircleF
2497 1446 CircleF
2523 1453 CircleF
2549 1464 CircleF
2574 1479 CircleF
2600 1496 CircleF
2625 1517 CircleF
2651 1540 CircleF
2676 1566 CircleF
2702 1595 CircleF
2727 1626 CircleF
2753 1659 CircleF
2778 1694 CircleF
2804 1731 CircleF
2829 1756 CircleF
2855 1768 CircleF
2880 1786 CircleF
2906 1810 CircleF
2932 1838 CircleF
2957 1871 CircleF
2983 1907 CircleF
3008 1946 CircleF
3034 1987 CircleF
3059 2031 CircleF
3085 2076 CircleF
3110 2123 CircleF
3136 2172 CircleF
3161 2220 CircleF
3187 2269 CircleF
3212 2318 CircleF
3238 2367 CircleF
3263 2414 CircleF
3289 2460 CircleF
3314 2504 CircleF
3340 2545 CircleF
3366 2583 CircleF
3391 2615 CircleF
3417 2645 CircleF
3442 2669 CircleF
3468 2686 CircleF
3493 2697 CircleF
3519 2700 CircleF
3543 2701 CircleF
3568 2702 CircleF
3593 2704 CircleF
3617 2706 CircleF
3642 2710 CircleF
3666 2714 CircleF
3691 2718 CircleF
3716 2722 CircleF
3740 2669 CircleF
3765 2614 CircleF
3789 2557 CircleF
3814 2500 CircleF
3839 2442 CircleF
3863 2382 CircleF
3888 2323 CircleF
3913 2262 CircleF
3937 2201 CircleF
3962 2141 CircleF
3986 2080 CircleF
4011 2019 CircleF
4036 1958 CircleF
4060 1897 CircleF
4086 1896 CircleF
4111 1896 CircleF
4137 1896 CircleF
4162 1895 CircleF
4187 1894 CircleF
4213 1893 CircleF
4238 1891 CircleF
4264 1888 CircleF
4289 1884 CircleF
4315 1879 CircleF
4340 1872 CircleF
4365 1863 CircleF
4391 1852 CircleF
4416 1838 CircleF
4442 1821 CircleF
4467 1800 CircleF
4492 1776 CircleF
4518 1749 CircleF
4543 1719 CircleF
4569 1686 CircleF
4594 1650 CircleF
4620 1612 CircleF
4645 1573 CircleF
4670 1534 CircleF
4696 1494 CircleF
4721 1453 CircleF
4747 1414 CircleF
4772 1375 CircleF
4798 1337 CircleF
4823 1301 CircleF
4848 1267 CircleF
4874 1236 CircleF
4899 1206 CircleF
4925 1180 CircleF
4950 1158 CircleF
4976 1139 CircleF
5001 1124 CircleF
5026 1113 CircleF
5052 1106 CircleF
5077 1104 CircleF
5103 1104 CircleF
5128 1106 CircleF
5154 1108 CircleF
5179 1112 CircleF
5205 1116 CircleF
5231 1121 CircleF
5256 1127 CircleF
5282 1133 CircleF
5307 1141 CircleF
5333 1148 CircleF
5358 1157 CircleF
5384 1166 CircleF
5409 1174 CircleF
5435 1183 CircleF
5460 1192 CircleF
5486 1200 CircleF
5511 1208 CircleF
5537 1214 CircleF
5562 1220 CircleF
5588 1224 CircleF
5613 1227 CircleF
5639 1229 CircleF
5665 1229 CircleF
5690 1229 CircleF
5716 1228 CircleF
5741 1228 CircleF
5767 1228 CircleF
5792 1230 CircleF
5818 1233 CircleF
5843 1238 CircleF
5869 1246 CircleF
5894 1255 CircleF
5920 1268 CircleF
5945 1283 CircleF
5971 1300 CircleF
5996 1320 CircleF
6022 1342 CircleF
6048 1366 CircleF
6073 1393 CircleF
6099 1421 CircleF
6124 1450 CircleF
6150 1481 CircleF
6175 1513 CircleF
6201 1545 CircleF
6226 1578 CircleF
6252 1611 CircleF
6277 1643 CircleF
6303 1675 CircleF
6328 1705 CircleF
6354 1733 CircleF
6379 1760 CircleF
6405 1784 CircleF
6430 1805 CircleF
6456 1824 CircleF
6482 1840 CircleF
6507 1853 CircleF
6533 1864 CircleF
6558 1872 CircleF
6584 1879 CircleF
6609 1884 CircleF
6635 1888 CircleF
6660 1891 CircleF
6686 1893 CircleF
6711 1894 CircleF
6737 1895 CircleF
6762 1896 CircleF
6788 1896 CircleF
6813 1896 CircleF
6839 1897 CircleF
740 2700 CircleF
765 2699 CircleF
791 2696 CircleF
816 2692 CircleF
842 2685 CircleF
867 2676 CircleF
893 2667 CircleF
918 2655 CircleF
943 2643 CircleF
969 2629 CircleF
994 2613 CircleF
1020 2597 CircleF
1045 2566 CircleF
1071 2517 CircleF
1096 2468 CircleF
1121 2419 CircleF
1147 2369 CircleF
1172 2319 CircleF
1198 2270 CircleF
1223 2221 CircleF
1249 2173 CircleF
1274 2124 CircleF
1299 2077 CircleF
1325 2031 CircleF
1350 1986 CircleF
1376 1943 CircleF
1401 1902 CircleF
1427 1864 CircleF
1452 1828 CircleF
1477 1797 CircleF
1503 1772 CircleF
1528 1754 CircleF
1554 1746 CircleF
1579 1745 CircleF
1605 1751 CircleF
1630 1761 CircleF
1655 1771 CircleF
1681 1781 CircleF
1706 1790 CircleF
1732 1795 CircleF
1757 1797 CircleF
1783 1797 CircleF
1808 1798 CircleF
1834 1800 CircleF
1859 1802 CircleF
1885 1805 CircleF
1910 1808 CircleF
1936 1811 CircleF
1961 1813 CircleF
1987 1812 CircleF
2012 1806 CircleF
2038 1795 CircleF
2063 1777 CircleF
2089 1752 CircleF
2115 1724 CircleF
2140 1692 CircleF
2166 1659 CircleF
2191 1627 CircleF
2217 1596 CircleF
2242 1567 CircleF
2268 1541 CircleF
2293 1517 CircleF
2319 1497 CircleF
2344 1486 CircleF
2370 1502 CircleF
2395 1531 CircleF
2421 1561 CircleF
2446 1593 CircleF
2472 1626 CircleF
2497 1660 CircleF
2523 1695 CircleF
2549 1731 CircleF
2574 1767 CircleF
2600 1804 CircleF
2625 1842 CircleF
2651 1824 CircleF
2676 1801 CircleF
2702 1782 CircleF
2727 1766 CircleF
2753 1755 CircleF
2778 1750 CircleF
2804 1750 CircleF
2829 1770 CircleF
2855 1811 CircleF
2880 1854 CircleF
2906 1897 CircleF
2932 1943 CircleF
2957 1989 CircleF
2983 2036 CircleF
3008 2085 CircleF
3034 2134 CircleF
3059 2184 CircleF
3085 2234 CircleF
3110 2284 CircleF
3136 2334 CircleF
3161 2383 CircleF
3187 2432 CircleF
3212 2479 CircleF
3238 2523 CircleF
3263 2563 CircleF
3289 2596 CircleF
3314 2624 CircleF
3340 2644 CircleF
3366 2661 CircleF
3391 2674 CircleF
3417 2684 CircleF
3442 2692 CircleF
3468 2697 CircleF
3493 2699 CircleF
3519 2700 CircleF
3543 2701 CircleF
3568 2702 CircleF
3593 2704 CircleF
3617 2706 CircleF
3642 2710 CircleF
3666 2714 CircleF
3691 2718 CircleF
3716 2724 CircleF
3740 2730 CircleF
3765 2736 CircleF
3789 2743 CircleF
3814 2751 CircleF
3839 2759 CircleF
3863 2767 CircleF
3888 2776 CircleF
3913 2786 CircleF
3937 2797 CircleF
3962 2807 CircleF
3986 2817 CircleF
4011 2828 CircleF
4036 2839 CircleF
4060 2849 CircleF
4086 2846 CircleF
4111 2837 CircleF
4137 2823 CircleF
4162 2805 CircleF
4187 2783 CircleF
4213 2757 CircleF
4238 2729 CircleF
4264 2698 CircleF
4289 2667 CircleF
4315 2634 CircleF
4340 2602 CircleF
4365 2570 CircleF
4391 2540 CircleF
4416 2511 CircleF
4442 2486 CircleF
4467 2463 CircleF
4492 2444 CircleF
4518 2428 CircleF
4543 2416 CircleF
4569 2407 CircleF
4594 2400 CircleF
4620 2397 CircleF
4645 2395 CircleF
4670 2396 CircleF
4696 2399 CircleF
4721 2402 CircleF
4747 2407 CircleF
4772 2412 CircleF
4798 2418 CircleF
4823 2423 CircleF
4848 2429 CircleF
4874 2435 CircleF
4899 2440 CircleF
4925 2445 CircleF
4950 2449 CircleF
4976 2451 CircleF
5001 2448 CircleF
5026 2445 CircleF
5052 2443 CircleF
5077 2443 CircleF
5103 2431 CircleF
5128 2410 CircleF
5154 2386 CircleF
5179 2358 CircleF
5205 2328 CircleF
5231 2295 CircleF
5256 2260 CircleF
5282 2222 CircleF
5307 2183 CircleF
5333 2143 CircleF
5358 2103 CircleF
5384 2063 CircleF
5409 2024 CircleF
5435 1986 CircleF
5460 1950 CircleF
5486 1917 CircleF
5511 1888 CircleF
5537 1861 CircleF
5562 1839 CircleF
5588 1821 CircleF
5613 1808 CircleF
5639 1801 CircleF
5665 1798 CircleF
5690 1801 CircleF
5716 1808 CircleF
5741 1819 CircleF
5767 1835 CircleF
5792 1853 CircleF
5818 1874 CircleF
5843 1898 CircleF
5869 1924 CircleF
5894 1952 CircleF
5920 1982 CircleF
5945 2012 CircleF
5971 2045 CircleF
5996 2078 CircleF
6022 2112 CircleF
6048 2146 CircleF
6073 2181 CircleF
6099 2215 CircleF
6124 2250 CircleF
6150 2283 CircleF
6175 2316 CircleF
6201 2346 CircleF
6226 2373 CircleF
6252 2394 CircleF
6277 2409 CircleF
6303 2420 CircleF
6328 2429 CircleF
6354 2439 CircleF
6379 2450 CircleF
6405 2464 CircleF
6430 2481 CircleF
6456 2502 CircleF
6482 2525 CircleF
6507 2551 CircleF
6533 2579 CircleF
6558 2608 CircleF
6584 2638 CircleF
6609 2669 CircleF
6635 2700 CircleF
6660 2730 CircleF
6686 2758 CircleF
6711 2783 CircleF
6737 2805 CircleF
6762 2823 CircleF
6788 2838 CircleF
6813 2846 CircleF
6839 2849 CircleF
740 2987 CircleF
765 2986 CircleF
791 2975 CircleF
816 2951 CircleF
842 2920 CircleF
867 2884 CircleF
893 2844 CircleF
918 2801 CircleF
943 2757 CircleF
969 2711 CircleF
994 2664 CircleF
1020 2615 CircleF
1045 2580 CircleF
1071 2562 CircleF
1096 2544 CircleF
1121 2526 CircleF
1147 2506 CircleF
1172 2487 CircleF
1198 2469 CircleF
1223 2450 CircleF
1249 2432 CircleF
1274 2414 CircleF
1299 2396 CircleF
1325 2378 CircleF
1350 2361 CircleF
1376 2345 CircleF
1401 2329 CircleF
1427 2314 CircleF
1452 2300 CircleF
1477 2287 CircleF
1503 2275 CircleF
1528 2265 CircleF
1554 2254 CircleF
1579 2245 CircleF
1605 2238 CircleF
1630 2231 CircleF
1655 2225 CircleF
1681 2221 CircleF
1706 2218 CircleF
1732 2216 CircleF
1757 2215 CircleF
1783 2212 CircleF
1808 2204 CircleF
1834 2189 CircleF
1859 2169 CircleF
1885 2146 CircleF
1910 2120 CircleF
1936 2092 CircleF
1961 2064 CircleF
1987 2036 CircleF
2012 2012 CircleF
2038 1995 CircleF
2063 1985 CircleF
2089 1984 CircleF
2115 1989 CircleF
2140 1998 CircleF
2166 2011 CircleF
2191 2026 CircleF
2217 2043 CircleF
2242 2061 CircleF
2268 2082 CircleF
2293 2103 CircleF
2319 2124 CircleF
2344 2147 CircleF
2370 2123 CircleF
2395 2098 CircleF
2421 2071 CircleF
2446 2043 CircleF
2472 2015 CircleF
2497 1987 CircleF
2523 1958 CircleF
2549 1929 CircleF
2574 1901 CircleF
2600 1874 CircleF
2625 1848 CircleF
2651 1881 CircleF
2676 1920 CircleF
2702 1959 CircleF
2727 1998 CircleF
2753 2038 CircleF
2778 2078 CircleF
2804 2118 CircleF
2829 2157 CircleF
2855 2196 CircleF
2880 2234 CircleF
2906 2273 CircleF
2932 2310 CircleF
2957 2346 CircleF
2983 2381 CircleF
3008 2415 CircleF
3034 2447 CircleF
3059 2479 CircleF
3085 2509 CircleF
3110 2538 CircleF
3136 2566 CircleF
3161 2593 CircleF
3187 2619 CircleF
3212 2645 CircleF
3238 2673 CircleF
3263 2702 CircleF
3289 2735 CircleF
3314 2770 CircleF
3340 2808 CircleF
3366 2847 CircleF
3391 2885 CircleF
3417 2920 CircleF
3442 2951 CircleF
3468 2975 CircleF
3493 2986 CircleF
3519 2987 CircleF
3543 2981 CircleF
3568 2964 CircleF
3593 2937 CircleF
3617 2903 CircleF
3642 2863 CircleF
3666 2819 CircleF
3691 2771 CircleF
3716 2724 CircleF
3740 2730 CircleF
3765 2736 CircleF
3789 2743 CircleF
3814 2751 CircleF
3839 2759 CircleF
3863 2767 CircleF
3888 2776 CircleF
3913 2786 CircleF
3937 2797 CircleF
3962 2807 CircleF
3986 2817 CircleF
4011 2828 CircleF
4036 2839 CircleF
4060 2849 CircleF
4086 2846 CircleF
4111 2837 CircleF
4137 2823 CircleF
4162 2805 CircleF
4187 2783 CircleF
4213 2757 CircleF
4238 2729 CircleF
4264 2698 CircleF
4289 2667 CircleF
4315 2634 CircleF
4340 2602 CircleF
4365 2570 CircleF
4391 2540 CircleF
4416 2511 CircleF
4442 2486 CircleF
4467 2463 CircleF
4492 2444 CircleF
4518 2428 CircleF
4543 2416 CircleF
4569 2407 CircleF
4594 2400 CircleF
4620 2397 CircleF
4645 2395 CircleF
4670 2396 CircleF
4696 2399 CircleF
4721 2402 CircleF
4747 2407 CircleF
4772 2412 CircleF
4798 2418 CircleF
4823 2423 CircleF
4848 2429 CircleF
4874 2435 CircleF
4899 2440 CircleF
4925 2445 CircleF
4950 2449 CircleF
4976 2451 CircleF
5001 2448 CircleF
5026 2445 CircleF
5052 2443 CircleF
5077 2443 CircleF
5103 2431 CircleF
5128 2410 CircleF
5154 2386 CircleF
5179 2358 CircleF
5205 2328 CircleF
5231 2295 CircleF
5256 2260 CircleF
5282 2222 CircleF
5307 2183 CircleF
5333 2143 CircleF
5358 2103 CircleF
5384 2063 CircleF
5409 2024 CircleF
5435 1986 CircleF
5460 1950 CircleF
5486 1917 CircleF
5511 1888 CircleF
5537 1861 CircleF
5562 1839 CircleF
5588 1821 CircleF
5613 1808 CircleF
5639 1801 CircleF
5665 1798 CircleF
5690 1801 CircleF
5716 1808 CircleF
5741 1819 CircleF
5767 1835 CircleF
5792 1853 CircleF
5818 1874 CircleF
5843 1898 CircleF
5869 1924 CircleF
5894 1952 CircleF
5920 1982 CircleF
5945 2012 CircleF
5971 2045 CircleF
5996 2078 CircleF
6022 2112 CircleF
6048 2146 CircleF
6073 2181 CircleF
6099 2215 CircleF
6124 2250 CircleF
6150 2283 CircleF
6175 2316 CircleF
6201 2346 CircleF
6226 2373 CircleF
6252 2394 CircleF
6277 2409 CircleF
6303 2420 CircleF
6328 2429 CircleF
6354 2439 CircleF
6379 2450 CircleF
6405 2464 CircleF
6430 2481 CircleF
6456 2502 CircleF
6482 2525 CircleF
6507 2551 CircleF
6533 2579 CircleF
6558 2608 CircleF
6584 2638 CircleF
6609 2669 CircleF
6635 2700 CircleF
6660 2730 CircleF
6686 2758 CircleF
6711 2783 CircleF
6737 2805 CircleF
6762 2823 CircleF
6788 2838 CircleF
6813 2846 CircleF
6839 2849 CircleF
740 2997 CircleF
765 2992 CircleF
791 2986 CircleF
816 2983 CircleF
842 2980 CircleF
867 2976 CircleF
893 2971 CircleF
918 2966 CircleF
943 2959 CircleF
969 2953 CircleF
994 2944 CircleF
1020 2934 CircleF
1045 2923 CircleF
1071 2911 CircleF
1096 2899 CircleF
1121 2886 CircleF
1147 2870 CircleF
1172 2854 CircleF
1198 2836 CircleF
1223 2818 CircleF
1249 2798 CircleF
1274 2777 CircleF
1299 2755 CircleF
1325 2732 CircleF
1350 2708 CircleF
1376 2683 CircleF
1401 2658 CircleF
1427 2631 CircleF
1452 2604 CircleF
1477 2577 CircleF
1503 2550 CircleF
1528 2524 CircleF
1554 2498 CircleF
1579 2475 CircleF
1605 2451 CircleF
1630 2429 CircleF
1655 2409 CircleF
1681 2394 CircleF
1706 2382 CircleF
1732 2374 CircleF
1757 2371 CircleF
1783 2371 CircleF
1808 2370 CircleF
1834 2369 CircleF
1859 2366 CircleF
1885 2364 CircleF
1910 2360 CircleF
1936 2356 CircleF
1961 2351 CircleF
1987 2345 CircleF
2012 2338 CircleF
2038 2330 CircleF
2063 2321 CircleF
2089 2310 CircleF
2115 2298 CircleF
2140 2285 CircleF
2166 2271 CircleF
2191 2256 CircleF
2217 2241 CircleF
2242 2225 CircleF
2268 2209 CircleF
2293 2191 CircleF
2319 2170 CircleF
2344 2147 CircleF
2370 2172 CircleF
2395 2197 CircleF
2421 2222 CircleF
2446 2248 CircleF
2472 2264 CircleF
2497 2280 CircleF
2523 2299 CircleF
2549 2319 CircleF
2574 2341 CircleF
2600 2365 CircleF
2625 2389 CircleF
2651 2414 CircleF
2676 2440 CircleF
2702 2467 CircleF
2727 2494 CircleF
2753 2520 CircleF
2778 2547 CircleF
2804 2574 CircleF
2829 2601 CircleF
2855 2628 CircleF
2880 2655 CircleF
2906 2681 CircleF
2932 2706 CircleF
2957 2731 CircleF
2983 2755 CircleF
3008 2778 CircleF
3034 2798 CircleF
3059 2820 CircleF
3085 2840 CircleF
3110 2859 CircleF
3136 2877 CircleF
3161 2893 CircleF
3187 2908 CircleF
3212 2922 CircleF
3238 2935 CircleF
3263 2944 CircleF
3289 2953 CircleF
3314 2960 CircleF
3340 2966 CircleF
3366 2971 CircleF
3391 2976 CircleF
3417 2980 CircleF
3442 2983 CircleF
3468 2986 CircleF
3493 2992 CircleF
3519 2997 CircleF
3543 2996 CircleF
3568 2995 CircleF
3593 2993 CircleF
3617 2990 CircleF
3642 2987 CircleF
3666 2983 CircleF
3691 2978 CircleF
3716 2974 CircleF
3740 2967 CircleF
3765 2960 CircleF
3789 2953 CircleF
3814 2945 CircleF
3839 2936 CircleF
3863 2927 CircleF
3888 2918 CircleF
3913 2908 CircleF
3937 2899 CircleF
3962 2890 CircleF
3986 2879 CircleF
4011 2871 CircleF
4036 2860 CircleF
4060 2849 CircleF
4086 2848 CircleF
4111 2846 CircleF
4137 2842 CircleF
4162 2836 CircleF
4187 2830 CircleF
4213 2822 CircleF
4238 2812 CircleF
4264 2802 CircleF
4289 2791 CircleF
4315 2779 CircleF
4340 2766 CircleF
4365 2752 CircleF
4391 2738 CircleF
4416 2723 CircleF
4442 2709 CircleF
4467 2693 CircleF
4492 2677 CircleF
4518 2661 CircleF
4543 2646 CircleF
4569 2630 CircleF
4594 2614 CircleF
4620 2599 CircleF
4645 2583 CircleF
4670 2569 CircleF
4696 2556 CircleF
4721 2542 CircleF
4747 2529 CircleF
4772 2517 CircleF
4798 2506 CircleF
4823 2495 CircleF
4848 2486 CircleF
4874 2477 CircleF
4899 2469 CircleF
4925 2462 CircleF
4950 2456 CircleF
4976 2453 CircleF
5001 2456 CircleF
5026 2458 CircleF
5052 2459 CircleF
5077 2460 CircleF
5103 2469 CircleF
5128 2481 CircleF
5154 2492 CircleF
5179 2502 CircleF
5205 2510 CircleF
5231 2518 CircleF
5256 2525 CircleF
5282 2531 CircleF
5307 2536 CircleF
5333 2541 CircleF
5358 2546 CircleF
5384 2550 CircleF
5409 2554 CircleF
5435 2558 CircleF
5460 2562 CircleF
5486 2565 CircleF
5511 2570 CircleF
5537 2573 CircleF
5562 2575 CircleF
5588 2577 CircleF
5613 2579 CircleF
5639 2580 CircleF
5665 2580 CircleF
5690 2580 CircleF
5716 2579 CircleF
5741 2577 CircleF
5767 2574 CircleF
5792 2571 CircleF
5818 2567 CircleF
5843 2562 CircleF
5869 2556 CircleF
5894 2550 CircleF
5920 2544 CircleF
5945 2536 CircleF
5971 2529 CircleF
5996 2520 CircleF
6022 2512 CircleF
6048 2504 CircleF
6073 2495 CircleF
6099 2488 CircleF
6124 2481 CircleF
6150 2475 CircleF
6175 2471 CircleF
6201 2469 CircleF
6226 2473 CircleF
6252 2483 CircleF
6277 2500 CircleF
6303 2523 CircleF
6328 2548 CircleF
6354 2575 CircleF
6379 2601 CircleF
6405 2627 CircleF
6430 2652 CircleF
6456 2676 CircleF
6482 2698 CircleF
6507 2718 CircleF
6533 2738 CircleF
6558 2756 CircleF
6584 2772 CircleF
6609 2786 CircleF
6635 2799 CircleF
6660 2811 CircleF
6686 2821 CircleF
6711 2830 CircleF
6737 2836 CircleF
6762 2842 CircleF
6788 2846 CircleF
6813 2848 CircleF
6839 2849 CircleF
740 2997 CircleF
765 2996 CircleF
791 2995 CircleF
816 2993 CircleF
842 2990 CircleF
867 2987 CircleF
893 2982 CircleF
918 2977 CircleF
943 2972 CircleF
969 2965 CircleF
994 2957 CircleF
1020 2949 CircleF
1045 2940 CircleF
1071 2931 CircleF
1096 2921 CircleF
1121 2911 CircleF
1147 2900 CircleF
1172 2889 CircleF
1198 2878 CircleF
1223 2867 CircleF
1249 2856 CircleF
1274 2846 CircleF
1299 2834 CircleF
1325 2823 CircleF
1350 2812 CircleF
1376 2801 CircleF
1401 2792 CircleF
1427 2782 CircleF
1452 2773 CircleF
1477 2764 CircleF
1503 2756 CircleF
1528 2749 CircleF
1554 2742 CircleF
1579 2736 CircleF
1605 2731 CircleF
1630 2726 CircleF
1655 2722 CircleF
1681 2719 CircleF
1706 2717 CircleF
1732 2715 CircleF
1757 2714 CircleF
1783 2713 CircleF
1808 2705 CircleF
1834 2692 CircleF
1859 2674 CircleF
1885 2653 CircleF
1910 2629 CircleF
1936 2602 CircleF
1961 2572 CircleF
1987 2541 CircleF
2012 2508 CircleF
2038 2475 CircleF
2063 2443 CircleF
2089 2411 CircleF
2115 2382 CircleF
2140 2353 CircleF
2166 2327 CircleF
2191 2302 CircleF
2217 2280 CircleF
2242 2259 CircleF
2268 2243 CircleF
2293 2231 CircleF
2319 2224 CircleF
2344 2222 CircleF
2370 2223 CircleF
2395 2229 CircleF
2421 2238 CircleF
2446 2249 CircleF
2472 2275 CircleF
2497 2302 CircleF
2523 2329 CircleF
2549 2357 CircleF
2574 2384 CircleF
2600 2412 CircleF
2625 2440 CircleF
2651 2468 CircleF
2676 2496 CircleF
2702 2523 CircleF
2727 2550 CircleF
2753 2577 CircleF
2778 2601 CircleF
2804 2627 CircleF
2829 2652 CircleF
2855 2676 CircleF
2880 2700 CircleF
2906 2723 CircleF
2932 2745 CircleF
2957 2766 CircleF
2983 2786 CircleF
3008 2805 CircleF
3034 2824 CircleF
3059 2841 CircleF
3085 2858 CircleF
3110 2873 CircleF
3136 2887 CircleF
3161 2900 CircleF
3187 2913 CircleF
3212 2925 CircleF
3238 2935 CircleF
3263 2947 CircleF
3289 2957 CircleF
3314 2966 CircleF
3340 2974 CircleF
3366 2980 CircleF
3391 2985 CircleF
3417 2990 CircleF
3442 2993 CircleF
3468 2995 CircleF
3493 2996 CircleF
3519 2997 CircleF
3543 2996 CircleF
3568 2995 CircleF
3593 2993 CircleF
3617 2990 CircleF
3642 2987 CircleF
3666 2983 CircleF
3691 2978 CircleF
3716 2974 CircleF
3740 2967 CircleF
3765 2960 CircleF
3789 2953 CircleF
3814 2945 CircleF
3839 2936 CircleF
3863 2927 CircleF
3888 2918 CircleF
3913 2908 CircleF
3937 2899 CircleF
3962 2890 CircleF
3986 2879 CircleF
4011 2871 CircleF
4036 2860 CircleF
4060 2849 CircleF
4086 2848 CircleF
4111 2846 CircleF
4137 2842 CircleF
4162 2836 CircleF
4187 2830 CircleF
4213 2822 CircleF
4238 2812 CircleF
4264 2802 CircleF
4289 2791 CircleF
4315 2779 CircleF
4340 2766 CircleF
4365 2752 CircleF
4391 2738 CircleF
4416 2723 CircleF
4442 2709 CircleF
4467 2693 CircleF
4492 2677 CircleF
4518 2661 CircleF
4543 2646 CircleF
4569 2630 CircleF
4594 2614 CircleF
4620 2599 CircleF
4645 2583 CircleF
4670 2569 CircleF
4696 2556 CircleF
4721 2542 CircleF
4747 2529 CircleF
4772 2517 CircleF
4798 2506 CircleF
4823 2495 CircleF
4848 2486 CircleF
4874 2477 CircleF
4899 2469 CircleF
4925 2462 CircleF
4950 2456 CircleF
4976 2453 CircleF
5001 2456 CircleF
5026 2458 CircleF
5052 2459 CircleF
5077 2460 CircleF
5103 2469 CircleF
5128 2481 CircleF
5154 2492 CircleF
5179 2502 CircleF
5205 2510 CircleF
5231 2518 CircleF
5256 2525 CircleF
5282 2531 CircleF
5307 2536 CircleF
5333 2541 CircleF
5358 2546 CircleF
5384 2550 CircleF
5409 2554 CircleF
5435 2558 CircleF
5460 2562 CircleF
5486 2565 CircleF
5511 2570 CircleF
5537 2573 CircleF
5562 2575 CircleF
5588 2577 CircleF
5613 2579 CircleF
5639 2580 CircleF
5665 2580 CircleF
5690 2580 CircleF
5716 2579 CircleF
5741 2577 CircleF
5767 2574 CircleF
5792 2571 CircleF
5818 2567 CircleF
5843 2562 CircleF
5869 2556 CircleF
5894 2550 CircleF
5920 2544 CircleF
5945 2536 CircleF
5971 2529 CircleF
5996 2520 CircleF
6022 2512 CircleF
6048 2504 CircleF
6073 2495 CircleF
6099 2488 CircleF
6124 2481 CircleF
6150 2475 CircleF
6175 2471 CircleF
6201 2469 CircleF
6226 2473 CircleF
6252 2483 CircleF
6277 2500 CircleF
6303 2523 CircleF
6328 2548 CircleF
6354 2575 CircleF
6379 2601 CircleF
6405 2627 CircleF
6430 2652 CircleF
6456 2676 CircleF
6482 2698 CircleF
6507 2718 CircleF
6533 2738 CircleF
6558 2756 CircleF
6584 2772 CircleF
6609 2786 CircleF
6635 2799 CircleF
6660 2811 CircleF
6686 2821 CircleF
6711 2830 CircleF
6737 2836 CircleF
6762 2842 CircleF
6788 2846 CircleF
6813 2848 CircleF
6839 2849 CircleF
740 3551 CircleF
765 3556 CircleF
791 3570 CircleF
816 3593 CircleF
842 3622 CircleF
867 3655 CircleF
893 3692 CircleF
918 3731 CircleF
943 3772 CircleF
969 3813 CircleF
994 3855 CircleF
1020 3896 CircleF
1045 3937 CircleF
1071 3978 CircleF
1096 4020 CircleF
1121 4060 CircleF
1147 4098 CircleF
1172 4136 CircleF
1198 4172 CircleF
1223 4207 CircleF
1249 4240 CircleF
1274 4272 CircleF
1299 4302 CircleF
1325 4329 CircleF
1350 4355 CircleF
1376 4378 CircleF
1401 4398 CircleF
1427 4416 CircleF
1452 4431 CircleF
2932 4427 CircleF
2957 4383 CircleF
2983 4339 CircleF
3008 4295 CircleF
3034 4252 CircleF
3059 4208 CircleF
3085 4164 CircleF
3110 4120 CircleF
3136 4076 CircleF
3161 4031 CircleF
3187 3988 CircleF
3212 3944 CircleF
3238 3901 CircleF
3263 3858 CircleF
3289 3816 CircleF
3314 3774 CircleF
3340 3733 CircleF
3366 3693 CircleF
3391 3656 CircleF
3417 3622 CircleF
3442 3593 CircleF
3468 3570 CircleF
3493 3556 CircleF
3519 3551 CircleF
3543 3556 CircleF
3568 3571 CircleF
3593 3594 CircleF
3617 3624 CircleF
3642 3658 CircleF
3666 3696 CircleF
3691 3735 CircleF
3716 3776 CircleF
3740 3817 CircleF
3765 3858 CircleF
3789 3899 CircleF
3814 3939 CircleF
3839 3977 CircleF
3863 4014 CircleF
3888 4049 CircleF
3913 4083 CircleF
3937 4114 CircleF
3962 4144 CircleF
3986 4169 CircleF
4011 4193 CircleF
4036 4213 CircleF
4060 4229 CircleF
4086 4232 CircleF
4111 4239 CircleF
4137 4251 CircleF
4162 4267 CircleF
4187 4287 CircleF
4213 4309 CircleF
4238 4334 CircleF
4264 4360 CircleF
4289 4387 CircleF
4315 4414 CircleF
4721 4426 CircleF
4747 4408 CircleF
4772 4391 CircleF
4798 4375 CircleF
4823 4359 CircleF
4848 4345 CircleF
4874 4331 CircleF
4899 4319 CircleF
4925 4309 CircleF
4950 4300 CircleF
4976 4292 CircleF
5001 4286 CircleF
5026 4282 CircleF
5052 4279 CircleF
5077 4278 CircleF
5103 4281 CircleF
5128 4289 CircleF
5154 4303 CircleF
5179 4322 CircleF
5205 4344 CircleF
5231 4371 CircleF
5256 4401 CircleF
5282 4433 CircleF
6584 4419 CircleF
6609 4391 CircleF
6635 4362 CircleF
6660 4336 CircleF
6686 4310 CircleF
6711 4287 CircleF
6737 4267 CircleF
6762 4251 CircleF
6788 4239 CircleF
6813 4232 CircleF
6839 4229 CircleF
740 4228 CircleF
765 4232 CircleF
791 4241 CircleF
816 4257 CircleF
842 4278 CircleF
867 4303 CircleF
893 4334 CircleF
918 4367 CircleF
943 4403 CircleF
3314 4405 CircleF
3340 4369 CircleF
3366 4335 CircleF
3391 4304 CircleF
3417 4278 CircleF
3442 4257 CircleF
3468 4241 CircleF
3493 4232 CircleF
3519 4228 CircleF
3543 4229 CircleF
3568 4230 CircleF
3593 4231 CircleF
3617 4233 CircleF
3642 4236 CircleF
3666 4240 CircleF
3691 4243 CircleF
3716 4247 CircleF
3740 4252 CircleF
3765 4256 CircleF
3789 4260 CircleF
3814 4264 CircleF
3839 4267 CircleF
3863 4270 CircleF
3888 4272 CircleF
3913 4272 CircleF
3937 4271 CircleF
3962 4267 CircleF
3986 4262 CircleF
4011 4254 CircleF
4036 4243 CircleF
4060 4229 CircleF
4086 4232 CircleF
4111 4239 CircleF
4137 4251 CircleF
4162 4267 CircleF
4187 4287 CircleF
4213 4309 CircleF
4238 4334 CircleF
4264 4360 CircleF
4289 4387 CircleF
4315 4414 CircleF
4721 4426 CircleF
4747 4408 CircleF
4772 4391 CircleF
4798 4375 CircleF
4823 4359 CircleF
4848 4345 CircleF
4874 4331 CircleF
4899 4319 CircleF
4925 4309 CircleF
4950 4300 CircleF
4976 4292 CircleF
5001 4286 CircleF
5026 4282 CircleF
5052 4279 CircleF
5077 4278 CircleF
5103 4281 CircleF
5128 4289 CircleF
5154 4303 CircleF
5179 4322 CircleF
5205 4344 CircleF
5231 4371 CircleF
5256 4401 CircleF
5282 4433 CircleF
6584 4419 CircleF
6609 4391 CircleF
6635 4362 CircleF
6660 4336 CircleF
6686 4310 CircleF
6711 4287 CircleF
6737 4267 CircleF
6762 4251 CircleF
6788 4239 CircleF
6813 4232 CircleF
6839 4229 CircleF
% End plot #1
1.000 UL
LTb
LCb setrgbcolor
740 4439 N
740 400 L
6099 0 V
0 4039 V
-6099 0 V
Z stroke
1.000 UP
1.000 UL
LTb
LCb setrgbcolor
stroke
grestore
end
showpage
%%Trailer
%%DocumentFonts: Symbol Times-Roman
%%Pages: 1
