########################
######### SPEX #########
########################
Version 05.00  (Sep  5, 2019)
Execution time: Jan 17, 2020  21:46:32
Hostname: login18-1.hpc.itc.rwth-aachen.de
MPI: 1,1


### subroutine: getinput ###

Basic parameters:
  Number of spins            =  1
            centers          =  4
            types            =  2
            equivalent atoms =  2  2
  Lattice parameter =      1.00000
  Lattice vectors   =      3.01411  -5.22060   0.00000
                           3.01411   5.22060   0.00000
                           0.00000   0.00000   9.80579
  Unit-cell volume  =    308.59778
  Reciprocal cutoff =      4.60000

Unit-cell geometry:
  # Ty  El              Coord.
  1  1  Ga   0.33333  -0.33333   0.00000
  2  1  Ga  -0.33333   0.33333   0.50000
  3  2  N    0.33333  -0.33333  -0.37700
  4  2  N   -0.33333   0.33333   0.12300

Symmetry information:
  Number of symmetry operations = 24
   #  Det           Axis           Angle   Syp  Inv
   1    1     --     --     --      --     Yes   1
   2   -1    1.00  -0.58   0.00   180.00   No    2
   3   -1    1.00   0.58   0.00   180.00   No    3
   4    1    0.00   0.00   1.00   120.00   Yes   9
   5    1    0.00   0.00   1.00   180.00   No    5
   6   -1    0.58   1.00   0.00   180.00   Yes   6
   7   -1    1.00   0.00   0.00   180.00   Yes   7
   8    1    0.00   0.00   1.00    60.00   No   11
   9    1    0.00   0.00  -1.00   120.00   Yes   4
  10   -1    0.00   1.00   0.00   180.00   No   10
  11    1    0.00   0.00  -1.00    60.00   No    8
  12   -1   -0.58   1.00   0.00   180.00   Yes  12
  13 - 24  Time reversal symmetries

##################
### Input file ###
##################
BZ       4 4 4
JOB      GW +:(1-10)
NBAND    200
RESTART  
KPT      +=(.38461,1.00000,0)
 
#  k point is converted from (0.38461,1.00000,0.00000) to (0.38461,0.00000,0.00000)

Info: Simpson and Lagrange integration is used.

Radial mesh and basis functions:
  Number of radial grid points:       759  429
  Number of radial basis functions:    19   18
  Angular momentum quantum number:      8    6
  Maximal index:                        3

Core states:
  Atom type  1  (Ga)
  nl      Energy
  1s  -375.34991
  2s   -45.88297
  3s    -4.96076
  2p   -39.88207
  3p    -3.15226
  Atom type  2  (N )
  nl      Energy
  1s   -13.54409
  Number of valence electrons:   36

Average Coulomb potential: -0.35487  ( -9.65657 eV )

Read wavefunctions from harddisc... done   ( Timing:    0.21 )

Maximal energy difference in deg. subspaces: 1.4E-13
Minimal energy difference between subspaces: 1.9E-05

Wave functions:
  Number of bands:             198 -  200  (  200 )
            k points (IBZ):     64  (  12 /  30 )
            G vectors:         738
  k points of IBZ:
    1  (0.00000,0.00000,0.00000)  [ 0.00000, 0.00000, 0.00000 ]
    2  (0.00000,0.00000,0.25000)  [ 0.00000, 0.00000, 0.02550 ]
    3  (0.00000,0.00000,0.50000)  [ 0.00000, 0.00000, 0.05099 ]
    4  (0.00000,0.25000,0.00000)  [ 0.04147, 0.02394, 0.00000 ]
    5  (0.00000,0.25000,0.25000)  [ 0.04147, 0.02394, 0.02550 ]
    6  (0.00000,0.25000,0.50000)  [ 0.04147, 0.02394, 0.05099 ]
    7  (0.00000,0.50000,0.00000)  [ 0.08294, 0.04789, 0.00000 ]
    8  (0.00000,0.50000,0.25000)  [ 0.08294, 0.04789, 0.02550 ]
    9  (0.00000,0.50000,0.50000)  [ 0.08294, 0.04789, 0.05099 ]
   10  (0.25000,0.25000,0.00000)  [ 0.08294, 0.00000, 0.00000 ]
   11  (0.25000,0.25000,0.25000)  [ 0.08294, 0.00000, 0.02550 ]
   12  (0.25000,0.25000,0.50000)  [ 0.08294, 0.00000, 0.05099 ]
  k points of EIBZ (shifted set):
   65  (0.38461,0.00000,0.00000)  [ 0.06380,-0.03684, 0.00000 ]
   66  (0.38461,0.00000,0.25000)  [ 0.06380,-0.03684, 0.02550 ]
   67  (0.38461,0.00000,0.50000)  [ 0.06380,-0.03684, 0.05099 ]
   68  (0.38461,0.25000,0.00000)  [ 0.10527,-0.01289, 0.00000 ]
   69  (0.38461,0.25000,0.25000)  [ 0.10527,-0.01289, 0.02550 ]
   70  (0.38461,0.25000,0.50000)  [ 0.10527,-0.01289, 0.05099 ]
   71  (0.38461,0.50000,0.00000)  [ 0.14674, 0.01105, 0.00000 ]
   72  (0.38461,0.50000,0.25000)  [ 0.14674, 0.01105, 0.02550 ]
   73  (0.38461,0.50000,0.50000)  [ 0.14674, 0.01105, 0.05099 ]
   74  (0.38461,0.75000,0.00000)  [ 0.18822, 0.03500, 0.00000 ]
   75  (0.38461,0.75000,0.25000)  [ 0.18822, 0.03500, 0.02550 ]
   76  (0.38461,0.75000,0.50000)  [ 0.18822, 0.03500, 0.05099 ]
   77  (0.63461,0.00000,0.00000)  [ 0.10527,-0.06078, 0.00000 ]
   78  (0.63461,0.00000,0.25000)  [ 0.10527,-0.06078, 0.02550 ]
   79  (0.63461,0.00000,0.50000)  [ 0.10527,-0.06078, 0.05099 ]
   80  (0.63461,0.25000,0.00000)  [ 0.14674,-0.03684, 0.00000 ]
   81  (0.63461,0.25000,0.25000)  [ 0.14674,-0.03684, 0.02550 ]
   82  (0.63461,0.25000,0.50000)  [ 0.14674,-0.03684, 0.05099 ]
   83  (0.63461,0.50000,0.00000)  [ 0.18822,-0.01289, 0.00000 ]
   84  (0.63461,0.50000,0.25000)  [ 0.18822,-0.01289, 0.02550 ]
   85  (0.63461,0.50000,0.50000)  [ 0.18822,-0.01289, 0.05099 ]
   86  (0.88461,0.00000,0.00000)  [ 0.14674,-0.08472, 0.00000 ]
   87  (0.88461,0.00000,0.25000)  [ 0.14674,-0.08472, 0.02550 ]
   88  (0.88461,0.00000,0.50000)  [ 0.14674,-0.08472, 0.05099 ]
   89  (0.88461,0.25000,0.00000)  [ 0.18822,-0.06078, 0.00000 ]
   90  (0.88461,0.25000,0.25000)  [ 0.18822,-0.06078, 0.02550 ]
   91  (0.88461,0.25000,0.50000)  [ 0.18822,-0.06078, 0.05099 ]
   92  (0.13461,0.00000,0.00000)  [ 0.02233,-0.01289, 0.00000 ]
   93  (0.13461,0.00000,0.25000)  [ 0.02233,-0.01289, 0.02550 ]
   94  (0.13461,0.00000,0.50000)  [ 0.02233,-0.01289, 0.05099 ]

Generate wavefunctions at equivalent k points... done   ( Timing:   0.29 )

Size of array cpw:   209.8 MB
Size of array cmt:   260.9 MB

The system is not a metal.
The Fermi energy is placed in the center of the band gap.
KS energy gap:    0.07059528 Ha   (  1.92099521 eV )
Fermi energy:     0.29316457 Ha   (  7.97741378 eV )
Maximal energy:   5.57308541 Ha
Electron count error of the shifted k-point set:  0.0000000000000000

Wave-function checksum: -3.088556774243E-02


### subroutine: checkinput ###

Overlap <core|core>
Atom type  1
1s  1.000000 
2s -0.000000  1.000000 
3s  0.000000 -0.000001  0.999961 
2p  0.999418 
3p -0.000329  0.999458 
Atom type  2
1s  0.999983 

Overlap <core|basis>
Atom type  1
         u(s)    udot(s)
1s  0.000000  0.000000 
2s  0.000001  0.000000 
3s  0.004767 -0.007551 
         u(p)    udot(p)
2p -0.000106 -0.000031 
3p  0.017150 -0.021254 
Atom type  2
         u(s)    udot(s)
1s  0.003209 -0.002046 

Average overlap <core|val>
Atom type  1
1s  0.000000
2s  0.000000
3s  0.000679
2p  0.000010  0.000010  0.000010
3p  0.002209  0.002206  0.002209
Atom type  2
1s  0.000234

Maximum overlap <core|val> at (band/kpoint)
Atom type  1
1s  0.000000 (033/ 001)
2s  0.000001 (033/ 001)
3s  0.003697 (156/ 003)
2p  0.000055 (024/ 003)  0.000064 (024/ 001)  0.000057 (023/ 003)
3p  0.011526 (121/ 003)  0.014817 (111/ 001)  0.011787 (124/ 003)
Atom type  2
1s  0.001554 (002/ 003)

Overlap <basis|basis>
Atom type  1
   u(s)  1.000000 
udot(s) -0.000000  0.129862 
   u(p)  1.000000 
udot(p) -0.000000  0.075237 
   u(d)  1.000000 
udot(d) -0.000000  0.733838 
 ulo(d)  0.410292 -0.767526  1.000000 
   u(f)  1.000000 
udot(f) -0.000000  0.020278 
   u(g)  1.000000 
udot(g) -0.000000  0.006703 
   u(h)  1.000000 
udot(h)  0.000000  0.003149 
   u(i)  1.000000 
udot(i) -0.000000  0.001726 
   u(j)  1.000000 
udot(j) -0.000000  0.001039 
   u(k)  1.000000 
udot(k)  0.000000  0.000667 
Atom type  2
   u(s)  1.000000 
udot(s)  0.000000  0.023146 
   u(p)  1.000000 
udot(p)  0.000000  0.036192 
   u(d)  1.000000 
udot(d)  0.000000  0.003612 
   u(f)  1.000000 
udot(f)  0.000000  0.001183 
   u(g)  1.000000 
udot(g) -0.000000  0.000520 
   u(h)  1.000000 
udot(h) -0.000000  0.000271 
   u(i)  1.000000 
udot(i)  0.000000  0.000157 


### subroutine: mixedbasis ( Mode: vv ) ###

Mixed basis
  Plane-wave basis:
    Number of unique G vectors:   349
    Maximal number of G vectors:  233

  MT basis read in from spex.mb (mode: vv).
    Total number of product-basis functions:  264



##### Job index:  1 #####


### subroutine: correlation ###

< GW self-energy >
Calculate periodic function...done   ( Timing:    0.08 )

=========

K point (   1 ):   0.00000   0.00000   0.00000

Coulomb matrix read from spex.cor
Inverse dielectric matrices read from spex.cor 
Invert dielectric tensor... done   ( Timing:    0.02 )
Hermiticity of transformed Coulomb matrix: 6.8E-11

Add contribution to self-energy... done
                               Timings
  MT wave-func. products:      0.10713
  PW wave-func. products:      0.23273
  Matrix-vector products:      0.32437
  Transformations:             0.07727
  Exchange self-energy:        0.06664
  Frequency integration:       0.01664
  Tetrahedron weights:         0.00000
  Gamma-point correction:      1.31775
  MPI idle time:               0.00003      0.00003
  Other:                       0.05071
  ------------------------------------
  Total:                       2.19326

=========

K point (   2 ):   0.00000   0.00000   0.25000

Coulomb matrix read from spex.cor
Inverse dielectric matrices read from spex.cor 
Hermiticity of transformed Coulomb matrix: 8.7E-10

Add contribution to self-energy... done
                               Timings
  MT wave-func. products:      0.10458
  PW wave-func. products:      0.22929
  Matrix-vector products:      0.30069
  Transformations:             0.07498
  Exchange self-energy:        0.04866
  Frequency integration:       0.01627
  Tetrahedron weights:         0.00000
  MPI idle time:               0.00002      0.00002
  Other:                       0.04567
  ------------------------------------
  Total:                       0.82016

=========

K point (   3 ):   0.00000   0.00000   0.50000

Coulomb matrix read from spex.cor
Inverse dielectric matrices read from spex.cor 
Hermiticity of transformed Coulomb matrix: 2.4E-10

Add contribution to self-energy... done
                               Timings
  MT wave-func. products:      0.10875
  PW wave-func. products:      0.22334
  Matrix-vector products:      0.49855
  Transformations:             0.07443
  Exchange self-energy:        0.04650
  Frequency integration:       0.01687
  Tetrahedron weights:         0.00000
  MPI idle time:               0.00002      0.00002
  Other:                       0.04731
  ------------------------------------
  Total:                       1.01575

=========

K point (   4 ):   0.00000   0.25000   0.00000

Coulomb matrix read from spex.cor
Inverse dielectric matrices read from spex.cor 
Hermiticity of transformed Coulomb matrix: 1.5E-10

Add contribution to self-energy... done
                               Timings
  MT wave-func. products:      0.33681
  PW wave-func. products:      0.75722
  Matrix-vector products:      2.14144
  Transformations:             0.30237
  Exchange self-energy:        0.09687
  Frequency integration:       0.06901
  Tetrahedron weights:         0.00000
  MPI idle time:               0.00007      0.00007
  Other:                       0.17204
  ------------------------------------
  Total:                       3.87584

=========

K point (   5 ):   0.00000   0.25000   0.25000

Coulomb matrix read from spex.cor
Inverse dielectric matrices read from spex.cor 
Hermiticity of transformed Coulomb matrix: 1.5E-10

Add contribution to self-energy... done
                               Timings
  MT wave-func. products:      0.33371
  PW wave-func. products:      0.75962
  Matrix-vector products:      2.10208
  Transformations:             0.30915
  Exchange self-energy:        0.10502
  Frequency integration:       0.06813
  Tetrahedron weights:         0.00000
  MPI idle time:               0.00002      0.00002
  Other:                       0.16971
  ------------------------------------
  Total:                       3.84745

=========

K point (   6 ):   0.00000   0.25000   0.50000

Coulomb matrix read from spex.cor
Inverse dielectric matrices read from spex.cor 
Hermiticity of transformed Coulomb matrix: 1.4E-10

Add contribution to self-energy... done
                               Timings
  MT wave-func. products:      0.33868
  PW wave-func. products:      0.76291
  Matrix-vector products:      2.16072
  Transformations:             0.32394
  Exchange self-energy:        0.10278
  Frequency integration:       0.06913
  Tetrahedron weights:         0.00000
  MPI idle time:               0.00004      0.00004
  Other:                       0.17190
  ------------------------------------
  Total:                       3.93010

=========

K point (   7 ):   0.00000   0.50000   0.00000

Coulomb matrix read from spex.cor
Inverse dielectric matrices read from spex.cor 
Hermiticity of transformed Coulomb matrix: 1.3E-10

Add contribution to self-energy... done
                               Timings
  MT wave-func. products:      0.18344
  PW wave-func. products:      0.42160
  Matrix-vector products:      0.64471
  Transformations:             0.14973
  Exchange self-energy:        0.06825
  Frequency integration:       0.03400
  Tetrahedron weights:         0.00000
  MPI idle time:               0.00002      0.00002
  Other:                       0.08736
  ------------------------------------
  Total:                       1.58910

=========

K point (   8 ):   0.00000   0.50000   0.25000

Coulomb matrix read from spex.cor
Inverse dielectric matrices read from spex.cor 
Hermiticity of transformed Coulomb matrix: 7.9E-11

Add contribution to self-energy... done
                               Timings
  MT wave-func. products:      0.18719
  PW wave-func. products:      0.41861
  Matrix-vector products:      0.65238
  Transformations:             0.15208
  Exchange self-energy:        0.06588
  Frequency integration:       0.03406
  Tetrahedron weights:         0.00000
  MPI idle time:               0.00004      0.00004
  Other:                       0.08675
  ------------------------------------
  Total:                       1.59700

=========

K point (   9 ):   0.00000   0.50000   0.50000

Coulomb matrix read from spex.cor
Inverse dielectric matrices read from spex.cor 
Hermiticity of transformed Coulomb matrix: 5.5E-11

Add contribution to self-energy... done
                               Timings
  MT wave-func. products:      0.18228
  PW wave-func. products:      0.38708
  Matrix-vector products:      1.01291
  Transformations:             0.13960
  Exchange self-energy:        0.06473
  Frequency integration:       0.03324
  Tetrahedron weights:         0.00000
  MPI idle time:               0.00003      0.00003
  Other:                       0.08646
  ------------------------------------
  Total:                       1.90636

=========

K point (  10 ):   0.25000   0.25000   0.00000

Coulomb matrix read from spex.cor
Inverse dielectric matrices read from spex.cor 
Hermiticity of transformed Coulomb matrix: 5.5E-11

Add contribution to self-energy... done
                               Timings
  MT wave-func. products:      0.25759
  PW wave-func. products:      0.57109
  Matrix-vector products:      1.47912
  Transformations:             0.23472
  Exchange self-energy:        0.07955
  Frequency integration:       0.05129
  Tetrahedron weights:         0.00000
  MPI idle time:               0.00003      0.00003
  Other:                       0.12753
  ------------------------------------
  Total:                       2.80092

=========

K point (  11 ):   0.25000   0.25000   0.25000

Coulomb matrix read from spex.cor
Inverse dielectric matrices read from spex.cor 
Hermiticity of transformed Coulomb matrix: 8.0E-11

Add contribution to self-energy... done
                               Timings
  MT wave-func. products:      0.26215
  PW wave-func. products:      0.59256
  Matrix-vector products:      1.49635
  Transformations:             0.23945
  Exchange self-energy:        0.08745
  Frequency integration:       0.05133
  Tetrahedron weights:         0.00000
  MPI idle time:               0.00003      0.00003
  Other:                       0.12894
  ------------------------------------
  Total:                       2.85827

=========

K point (  12 ):   0.25000   0.25000   0.50000

Coulomb matrix read from spex.cor
Inverse dielectric matrices read from spex.cor 
Hermiticity of transformed Coulomb matrix: 9.9E-11

Add contribution to self-energy... done
                               Timings
  MT wave-func. products:      0.25437
  PW wave-func. products:      0.58528
  Matrix-vector products:      2.90280
  Transformations:             0.23783
  Exchange self-energy:        0.08125
  Frequency integration:       0.05212
  Tetrahedron weights:         0.00000
  MPI idle time:               0.00003      0.00003
  Other:                       0.12390
  ------------------------------------
  Total:                       4.23756


### subroutine: exchange_core ###

        k point       band      exchange (core contribution)
  (0.385,0.000,0.000)   1     -6.1843396
  (0.385,0.000,0.000)   2     -9.3509999
  (0.385,0.000,0.000)   3    -17.8053500
  (0.385,0.000,0.000)   4    -17.9501518
  (0.385,0.000,0.000)   5    -18.1023377
  (0.385,0.000,0.000)   6    -18.2106884
  (0.385,0.000,0.000)   7    -18.3637502
  (0.385,0.000,0.000)   8    -18.4356075
  (0.385,0.000,0.000)   9    -18.5827482
  (0.385,0.000,0.000)  10    -18.6988064
Timing:   0.13




### subroutine: quasiparticle ###

Number of mesh points even: No constraint will be used.

List of k points
    0   0.38461   0.00000   0.00000  (additional) 



#####################
### K POINT:    0 ###
#####################


--- DIAGONAL ELEMENTS [eV] ---

 Bd       vxc    sigmax    sigmac         Z        KS        HF          GW lin/dir 
  1 -24.53002 -35.29409   8.57932   0.73033  -8.15006 -18.91413  -9.70290   0.70061 
                          0.79932  -0.05348                      -9.67264   0.66864 
  2 -29.68335 -41.25122   8.91944   0.72256  -7.89996 -19.46783  -9.79679   0.47245 
                          0.53950  -0.03120                      -9.73056   0.45661 
  3 -42.32103 -55.59092   9.45816   0.73796  -6.36664 -19.63652  -9.17853   0.10707 
                          0.06730  -0.01506                      -9.07788   0.13249 
  4 -42.58040 -55.89792   9.49493   0.73783  -6.34649 -19.66401  -9.16597   0.10289 
                          0.06371  -0.01462                      -9.06445   0.12861 
  5 -42.76915 -56.08812   9.46208   0.74000  -6.25785 -19.57682  -9.11128   0.08723 
                          0.05178  -0.01268                      -9.00745   0.11263 
  6 -42.94680 -56.25689   9.43465   0.74140  -6.20471 -19.51480  -9.07749   0.07283 
                          0.04139  -0.01087                      -8.97183   0.09764 
  7 -43.30777 -56.72626   9.56632   0.73912  -6.18591 -19.60441  -9.03226   0.10094 
                          0.06215  -0.01428                      -8.93008   0.12660 
  8 -43.37220 -56.78931   9.53555   0.74045  -6.16999 -19.58710  -9.04348   0.08389 
                          0.04896  -0.01227                      -8.93869   0.10946 
  9 -43.60555 -57.01773   9.50134   0.74215  -6.10377 -19.51595  -9.00588   0.06276 
                          0.03362  -0.00967                      -8.89795   0.08782 
 10 -43.79793 -57.21496   9.49362   0.74292  -6.05115 -19.46818  -8.96570   0.05427 
                          0.02754  -0.00862                      -8.85637   0.07923 

Timing (quasiparticle equation):   0.10363

Timing:        32
