########################
######### SPEX #########
########################
Version 05.00  (Sep  5, 2019)
Execution time: Jan 17, 2020  23:18:34
Hostname: login18-1.hpc.itc.rwth-aachen.de
MPI: 1,1


### subroutine: getinput ###

Basic parameters:
  Number of spins            =  1
            centers          =  4
            types            =  2
            equivalent atoms =  2  2
  Lattice parameter =      1.00000
  Lattice vectors   =      3.01411  -5.22060   0.00000
                           3.01411   5.22060   0.00000
                           0.00000   0.00000   9.80579
  Unit-cell volume  =    308.59778
  Reciprocal cutoff =      4.60000

Unit-cell geometry:
  # Ty  El              Coord.
  1  1  Ga   0.33333  -0.33333   0.00000
  2  1  Ga  -0.33333   0.33333   0.50000
  3  2  N    0.33333  -0.33333  -0.37700
  4  2  N   -0.33333   0.33333   0.12300

Symmetry information:
  Number of symmetry operations = 24
   #  Det           Axis           Angle   Syp  Inv
   1    1     --     --     --      --     Yes   1
   2   -1    1.00  -0.58   0.00   180.00   No    2
   3   -1    1.00   0.58   0.00   180.00   No    3
   4    1    0.00   0.00   1.00   120.00   Yes   9
   5    1    0.00   0.00   1.00   180.00   No    5
   6   -1    0.58   1.00   0.00   180.00   Yes   6
   7   -1    1.00   0.00   0.00   180.00   Yes   7
   8    1    0.00   0.00   1.00    60.00   No   11
   9    1    0.00   0.00  -1.00   120.00   Yes   4
  10   -1    0.00   1.00   0.00   180.00   No   10
  11    1    0.00   0.00  -1.00    60.00   No    8
  12   -1   -0.58   1.00   0.00   180.00   Yes  12
  13 - 24  Time reversal symmetries

##################
### Input file ###
##################
BZ       4 4 4
JOB      GW +:(1-10)
NBAND    200
RESTART  
KPT      +=(.87777,.87777,0)
 

Info: Simpson and Lagrange integration is used.

Radial mesh and basis functions:
  Number of radial grid points:       759  429
  Number of radial basis functions:    19   18
  Angular momentum quantum number:      8    6
  Maximal index:                        3

Core states:
  Atom type  1  (Ga)
  nl      Energy
  1s  -375.34991
  2s   -45.88297
  3s    -4.96076
  2p   -39.88207
  3p    -3.15226
  Atom type  2  (N )
  nl      Energy
  1s   -13.54409
  Number of valence electrons:   36

Average Coulomb potential: -0.35487  ( -9.65657 eV )

Read wavefunctions from harddisc... done   ( Timing:    0.21 )

Maximal energy difference in deg. subspaces: 5.2E-12
Minimal energy difference between subspaces: 1.9E-05

Wave functions:
  Number of bands:             198 -  200  (  200 )
            k points (IBZ):     64  (  12 /  30 )
            G vectors:         752
  k points of IBZ:
    1  (0.00000,0.00000,0.00000)  [ 0.00000, 0.00000, 0.00000 ]
    2  (0.00000,0.00000,0.25000)  [ 0.00000, 0.00000, 0.02550 ]
    3  (0.00000,0.00000,0.50000)  [ 0.00000, 0.00000, 0.05099 ]
    4  (0.00000,0.25000,0.00000)  [ 0.04147, 0.02394, 0.00000 ]
    5  (0.00000,0.25000,0.25000)  [ 0.04147, 0.02394, 0.02550 ]
    6  (0.00000,0.25000,0.50000)  [ 0.04147, 0.02394, 0.05099 ]
    7  (0.00000,0.50000,0.00000)  [ 0.08294, 0.04789, 0.00000 ]
    8  (0.00000,0.50000,0.25000)  [ 0.08294, 0.04789, 0.02550 ]
    9  (0.00000,0.50000,0.50000)  [ 0.08294, 0.04789, 0.05099 ]
   10  (0.25000,0.25000,0.00000)  [ 0.08294, 0.00000, 0.00000 ]
   11  (0.25000,0.25000,0.25000)  [ 0.08294, 0.00000, 0.02550 ]
   12  (0.25000,0.25000,0.50000)  [ 0.08294, 0.00000, 0.05099 ]
  k points of EIBZ (shifted set):
   65  (0.87777,0.87777,0.00000)  [ 0.29122, 0.00000, 0.00000 ]
   66  (0.87777,0.87777,0.25000)  [ 0.29122, 0.00000, 0.02550 ]
   67  (0.87777,0.87777,0.50000)  [ 0.29122, 0.00000, 0.05099 ]
   68  (0.87777,0.12777,0.00000)  [ 0.16681,-0.07183, 0.00000 ]
   69  (0.87777,0.12777,0.25000)  [ 0.16681,-0.07183, 0.02550 ]
   70  (0.87777,0.12777,0.50000)  [ 0.16681,-0.07183, 0.05099 ]
   71  (0.87777,0.37777,0.00000)  [ 0.20828,-0.04789, 0.00000 ]
   72  (0.87777,0.37777,0.25000)  [ 0.20828,-0.04789, 0.02550 ]
   73  (0.87777,0.37777,0.50000)  [ 0.20828,-0.04789, 0.05099 ]
   74  (0.87777,0.62777,0.00000)  [ 0.24975,-0.02394, 0.00000 ]
   75  (0.87777,0.62777,0.25000)  [ 0.24975,-0.02394, 0.02550 ]
   76  (0.87777,0.62777,0.50000)  [ 0.24975,-0.02394, 0.05099 ]
   77  (0.12777,0.12777,0.00000)  [ 0.04239, 0.00000, 0.00000 ]
   78  (0.12777,0.12777,0.25000)  [ 0.04239, 0.00000, 0.02550 ]
   79  (0.12777,0.12777,0.50000)  [ 0.04239, 0.00000, 0.05099 ]
   80  (0.12777,0.37777,0.00000)  [ 0.08386, 0.02394, 0.00000 ]
   81  (0.12777,0.37777,0.25000)  [ 0.08386, 0.02394, 0.02550 ]
   82  (0.12777,0.37777,0.50000)  [ 0.08386, 0.02394, 0.05099 ]
   83  (0.12777,0.62777,0.00000)  [ 0.12533, 0.04789, 0.00000 ]
   84  (0.12777,0.62777,0.25000)  [ 0.12533, 0.04789, 0.02550 ]
   85  (0.12777,0.62777,0.50000)  [ 0.12533, 0.04789, 0.05099 ]
   86  (0.37777,0.37777,0.00000)  [ 0.12533, 0.00000, 0.00000 ]
   87  (0.37777,0.37777,0.25000)  [ 0.12533, 0.00000, 0.02550 ]
   88  (0.37777,0.37777,0.50000)  [ 0.12533, 0.00000, 0.05099 ]
   89  (0.37777,0.62777,0.00000)  [ 0.16681, 0.02394, 0.00000 ]
   90  (0.37777,0.62777,0.25000)  [ 0.16681, 0.02394, 0.02550 ]
   91  (0.37777,0.62777,0.50000)  [ 0.16681, 0.02394, 0.05099 ]
   92  (0.62777,0.62777,0.00000)  [ 0.20828, 0.00000, 0.00000 ]
   93  (0.62777,0.62777,0.25000)  [ 0.20828, 0.00000, 0.02550 ]
   94  (0.62777,0.62777,0.50000)  [ 0.20828, 0.00000, 0.05099 ]

Generate wavefunctions at equivalent k points... done   ( Timing:   0.29 )

Size of array cpw:   209.8 MB
Size of array cmt:   260.9 MB

The system is not a metal.
The Fermi energy is placed in the center of the band gap.
KS energy gap:    0.07059528 Ha   (  1.92099521 eV )
Fermi energy:     0.29316457 Ha   (  7.97741378 eV )
Maximal energy:   5.57997353 Ha
Electron count error of the shifted k-point set:  0.0000000000000000

Wave-function checksum: -2.636744877307E-02


### subroutine: checkinput ###

Overlap <core|core>
Atom type  1
1s  1.000000 
2s -0.000000  1.000000 
3s  0.000000 -0.000001  0.999961 
2p  0.999418 
3p -0.000329  0.999458 
Atom type  2
1s  0.999983 

Overlap <core|basis>
Atom type  1
         u(s)    udot(s)
1s  0.000000  0.000000 
2s  0.000001  0.000000 
3s  0.004767 -0.007551 
         u(p)    udot(p)
2p -0.000106 -0.000031 
3p  0.017150 -0.021254 
Atom type  2
         u(s)    udot(s)
1s  0.003209 -0.002046 

Average overlap <core|val>
Atom type  1
1s  0.000000
2s  0.000000
3s  0.000679
2p  0.000010  0.000010  0.000010
3p  0.002209  0.002206  0.002209
Atom type  2
1s  0.000234

Maximum overlap <core|val> at (band/kpoint)
Atom type  1
1s  0.000000 (033/ 001)
2s  0.000001 (033/ 001)
3s  0.003697 (156/ 003)
2p  0.000055 (024/ 003)  0.000064 (024/ 001)  0.000057 (023/ 003)
3p  0.011526 (121/ 003)  0.014817 (111/ 001)  0.011787 (124/ 003)
Atom type  2
1s  0.001635 (001/ 100)

Overlap <basis|basis>
Atom type  1
   u(s)  1.000000 
udot(s) -0.000000  0.129862 
   u(p)  1.000000 
udot(p) -0.000000  0.075237 
   u(d)  1.000000 
udot(d) -0.000000  0.733838 
 ulo(d)  0.410292 -0.767526  1.000000 
   u(f)  1.000000 
udot(f) -0.000000  0.020278 
   u(g)  1.000000 
udot(g) -0.000000  0.006703 
   u(h)  1.000000 
udot(h)  0.000000  0.003149 
   u(i)  1.000000 
udot(i) -0.000000  0.001726 
   u(j)  1.000000 
udot(j) -0.000000  0.001039 
   u(k)  1.000000 
udot(k)  0.000000  0.000667 
Atom type  2
   u(s)  1.000000 
udot(s)  0.000000  0.023146 
   u(p)  1.000000 
udot(p)  0.000000  0.036192 
   u(d)  1.000000 
udot(d)  0.000000  0.003612 
   u(f)  1.000000 
udot(f)  0.000000  0.001183 
   u(g)  1.000000 
udot(g) -0.000000  0.000520 
   u(h)  1.000000 
udot(h) -0.000000  0.000271 
   u(i)  1.000000 
udot(i)  0.000000  0.000157 


### subroutine: mixedbasis ( Mode: vv ) ###

Mixed basis
  Plane-wave basis:
    Number of unique G vectors:   362
    Maximal number of G vectors:  233

  MT basis read in from spex.mb (mode: vv).
    Total number of product-basis functions:  264



##### Job index:  1 #####


### subroutine: correlation ###

< GW self-energy >
Calculate periodic function...done   ( Timing:    0.08 )

=========

K point (   1 ):   0.00000   0.00000   0.00000

Coulomb matrix read from spex.cor
Inverse dielectric matrices read from spex.cor 
Invert dielectric tensor... done   ( Timing:    0.02 )
Hermiticity of transformed Coulomb matrix: 6.8E-11

Add contribution to self-energy... done
                               Timings
  MT wave-func. products:      0.11145
  PW wave-func. products:      0.26007
  Matrix-vector products:      0.33419
  Transformations:             0.08117
  Exchange self-energy:        0.06626
  Frequency integration:       0.01738
  Tetrahedron weights:         0.00000
  Gamma-point correction:      1.36201
  MPI idle time:               0.00003      0.00003
  Other:                       0.05285
  ------------------------------------
  Total:                       2.28540

=========

K point (   2 ):   0.00000   0.00000   0.25000

Coulomb matrix read from spex.cor
Inverse dielectric matrices read from spex.cor 
Hermiticity of transformed Coulomb matrix: 8.7E-10

Add contribution to self-energy... done
                               Timings
  MT wave-func. products:      0.10944
  PW wave-func. products:      0.24386
  Matrix-vector products:      0.31902
  Transformations:             0.07663
  Exchange self-energy:        0.05136
  Frequency integration:       0.01714
  Tetrahedron weights:         0.00000
  MPI idle time:               0.00001      0.00001
  Other:                       0.04681
  ------------------------------------
  Total:                       0.86426

=========

K point (   3 ):   0.00000   0.00000   0.50000

Coulomb matrix read from spex.cor
Inverse dielectric matrices read from spex.cor 
Hermiticity of transformed Coulomb matrix: 2.4E-10

Add contribution to self-energy... done
                               Timings
  MT wave-func. products:      0.11180
  PW wave-func. products:      0.23678
  Matrix-vector products:      0.52093
  Transformations:             0.07603
  Exchange self-energy:        0.04975
  Frequency integration:       0.01792
  Tetrahedron weights:         0.00000
  MPI idle time:               0.00001      0.00001
  Other:                       0.05010
  ------------------------------------
  Total:                       1.06331

=========

K point (   4 ):   0.00000   0.25000   0.00000

Coulomb matrix read from spex.cor
Inverse dielectric matrices read from spex.cor 
Hermiticity of transformed Coulomb matrix: 1.5E-10

Add contribution to self-energy... done
                               Timings
  MT wave-func. products:      0.26896
  PW wave-func. products:      0.60623
  Matrix-vector products:      1.59621
  Transformations:             0.24746
  Exchange self-energy:        0.08460
  Frequency integration:       0.05182
  Tetrahedron weights:         0.00000
  MPI idle time:               0.00004      0.00004
  Other:                       0.13113
  ------------------------------------
  Total:                       2.98645

=========

K point (   5 ):   0.00000   0.25000   0.25000

Coulomb matrix read from spex.cor
Inverse dielectric matrices read from spex.cor 
Hermiticity of transformed Coulomb matrix: 1.5E-10

Add contribution to self-energy... done
                               Timings
  MT wave-func. products:      0.26059
  PW wave-func. products:      0.59629
  Matrix-vector products:      1.63844
  Transformations:             0.23414
  Exchange self-energy:        0.08208
  Frequency integration:       0.05176
  Tetrahedron weights:         0.00000
  MPI idle time:               0.00003      0.00003
  Other:                       0.12826
  ------------------------------------
  Total:                       2.99157

=========

K point (   6 ):   0.00000   0.25000   0.50000

Coulomb matrix read from spex.cor
Inverse dielectric matrices read from spex.cor 
Hermiticity of transformed Coulomb matrix: 1.4E-10

Add contribution to self-energy... done
                               Timings
  MT wave-func. products:      0.25696
  PW wave-func. products:      0.59128
  Matrix-vector products:      1.61101
  Transformations:             0.23506
  Exchange self-energy:        0.08129
  Frequency integration:       0.05146
  Tetrahedron weights:         0.00000
  MPI idle time:               0.00002      0.00002
  Other:                       0.12814
  ------------------------------------
  Total:                       2.95522

=========

K point (   7 ):   0.00000   0.50000   0.00000

Coulomb matrix read from spex.cor
Inverse dielectric matrices read from spex.cor 
Hermiticity of transformed Coulomb matrix: 1.3E-10

Add contribution to self-energy... done
                               Timings
  MT wave-func. products:      0.18290
  PW wave-func. products:      0.40742
  Matrix-vector products:      0.65607
  Transformations:             0.15900
  Exchange self-energy:        0.06892
  Frequency integration:       0.03432
  Tetrahedron weights:         0.00000
  MPI idle time:               0.00005      0.00005
  Other:                       0.08924
  ------------------------------------
  Total:                       1.59792

=========

K point (   8 ):   0.00000   0.50000   0.25000

Coulomb matrix read from spex.cor
Inverse dielectric matrices read from spex.cor 
Hermiticity of transformed Coulomb matrix: 7.9E-11

Add contribution to self-energy... done
                               Timings
  MT wave-func. products:      0.17596
  PW wave-func. products:      0.40918
  Matrix-vector products:      0.62866
  Transformations:             0.15622
  Exchange self-energy:        0.06858
  Frequency integration:       0.03371
  Tetrahedron weights:         0.00000
  MPI idle time:               0.00001      0.00001
  Other:                       0.08525
  ------------------------------------
  Total:                       1.55758

=========

K point (   9 ):   0.00000   0.50000   0.50000

Coulomb matrix read from spex.cor
Inverse dielectric matrices read from spex.cor 
Hermiticity of transformed Coulomb matrix: 5.5E-11

Add contribution to self-energy... done
                               Timings
  MT wave-func. products:      0.18184
  PW wave-func. products:      0.39364
  Matrix-vector products:      0.99707
  Transformations:             0.15184
  Exchange self-energy:        0.06022
  Frequency integration:       0.03328
  Tetrahedron weights:         0.00000
  MPI idle time:               0.00002      0.00002
  Other:                       0.08675
  ------------------------------------
  Total:                       1.90466

=========

K point (  10 ):   0.25000   0.25000   0.00000

Coulomb matrix read from spex.cor
Inverse dielectric matrices read from spex.cor 
Hermiticity of transformed Coulomb matrix: 5.5E-11

Add contribution to self-energy... done
                               Timings
  MT wave-func. products:      0.33042
  PW wave-func. products:      0.71945
  Matrix-vector products:      1.92040
  Transformations:             0.30326
  Exchange self-energy:        0.09101
  Frequency integration:       0.06929
  Tetrahedron weights:         0.00000
  MPI idle time:               0.00002      0.00002
  Other:                       0.16784
  ------------------------------------
  Total:                       3.60169

=========

K point (  11 ):   0.25000   0.25000   0.25000

Coulomb matrix read from spex.cor
Inverse dielectric matrices read from spex.cor 
Hermiticity of transformed Coulomb matrix: 8.0E-11

Add contribution to self-energy... done
                               Timings
  MT wave-func. products:      0.33889
  PW wave-func. products:      0.78964
  Matrix-vector products:      2.07796
  Transformations:             0.31973
  Exchange self-energy:        0.10392
  Frequency integration:       0.06897
  Tetrahedron weights:         0.00000
  MPI idle time:               0.00004      0.00004
  Other:                       0.16900
  ------------------------------------
  Total:                       3.86814

=========

K point (  12 ):   0.25000   0.25000   0.50000

Coulomb matrix read from spex.cor
Inverse dielectric matrices read from spex.cor 
Hermiticity of transformed Coulomb matrix: 9.9E-11

Add contribution to self-energy... done
                               Timings
  MT wave-func. products:      0.33614
  PW wave-func. products:      0.78282
  Matrix-vector products:      3.96933
  Transformations:             0.32179
  Exchange self-energy:        0.10203
  Frequency integration:       0.07310
  Tetrahedron weights:         0.00000
  MPI idle time:               0.00002      0.00002
  Other:                       0.17161
  ------------------------------------
  Total:                       5.75683


### subroutine: exchange_core ###

        k point       band      exchange (core contribution)
  (0.878,0.878,0.000)   1     -2.7655220
  (0.878,0.878,0.000)   2     -8.5085968
  (0.878,0.878,0.000)   3    -17.8363624
  (0.878,0.878,0.000)   4    -17.8535668
  (0.878,0.878,0.000)   5    -17.9960891
  (0.878,0.878,0.000)   6    -17.7318580
  (0.878,0.878,0.000)   7    -17.0576335
  (0.878,0.878,0.000)   8    -18.3713539
  (0.878,0.878,0.000)   9    -18.4524682
  (0.878,0.878,0.000)  10    -18.4841116
Timing:   0.13




### subroutine: quasiparticle ###

Number of mesh points even: No constraint will be used.

List of k points
    0   0.87777   0.87777   0.00000  (additional) 



#####################
### K POINT:    0 ###
#####################


--- DIAGONAL ELEMENTS [eV] ---

 Bd       vxc    sigmax    sigmac         Z        KS        HF          GW lin/dir 
  1 -18.76469 -28.69439   8.23199   0.73559  -8.57546 -18.50516  -9.73174   0.95894 
                          1.11150  -0.08325                      -9.73382   0.93615 
  2 -28.31801 -39.67727   8.83373   0.72544  -7.96772 -19.32697  -9.77694   0.53794 
                          0.61100  -0.03749                      -9.72075   0.51482 
  3 -42.41631 -55.73225   9.51318   0.73686  -6.38379 -19.69973  -9.18471   0.11523 
                          0.07353  -0.01605                      -9.08484   0.14091 
  4 -42.44369 -55.75342   9.50803   0.73670  -6.37636 -19.68609  -9.17595   0.11160 
                          0.07034  -0.01572                      -9.07578   0.13755 
  5 -42.64874 -55.97710   9.49848   0.73820  -6.31385 -19.64222  -9.14015   0.10298 
                          0.06370  -0.01461                      -9.03848   0.12876 
  6 -42.21486 -55.46678   9.46840   0.73716  -6.30385 -19.55577  -9.09164   0.11916 
                          0.07666  -0.01656                      -8.99311   0.14478 
  7 -41.12473 -54.16601   9.37788   0.73523  -6.21745 -19.25873  -8.90847   0.16148 
                          0.11193  -0.02161                      -8.81813   0.18621 
  8 -43.19799 -56.54225   9.43508   0.74258  -6.19702 -19.54129  -9.09963   0.05633 
                          0.02941  -0.00882                      -8.99081   0.08071 
  9 -43.34989 -56.72009   9.45898   0.74249  -6.16535 -19.53555  -9.06912   0.05792 
                          0.03041  -0.00904                      -8.96049   0.08250 
 10 -43.41024 -56.78216   9.46544   0.74243  -6.12379 -19.49570  -9.02376   0.06223 
                          0.03342  -0.00958                      -8.91596   0.08708 

Timing (quasiparticle equation):   0.10819

Timing:        33
