########################
######### SPEX #########
########################
Version 05.00  (Sep  5, 2019)
Execution time: Jan 17, 2020  23:32:21
Hostname: login18-1.hpc.itc.rwth-aachen.de
MPI: 1,1


### subroutine: getinput ###

Basic parameters:
  Number of spins            =  1
            centers          =  4
            types            =  2
            equivalent atoms =  2  2
  Lattice parameter =      1.00000
  Lattice vectors   =      3.01411  -5.22060   0.00000
                           3.01411   5.22060   0.00000
                           0.00000   0.00000   9.80579
  Unit-cell volume  =    308.59778
  Reciprocal cutoff =      4.60000

Unit-cell geometry:
  # Ty  El              Coord.
  1  1  Ga   0.33333  -0.33333   0.00000
  2  1  Ga  -0.33333   0.33333   0.50000
  3  2  N    0.33333  -0.33333  -0.37700
  4  2  N   -0.33333   0.33333   0.12300

Symmetry information:
  Number of symmetry operations = 24
   #  Det           Axis           Angle   Syp  Inv
   1    1     --     --     --      --     Yes   1
   2   -1    1.00  -0.58   0.00   180.00   No    2
   3   -1    1.00   0.58   0.00   180.00   No    3
   4    1    0.00   0.00   1.00   120.00   Yes   9
   5    1    0.00   0.00   1.00   180.00   No    5
   6   -1    0.58   1.00   0.00   180.00   Yes   6
   7   -1    1.00   0.00   0.00   180.00   Yes   7
   8    1    0.00   0.00   1.00    60.00   No   11
   9    1    0.00   0.00  -1.00   120.00   Yes   4
  10   -1    0.00   1.00   0.00   180.00   No   10
  11    1    0.00   0.00  -1.00    60.00   No    8
  12   -1   -0.58   1.00   0.00   180.00   Yes  12
  13 - 24  Time reversal symmetries

##################
### Input file ###
##################
BZ       4 4 4
JOB      GW +:(1-10)
NBAND    200
RESTART  
KPT      +=(.68889,.68889,0)
 

Info: Simpson and Lagrange integration is used.

Radial mesh and basis functions:
  Number of radial grid points:       759  429
  Number of radial basis functions:    19   18
  Angular momentum quantum number:      8    6
  Maximal index:                        3

Core states:
  Atom type  1  (Ga)
  nl      Energy
  1s  -375.34991
  2s   -45.88297
  3s    -4.96076
  2p   -39.88207
  3p    -3.15226
  Atom type  2  (N )
  nl      Energy
  1s   -13.54409
  Number of valence electrons:   36

Average Coulomb potential: -0.35487  ( -9.65657 eV )

Read wavefunctions from harddisc... done   ( Timing:    0.21 )

Maximal energy difference in deg. subspaces: 7.0E-14
Minimal energy difference between subspaces: 1.9E-05

Wave functions:
  Number of bands:             198 -  200  (  200 )
            k points (IBZ):     64  (  12 /  30 )
            G vectors:         767
  k points of IBZ:
    1  (0.00000,0.00000,0.00000)  [ 0.00000, 0.00000, 0.00000 ]
    2  (0.00000,0.00000,0.25000)  [ 0.00000, 0.00000, 0.02550 ]
    3  (0.00000,0.00000,0.50000)  [ 0.00000, 0.00000, 0.05099 ]
    4  (0.00000,0.25000,0.00000)  [ 0.04147, 0.02394, 0.00000 ]
    5  (0.00000,0.25000,0.25000)  [ 0.04147, 0.02394, 0.02550 ]
    6  (0.00000,0.25000,0.50000)  [ 0.04147, 0.02394, 0.05099 ]
    7  (0.00000,0.50000,0.00000)  [ 0.08294, 0.04789, 0.00000 ]
    8  (0.00000,0.50000,0.25000)  [ 0.08294, 0.04789, 0.02550 ]
    9  (0.00000,0.50000,0.50000)  [ 0.08294, 0.04789, 0.05099 ]
   10  (0.25000,0.25000,0.00000)  [ 0.08294, 0.00000, 0.00000 ]
   11  (0.25000,0.25000,0.25000)  [ 0.08294, 0.00000, 0.02550 ]
   12  (0.25000,0.25000,0.50000)  [ 0.08294, 0.00000, 0.05099 ]
  k points of EIBZ (shifted set):
   65  (0.68889,0.68889,0.00000)  [ 0.22855, 0.00000, 0.00000 ]
   66  (0.68889,0.68889,0.25000)  [ 0.22855, 0.00000, 0.02550 ]
   67  (0.68889,0.68889,0.50000)  [ 0.22855, 0.00000, 0.05099 ]
   68  (0.68889,0.93889,0.00000)  [ 0.27003, 0.02394, 0.00000 ]
   69  (0.68889,0.93889,0.25000)  [ 0.27003, 0.02394, 0.02550 ]
   70  (0.68889,0.93889,0.50000)  [ 0.27003, 0.02394, 0.05099 ]
   71  (0.68889,0.18889,0.00000)  [ 0.14561,-0.04789, 0.00000 ]
   72  (0.68889,0.18889,0.25000)  [ 0.14561,-0.04789, 0.02550 ]
   73  (0.68889,0.18889,0.50000)  [ 0.14561,-0.04789, 0.05099 ]
   74  (0.68889,0.43889,0.00000)  [ 0.18708,-0.02394, 0.00000 ]
   75  (0.68889,0.43889,0.25000)  [ 0.18708,-0.02394, 0.02550 ]
   76  (0.68889,0.43889,0.50000)  [ 0.18708,-0.02394, 0.05099 ]
   77  (0.93889,0.93889,0.00000)  [ 0.31150, 0.00000, 0.00000 ]
   78  (0.93889,0.93889,0.25000)  [ 0.31150, 0.00000, 0.02550 ]
   79  (0.93889,0.93889,0.50000)  [ 0.31150, 0.00000, 0.05099 ]
   80  (0.93889,0.18889,0.00000)  [ 0.18708,-0.07183, 0.00000 ]
   81  (0.93889,0.18889,0.25000)  [ 0.18708,-0.07183, 0.02550 ]
   82  (0.93889,0.18889,0.50000)  [ 0.18708,-0.07183, 0.05099 ]
   83  (0.93889,0.43889,0.00000)  [ 0.22855,-0.04789, 0.00000 ]
   84  (0.93889,0.43889,0.25000)  [ 0.22855,-0.04789, 0.02550 ]
   85  (0.93889,0.43889,0.50000)  [ 0.22855,-0.04789, 0.05099 ]
   86  (0.18889,0.18889,0.00000)  [ 0.06267, 0.00000, 0.00000 ]
   87  (0.18889,0.18889,0.25000)  [ 0.06267, 0.00000, 0.02550 ]
   88  (0.18889,0.18889,0.50000)  [ 0.06267, 0.00000, 0.05099 ]
   89  (0.18889,0.43889,0.00000)  [ 0.10414, 0.02394, 0.00000 ]
   90  (0.18889,0.43889,0.25000)  [ 0.10414, 0.02394, 0.02550 ]
   91  (0.18889,0.43889,0.50000)  [ 0.10414, 0.02394, 0.05099 ]
   92  (0.43889,0.43889,0.00000)  [ 0.14561, 0.00000, 0.00000 ]
   93  (0.43889,0.43889,0.25000)  [ 0.14561, 0.00000, 0.02550 ]
   94  (0.43889,0.43889,0.50000)  [ 0.14561, 0.00000, 0.05099 ]

Generate wavefunctions at equivalent k points... done   ( Timing:   0.31 )

Size of array cpw:   209.8 MB
Size of array cmt:   260.9 MB

The system is not a metal.
The Fermi energy is placed in the center of the band gap.
KS energy gap:    0.07059528 Ha   (  1.92099521 eV )
Fermi energy:     0.29316457 Ha   (  7.97741378 eV )
Maximal energy:   5.57248232 Ha
Electron count error of the shifted k-point set:  0.0000000000000000

Wave-function checksum: -1.759664895269E-01


### subroutine: checkinput ###

Overlap <core|core>
Atom type  1
1s  1.000000 
2s -0.000000  1.000000 
3s  0.000000 -0.000001  0.999961 
2p  0.999418 
3p -0.000329  0.999458 
Atom type  2
1s  0.999983 

Overlap <core|basis>
Atom type  1
         u(s)    udot(s)
1s  0.000000  0.000000 
2s  0.000001  0.000000 
3s  0.004767 -0.007551 
         u(p)    udot(p)
2p -0.000106 -0.000031 
3p  0.017150 -0.021254 
Atom type  2
         u(s)    udot(s)
1s  0.003209 -0.002046 

Average overlap <core|val>
Atom type  1
1s  0.000000
2s  0.000000
3s  0.000679
2p  0.000010  0.000010  0.000010
3p  0.002207  0.002205  0.002209
Atom type  2
1s  0.000234

Maximum overlap <core|val> at (band/kpoint)
Atom type  1
1s  0.000000 (022/ 009)
2s  0.000001 (022/ 009)
3s  0.003767 (156/ 003)
2p  0.000060 (025/ 003)  0.000064 (024/ 001)  0.000067 (026/ 003)
3p  0.012494 (122/ 003)  0.014817 (111/ 001)  0.013262 (124/ 003)
Atom type  2
1s  0.001647 (001/ 082)

Overlap <basis|basis>
Atom type  1
   u(s)  1.000000 
udot(s)  0.000000  0.129862 
   u(p)  1.000000 
udot(p) -0.000000  0.075237 
   u(d)  1.000000 
udot(d) -0.000000  0.733838 
 ulo(d)  0.410292 -0.767526  1.000000 
   u(f)  1.000000 
udot(f) -0.000000  0.020278 
   u(g)  1.000000 
udot(g) -0.000000  0.006703 
   u(h)  1.000000 
udot(h)  0.000000  0.003149 
   u(i)  1.000000 
udot(i) -0.000000  0.001726 
   u(j)  1.000000 
udot(j)  0.000000  0.001039 
   u(k)  1.000000 
udot(k) -0.000000  0.000667 
Atom type  2
   u(s)  1.000000 
udot(s)  0.000000  0.023146 
   u(p)  1.000000 
udot(p)  0.000000  0.036192 
   u(d)  1.000000 
udot(d)  0.000000  0.003612 
   u(f)  1.000000 
udot(f)  0.000000  0.001183 
   u(g)  1.000000 
udot(g)  0.000000  0.000520 
   u(h)  1.000000 
udot(h) -0.000000  0.000271 
   u(i)  1.000000 
udot(i)  0.000000  0.000157 


### subroutine: mixedbasis ( Mode: vv ) ###

Mixed basis
  Plane-wave basis:
    Number of unique G vectors:   371
    Maximal number of G vectors:  233

  MT basis read in from spex.mb (mode: vv).
    Total number of product-basis functions:  264



##### Job index:  1 #####


### subroutine: correlation ###

< GW self-energy >
Calculate periodic function...done   ( Timing:    0.08 )

=========

K point (   1 ):   0.00000   0.00000   0.00000

Coulomb matrix read from spex.cor
Inverse dielectric matrices read from spex.cor 
Invert dielectric tensor... done   ( Timing:    0.02 )
Hermiticity of transformed Coulomb matrix: 6.8E-11

Add contribution to self-energy... done
                               Timings
  MT wave-func. products:      0.11366
  PW wave-func. products:      0.24065
  Matrix-vector products:      0.32707
  Transformations:             0.08249
  Exchange self-energy:        0.06896
  Frequency integration:       0.01927
  Tetrahedron weights:         0.00000
  Gamma-point correction:      1.34114
  MPI idle time:               0.00014      0.00014
  Other:                       0.05193
  ------------------------------------
  Total:                       2.24531

=========

K point (   2 ):   0.00000   0.00000   0.25000

Coulomb matrix read from spex.cor
Inverse dielectric matrices read from spex.cor 
Hermiticity of transformed Coulomb matrix: 8.7E-10

Add contribution to self-energy... done
                               Timings
  MT wave-func. products:      0.11532
  PW wave-func. products:      0.24198
  Matrix-vector products:      0.32554
  Transformations:             0.07959
  Exchange self-energy:        0.05156
  Frequency integration:       0.01780
  Tetrahedron weights:         0.00000
  MPI idle time:               0.00002      0.00002
  Other:                       0.04865
  ------------------------------------
  Total:                       0.88047

=========

K point (   3 ):   0.00000   0.00000   0.50000

Coulomb matrix read from spex.cor
Inverse dielectric matrices read from spex.cor 
Hermiticity of transformed Coulomb matrix: 2.4E-10

Add contribution to self-energy... done
                               Timings
  MT wave-func. products:      0.11568
  PW wave-func. products:      0.23761
  Matrix-vector products:      0.52080
  Transformations:             0.07632
  Exchange self-energy:        0.04805
  Frequency integration:       0.01783
  Tetrahedron weights:         0.00000
  MPI idle time:               0.00005      0.00005
  Other:                       0.05107
  ------------------------------------
  Total:                       1.06741

=========

K point (   4 ):   0.00000   0.25000   0.00000

Coulomb matrix read from spex.cor
Inverse dielectric matrices read from spex.cor 
Hermiticity of transformed Coulomb matrix: 1.5E-10

Add contribution to self-energy... done
                               Timings
  MT wave-func. products:      0.28680
  PW wave-func. products:      0.58700
  Matrix-vector products:      1.66615
  Transformations:             0.24731
  Exchange self-energy:        0.08510
  Frequency integration:       0.05428
  Tetrahedron weights:         0.00000
  MPI idle time:               0.00003      0.00003
  Other:                       0.13607
  ------------------------------------
  Total:                       3.06275

=========

K point (   5 ):   0.00000   0.25000   0.25000

Coulomb matrix read from spex.cor
Inverse dielectric matrices read from spex.cor 
Hermiticity of transformed Coulomb matrix: 1.5E-10

Add contribution to self-energy... done
                               Timings
  MT wave-func. products:      0.28449
  PW wave-func. products:      0.58658
  Matrix-vector products:      1.66636
  Transformations:             0.25142
  Exchange self-energy:        0.08533
  Frequency integration:       0.05356
  Tetrahedron weights:         0.00000
  MPI idle time:               0.00003      0.00003
  Other:                       0.13575
  ------------------------------------
  Total:                       3.06352

=========

K point (   6 ):   0.00000   0.25000   0.50000

Coulomb matrix read from spex.cor
Inverse dielectric matrices read from spex.cor 
Hermiticity of transformed Coulomb matrix: 1.4E-10

Add contribution to self-energy... done
                               Timings
  MT wave-func. products:      0.27882
  PW wave-func. products:      0.59395
  Matrix-vector products:      1.65923
  Transformations:             0.25344
  Exchange self-energy:        0.08582
  Frequency integration:       0.05405
  Tetrahedron weights:         0.00000
  MPI idle time:               0.00002      0.00002
  Other:                       0.13706
  ------------------------------------
  Total:                       3.06239

=========

K point (   7 ):   0.00000   0.50000   0.00000

Coulomb matrix read from spex.cor
Inverse dielectric matrices read from spex.cor 
Hermiticity of transformed Coulomb matrix: 1.3E-10

Add contribution to self-energy... done
                               Timings
  MT wave-func. products:      0.19075
  PW wave-func. products:      0.43079
  Matrix-vector products:      0.67610
  Transformations:             0.16795
  Exchange self-energy:        0.07187
  Frequency integration:       0.03568
  Tetrahedron weights:         0.00000
  MPI idle time:               0.00003      0.00003
  Other:                       0.09190
  ------------------------------------
  Total:                       1.66507

=========

K point (   8 ):   0.00000   0.50000   0.25000

Coulomb matrix read from spex.cor
Inverse dielectric matrices read from spex.cor 
Hermiticity of transformed Coulomb matrix: 7.9E-11

Add contribution to self-energy... done
                               Timings
  MT wave-func. products:      0.19444
  PW wave-func. products:      0.42687
  Matrix-vector products:      0.68820
  Transformations:             0.16690
  Exchange self-energy:        0.06689
  Frequency integration:       0.03606
  Tetrahedron weights:         0.00000
  MPI idle time:               0.00002      0.00002
  Other:                       0.09154
  ------------------------------------
  Total:                       1.67092

=========

K point (   9 ):   0.00000   0.50000   0.50000

Coulomb matrix read from spex.cor
Inverse dielectric matrices read from spex.cor 
Hermiticity of transformed Coulomb matrix: 5.5E-11

Add contribution to self-energy... done
                               Timings
  MT wave-func. products:      0.19168
  PW wave-func. products:      0.40724
  Matrix-vector products:      1.07073
  Transformations:             0.16015
  Exchange self-energy:        0.06364
  Frequency integration:       0.03636
  Tetrahedron weights:         0.00000
  MPI idle time:               0.00002      0.00002
  Other:                       0.09416
  ------------------------------------
  Total:                       2.02398

=========

K point (  10 ):   0.25000   0.25000   0.00000

Coulomb matrix read from spex.cor
Inverse dielectric matrices read from spex.cor 
Hermiticity of transformed Coulomb matrix: 5.5E-11

Add contribution to self-energy... done
                               Timings
  MT wave-func. products:      0.35830
  PW wave-func. products:      0.76898
  Matrix-vector products:      2.03113
  Transformations:             0.32355
  Exchange self-energy:        0.09724
  Frequency integration:       0.07269
  Tetrahedron weights:         0.00000
  MPI idle time:               0.00004      0.00004
  Other:                       0.17986
  ------------------------------------
  Total:                       3.83179

=========

K point (  11 ):   0.25000   0.25000   0.25000

Coulomb matrix read from spex.cor
Inverse dielectric matrices read from spex.cor 
Hermiticity of transformed Coulomb matrix: 8.0E-11

Add contribution to self-energy... done
                               Timings
  MT wave-func. products:      0.36963
  PW wave-func. products:      0.81173
  Matrix-vector products:      2.18800
  Transformations:             0.33484
  Exchange self-energy:        0.10384
  Frequency integration:       0.07391
  Tetrahedron weights:         0.00000
  MPI idle time:               0.00005      0.00005
  Other:                       0.18353
  ------------------------------------
  Total:                       4.06551

=========

K point (  12 ):   0.25000   0.25000   0.50000

Coulomb matrix read from spex.cor
Inverse dielectric matrices read from spex.cor 
Hermiticity of transformed Coulomb matrix: 9.9E-11

Add contribution to self-energy... done
                               Timings
  MT wave-func. products:      0.36729
  PW wave-func. products:      0.78139
  Matrix-vector products:      3.97073
  Transformations:             0.33852
  Exchange self-energy:        0.10950
  Frequency integration:       0.07322
  Tetrahedron weights:         0.00000
  MPI idle time:               0.00004      0.00004
  Other:                       0.17548
  ------------------------------------
  Total:                       5.81616


### subroutine: exchange_core ###

        k point       band      exchange (core contribution)
  (0.689,0.689,0.000)   1     -8.5296569
  (0.689,0.689,0.000)   2     -9.0399185
  (0.689,0.689,0.000)   3    -17.7304816
  (0.689,0.689,0.000)   4    -18.1912305
  (0.689,0.689,0.000)   5    -18.2533783
  (0.689,0.689,0.000)   6    -18.3810639
  (0.689,0.689,0.000)   7    -18.3718324
  (0.689,0.689,0.000)   8    -18.4088259
  (0.689,0.689,0.000)   9    -18.5168273
  (0.689,0.689,0.000)  10    -18.5658164
Timing:   0.14




### subroutine: quasiparticle ###

Number of mesh points even: No constraint will be used.

List of k points
    0   0.68889   0.68889   0.00000  (additional) 



#####################
### K POINT:    0 ###
#####################


--- DIAGONAL ELEMENTS [eV] ---

 Bd       vxc    sigmax    sigmac         Z        KS        HF          GW lin/dir 
  1 -28.36696 -39.72466   8.83292   0.72420  -7.95113 -19.30883  -9.75760   0.52914 
                          0.60369  -0.03642                      -9.70012   0.50762 
  2 -29.18970 -40.67847   8.88950   0.72275  -7.91534 -19.40411  -9.77522   0.49348 
                          0.56310  -0.03328                      -9.71241   0.47589 
  3 -42.15257 -55.40719   9.44325   0.73766  -6.41894 -19.67356  -9.22946   0.10535 
                          0.06573  -0.01492                      -9.12830   0.13105 
  4 -43.01291 -56.38038   9.52978   0.73870  -6.23143 -19.59891  -9.06542   0.10212 
                          0.06298  -0.01449                      -8.96379   0.12787 
  5 -43.10356 -56.47488   9.52269   0.73928  -6.20612 -19.57744  -9.05053   0.09621 
                          0.05842  -0.01378                      -8.94805   0.12190 
  6 -43.26049 -56.66508   9.52202   0.74053  -6.20015 -19.60475  -9.07475   0.08226 
                          0.04798  -0.01204                      -8.96962   0.10758 
  7 -43.21264 -56.58174   9.47299   0.74160  -6.18803 -19.55713  -9.07698   0.06905 
                          0.03828  -0.01044                      -8.97004   0.09410 
  8 -43.27215 -56.64732   9.47276   0.74188  -6.17948 -19.55466  -9.07426   0.06593 
                          0.03599  -0.01005                      -8.96681   0.09089 
  9 -43.48501 -56.89397   9.50413   0.74176  -6.13231 -19.54128  -9.02839   0.06765 
                          0.03714  -0.01027                      -8.92114   0.09279 
 10 -43.57098 -56.95983   9.48320   0.74219  -6.09049 -19.47934  -8.98890   0.06164 
                          0.03272  -0.00956                      -8.88100   0.08690 

Timing (quasiparticle equation):   0.10818

Timing:        34
