########################
######### SPEX #########
########################
Version 05.00  (Sep  5, 2019)
Execution time: Jan 18, 2020  16:14:48
Hostname: Ontology
MPI: 3,1


### subroutine: getinput ###

Basic parameters:
  Number of spins            =  1
            centers          =  4
            types            =  2
            equivalent atoms =  2  2
  Lattice parameter =      1.00000
  Lattice vectors   =      3.01411  -5.22060   0.00000
                           3.01411   5.22060   0.00000
                           0.00000   0.00000   9.80579
  Unit-cell volume  =    308.59778
  Reciprocal cutoff =      4.60000

Unit-cell geometry:
  # Ty  El              Coord.
  1  1  Ga   0.33333  -0.33333   0.00000
  2  1  Ga  -0.33333   0.33333   0.50000
  3  2  N    0.33333  -0.33333  -0.37700
  4  2  N   -0.33333   0.33333   0.12300

Symmetry information:
  Number of symmetry operations = 24
   #  Det           Axis           Angle   Syp  Inv
   1    1     --     --     --      --     Yes   1
   2   -1    1.00  -0.58  -0.00   180.00   No    2
   3   -1    1.00   0.58  -0.00   180.00   No    3
   4    1    0.00   0.00   1.00   120.00   Yes   9
   5    1    0.00   0.00   1.00   180.00   No    5
   6   -1    0.58   1.00  -0.00   180.00   Yes   6
   7   -1    1.00  -0.00  -0.00   180.00   Yes   7
   8    1    0.00   0.00   1.00    60.00   No   11
   9    1   -0.00  -0.00  -1.00   120.00   Yes   4
  10   -1   -0.00   1.00  -0.00   180.00   No   10
  11    1   -0.00  -0.00  -1.00    60.00   No    8
  12   -1   -0.58   1.00  -0.00   180.00   Yes  12
  13 - 24  Time reversal symmetries

##################
### Input file ###
##################
BZ       4 4 4
JOB      GW +:(1-30)
MPIKPT   
RESTART  
NBAND    200
KPT      +=(.17307,1.00000,0)

#  k point is converted from (0.17307,1.00000,0.00000) to (0.17307,0.00000,0.00000)

Info: Simpson and Lagrange integration is used.

Radial mesh and basis functions:
  Number of radial grid points:       759  429
  Number of radial basis functions:    19   18
  Angular momentum quantum number:      8    6
  Maximal index:                        3

Core states:
  Atom type  1  (Ga)
  nl      Energy
  1s  -375.34991
  2s   -45.88297
  3s    -4.96076
  2p   -39.88207
  3p    -3.15226
  Atom type  2  (N )
  nl      Energy
  1s   -13.54409
  Number of valence electrons:   36

Average Coulomb potential: -0.35487  ( -9.65657 eV )

Read wavefunctions from harddisc... done   ( Timing:    0.27 )

Maximal energy difference in deg. subspaces: 4.2E-13
Minimal energy difference between subspaces: 5.9E-06

Wave functions:
  Number of bands:             198 -  200  (  200 )
            k points (IBZ):     64  (  12 /  30 )
            G vectors:         743
  k points of IBZ:
    1  (0.00000,0.00000,0.00000)  [ 0.00000, 0.00000, 0.00000 ]
    2  (0.00000,0.00000,0.25000)  [ 0.00000, 0.00000, 0.02550 ]
    3  (0.00000,0.00000,0.50000)  [ 0.00000, 0.00000, 0.05099 ]
    4  (0.00000,0.25000,0.00000)  [ 0.04147, 0.02394, 0.00000 ]
    5  (0.00000,0.25000,0.25000)  [ 0.04147, 0.02394, 0.02550 ]
    6  (0.00000,0.25000,0.50000)  [ 0.04147, 0.02394, 0.05099 ]
    7  (0.00000,0.50000,0.00000)  [ 0.08294, 0.04789, 0.00000 ]
    8  (0.00000,0.50000,0.25000)  [ 0.08294, 0.04789, 0.02550 ]
    9  (0.00000,0.50000,0.50000)  [ 0.08294, 0.04789, 0.05099 ]
   10  (0.25000,0.25000,0.00000)  [ 0.08294, 0.00000, 0.00000 ]
   11  (0.25000,0.25000,0.25000)  [ 0.08294, 0.00000, 0.02550 ]
   12  (0.25000,0.25000,0.50000)  [ 0.08294, 0.00000, 0.05099 ]
  k points of EIBZ (shifted set):
   65  (0.17307,0.00000,0.00000)  [ 0.02871,-0.01658, 0.00000 ]
   66  (0.17307,0.00000,0.25000)  [ 0.02871,-0.01658, 0.02550 ]
   67  (0.17307,0.00000,0.50000)  [ 0.02871,-0.01658, 0.05099 ]
   68  (0.17307,0.25000,0.00000)  [ 0.07018, 0.00737, 0.00000 ]
   69  (0.17307,0.25000,0.25000)  [ 0.07018, 0.00737, 0.02550 ]
   70  (0.17307,0.25000,0.50000)  [ 0.07018, 0.00737, 0.05099 ]
   71  (0.17307,0.50000,0.00000)  [ 0.11165, 0.03131, 0.00000 ]
   72  (0.17307,0.50000,0.25000)  [ 0.11165, 0.03131, 0.02550 ]
   73  (0.17307,0.50000,0.50000)  [ 0.11165, 0.03131, 0.05099 ]
   74  (0.17307,0.75000,0.00000)  [ 0.15312, 0.05526, 0.00000 ]
   75  (0.17307,0.75000,0.25000)  [ 0.15312, 0.05526, 0.02550 ]
   76  (0.17307,0.75000,0.50000)  [ 0.15312, 0.05526, 0.05099 ]
   77  (0.42307,0.00000,0.00000)  [ 0.07018,-0.04052, 0.00000 ]
   78  (0.42307,0.00000,0.25000)  [ 0.07018,-0.04052, 0.02550 ]
   79  (0.42307,0.00000,0.50000)  [ 0.07018,-0.04052, 0.05099 ]
   80  (0.42307,0.25000,0.00000)  [ 0.11165,-0.01658, 0.00000 ]
   81  (0.42307,0.25000,0.25000)  [ 0.11165,-0.01658, 0.02550 ]
   82  (0.42307,0.25000,0.50000)  [ 0.11165,-0.01658, 0.05099 ]
   83  (0.42307,0.50000,0.00000)  [ 0.15312, 0.00737, 0.00000 ]
   84  (0.42307,0.50000,0.25000)  [ 0.15312, 0.00737, 0.02550 ]
   85  (0.42307,0.50000,0.50000)  [ 0.15312, 0.00737, 0.05099 ]
   86  (0.67307,0.00000,0.00000)  [ 0.11165,-0.06446, 0.00000 ]
   87  (0.67307,0.00000,0.25000)  [ 0.11165,-0.06446, 0.02550 ]
   88  (0.67307,0.00000,0.50000)  [ 0.11165,-0.06446, 0.05099 ]
   89  (0.67307,0.25000,0.00000)  [ 0.15312,-0.04052, 0.00000 ]
   90  (0.67307,0.25000,0.25000)  [ 0.15312,-0.04052, 0.02550 ]
   91  (0.67307,0.25000,0.50000)  [ 0.15312,-0.04052, 0.05099 ]
   92  (0.92307,0.00000,0.00000)  [ 0.15312,-0.08841, 0.00000 ]
   93  (0.92307,0.00000,0.25000)  [ 0.15312,-0.08841, 0.02550 ]
   94  (0.92307,0.00000,0.50000)  [ 0.15312,-0.08841, 0.05099 ]

Generate wavefunctions at equivalent k points... done   ( Timing:   0.26 )

Size of array cpw:   209.8 MB
Size of array cmt:   260.9 MB

The system is not a metal.
The Fermi energy is placed in the center of the band gap.
KS energy gap:    0.07059528 Ha   (  1.92099521 eV )
Fermi energy:     0.29316457 Ha   (  7.97741378 eV )
Maximal energy:   5.57248232 Ha
Electron count error of the shifted k-point set:  0.0000000000000000

Wave-function checksum: -3.061146637180E-02


### subroutine: checkinput ###

Overlap <core|core>
Atom type  1
1s  1.000000
2s -0.000000  1.000000
3s  0.000000 -0.000001  0.999961
2p  0.999418
3p -0.000329  0.999458
Atom type  2
1s  0.999983

Overlap <core|basis>
Atom type  1
         u(s)    udot(s)
1s  0.000000  0.000000
2s  0.000001  0.000000
3s  0.004767 -0.007551
         u(p)    udot(p)
2p -0.000106 -0.000031
3p  0.017150 -0.021254
Atom type  2
         u(s)    udot(s)
1s  0.003209 -0.002046

Average overlap <core|val>
Atom type  1
1s  0.000000
2s  0.000000
3s  0.000679
2p  0.000010  0.000010  0.000010
3p  0.002208  0.002205  0.002208
Atom type  2
1s  0.000234

Maximum overlap <core|val> at (band/kpoint)
Atom type  1
1s  0.000000 (033/ 001)
2s  0.000001 (033/ 001)
3s  0.004352 (156/ 003)
2p  0.000056 (026/ 002)  0.000064 (024/ 001)  0.000058 (024/ 003)
3p  0.011227 (124/ 094)  0.014817 (111/ 001)  0.011265 (124/ 003)
Atom type  2
1s  0.001668 (002/ 094)

Overlap <basis|basis>
Atom type  1
   u(s)  1.000000
udot(s) -0.000000  0.129862
   u(p)  1.000000
udot(p) -0.000000  0.075237
   u(d)  1.000000
udot(d)  0.000000  0.733838
 ulo(d)  0.410292 -0.767526  1.000000
   u(f)  1.000000
udot(f)  0.000000  0.020278
   u(g)  1.000000
udot(g)  0.000000  0.006703
   u(h)  1.000000
udot(h) -0.000000  0.003149
   u(i)  1.000000
udot(i) -0.000000  0.001726
   u(j)  1.000000
udot(j) -0.000000  0.001039
   u(k)  1.000000
udot(k)  0.000000  0.000667
Atom type  2
   u(s)  1.000000
udot(s) -0.000000  0.023146
   u(p)  1.000000
udot(p)  0.000000  0.036192
   u(d)  1.000000
udot(d)  0.000000  0.003612
   u(f)  1.000000
udot(f) -0.000000  0.001183
   u(g)  1.000000
udot(g)  0.000000  0.000520
   u(h)  1.000000
udot(h) -0.000000  0.000271
   u(i)  1.000000
udot(i) -0.000000  0.000157


### subroutine: mixedbasis ( Mode: vv ) ###

Mixed basis
  Plane-wave basis:
    Number of unique G vectors:   351
    Maximal number of G vectors:  233

  MT basis read in from spex.mb (mode: vv).
    Total number of product-basis functions:  264



##### Job index:  1 #####


### subroutine: correlation ###

< GW self-energy >
Calculate periodic function...done   ( Timing:    0.04 )

=========

K point (   1 ):   0.00000   0.00000   0.00000

Coulomb matrix read from spex.cor
Inverse dielectric matrices read from spex.cor
Invert dielectric tensor... done   ( Timing:    0.02 )
Hermiticity of transformed Coulomb matrix: 5.1E-11

Add contribution to self-energy... done
                               Timings
  MT wave-func. products:      1.27905
  PW wave-func. products:      0.38030
  Matrix-vector products:      2.11565
  Transformations:             0.30361
  Exchange self-energy:        0.15994
  Frequency integration:       0.03108
  Tetrahedron weights:         0.00000
  Gamma-point correction:      0.41402
  MPI idle time:               0.01349      0.01349
  Other:                       0.19697
  ------------------------------------
  Total:                       4.89412

=========

K point (   2 ):   0.00000   0.00000   0.25000

Coulomb matrix read from spex.cor
Inverse dielectric matrices read from spex.cor
Hermiticity of transformed Coulomb matrix: 5.9E-10

Add contribution to self-energy... done
                               Timings
  MT wave-func. products:      1.60921
  PW wave-func. products:      0.34741
  Matrix-vector products:      1.92215
  Transformations:             0.27499
  Exchange self-energy:        0.12923
  Frequency integration:       0.01696
  Tetrahedron weights:         0.00000
  MPI idle time:               0.00002      0.02815
  Other:                       0.19130
  ------------------------------------
  Total:                       4.49127

=========

K point (   3 ):   0.00000   0.00000   0.50000

Coulomb matrix read from spex.cor
Inverse dielectric matrices read from spex.cor
Hermiticity of transformed Coulomb matrix: 1.8E-10

Add contribution to self-energy... done
                               Timings
  MT wave-func. products:      1.31241
  PW wave-func. products:      0.43926
  Matrix-vector products:      2.18013
  Transformations:             0.24760
  Exchange self-energy:        0.17299
  Frequency integration:       0.05832
  Tetrahedron weights:         0.00000
  MPI idle time:               0.02230      0.02230
  Other:                       0.13548
  ------------------------------------
  Total:                       4.56849

=========

K point (   4 ):   0.00000   0.25000   0.00000

Coulomb matrix read from spex.cor
Inverse dielectric matrices read from spex.cor
Hermiticity of transformed Coulomb matrix: 8.5E-11

Add contribution to self-energy... done
                               Timings
  MT wave-func. products:      3.32774
  PW wave-func. products:      0.88650
  Matrix-vector products:      8.47121
  Transformations:             1.07004
  Exchange self-energy:        0.17447
  Frequency integration:       0.27172
  Tetrahedron weights:         0.00000
  MPI idle time:               0.00002      0.02645
  Other:                       0.59638
  ------------------------------------
  Total:                      14.79808

=========

K point (   5 ):   0.00000   0.25000   0.25000

Coulomb matrix read from spex.cor
Inverse dielectric matrices read from spex.cor
Hermiticity of transformed Coulomb matrix: 9.7E-11

Add contribution to self-energy... done
                               Timings
  MT wave-func. products:      3.20184
  PW wave-func. products:      0.96883
  Matrix-vector products:      9.33731
  Transformations:             1.21449
  Exchange self-energy:        0.18350
  Frequency integration:       0.21605
  Tetrahedron weights:         0.00000
  MPI idle time:               0.07322      0.07322
  Other:                       0.62928
  ------------------------------------
  Total:                      15.82451

=========

K point (   6 ):   0.00000   0.25000   0.50000

Coulomb matrix read from spex.cor
Inverse dielectric matrices read from spex.cor
Hermiticity of transformed Coulomb matrix: 9.8E-11

Add contribution to self-energy... done
                               Timings
  MT wave-func. products:      3.02763
  PW wave-func. products:      0.86292
  Matrix-vector products:      9.34329
  Transformations:             1.12455
  Exchange self-energy:        0.18864
  Frequency integration:       0.25550
  Tetrahedron weights:         0.00000
  MPI idle time:               0.00051      0.02940
  Other:                       0.77977
  ------------------------------------
  Total:                      15.58281

=========

K point (   7 ):   0.00000   0.50000   0.00000

Coulomb matrix read from spex.cor
Inverse dielectric matrices read from spex.cor
Hermiticity of transformed Coulomb matrix: 1.0E-10

Add contribution to self-energy... done
                               Timings
  MT wave-func. products:      2.10818
  PW wave-func. products:      0.47723
  Matrix-vector products:      3.65149
  Transformations:             0.55513
  Exchange self-energy:        0.15632
  Frequency integration:       0.10072
  Tetrahedron weights:         0.00000
  MPI idle time:               0.01767      0.01767
  Other:                       0.36391
  ------------------------------------
  Total:                       7.43065

=========

K point (   8 ):   0.00000   0.50000   0.25000

Coulomb matrix read from spex.cor
Inverse dielectric matrices read from spex.cor
Hermiticity of transformed Coulomb matrix: 5.3E-11

Add contribution to self-energy... done
                               Timings
  MT wave-func. products:      2.13717
  PW wave-func. products:      0.48813
  Matrix-vector products:      4.01540
  Transformations:             0.54404
  Exchange self-energy:        0.18560
  Frequency integration:       0.08205
  Tetrahedron weights:         0.00000
  MPI idle time:               0.00002      0.01035
  Other:                       0.19683
  ------------------------------------
  Total:                       7.64925

=========

K point (   9 ):   0.00000   0.50000   0.50000

Coulomb matrix read from spex.cor
Inverse dielectric matrices read from spex.cor
Hermiticity of transformed Coulomb matrix: 4.1E-11

Add contribution to self-energy... done
                               Timings
  MT wave-func. products:      1.85146
  PW wave-func. products:      0.47533
  Matrix-vector products:      4.58210
  Transformations:             0.51476
  Exchange self-energy:        0.13808
  Frequency integration:       0.09998
  Tetrahedron weights:         0.00000
  MPI idle time:               0.00002      0.02470
  Other:                       0.32102
  ------------------------------------
  Total:                       7.98277

=========

K point (  10 ):   0.25000   0.25000   0.00000

Coulomb matrix read from spex.cor
Inverse dielectric matrices read from spex.cor
Hermiticity of transformed Coulomb matrix: 3.6E-11

Add contribution to self-energy... done
                               Timings
  MT wave-func. products:      2.52350
  PW wave-func. products:      0.69382
  Matrix-vector products:      6.32939
  Transformations:             0.83780
  Exchange self-energy:        0.15038
  Frequency integration:       0.12926
  Tetrahedron weights:         0.00000
  MPI idle time:               0.01938      0.01938
  Other:                       0.63215
  ------------------------------------
  Total:                      11.31568

=========

K point (  11 ):   0.25000   0.25000   0.25000

Coulomb matrix read from spex.cor
Inverse dielectric matrices read from spex.cor
Hermiticity of transformed Coulomb matrix: 5.4E-11

Add contribution to self-energy... done
                               Timings
  MT wave-func. products:      2.48531
  PW wave-func. products:      0.70608
  Matrix-vector products:      6.70681
  Transformations:             0.84225
  Exchange self-energy:        0.16587
  Frequency integration:       0.12981
  Tetrahedron weights:         0.00000
  MPI idle time:               0.00002      0.02319
  Other:                       0.52677
  ------------------------------------
  Total:                      11.56293

=========

K point (  12 ):   0.25000   0.25000   0.50000

Coulomb matrix read from spex.cor
Inverse dielectric matrices read from spex.cor
Hermiticity of transformed Coulomb matrix: 6.5E-11

Add contribution to self-energy... done
                               Timings
  MT wave-func. products:      2.38315
  PW wave-func. products:      0.66714
  Matrix-vector products:      9.63864
  Transformations:             0.86534
  Exchange self-energy:        0.26203
  Frequency integration:       0.18788
  Tetrahedron weights:         0.00000
  MPI idle time:               0.00745      0.01989
  Other:                       0.65350
  ------------------------------------
  Total:                      14.66514


### subroutine: exchange_core ###

        k point       band      exchange (core contribution)
  (0.173,0.000,0.000)   1     -2.3110256
  (0.173,0.000,0.000)   2     -8.2682519
  (0.173,0.000,0.000)   3    -17.7847695
  (0.173,0.000,0.000)   4    -17.8460544
  (0.173,0.000,0.000)   5    -17.6740187
  (0.173,0.000,0.000)   6    -18.0542130
  (0.173,0.000,0.000)   7    -17.3666282
  (0.173,0.000,0.000)   8    -18.3918651
  (0.173,0.000,0.000)   9    -18.4545983
  (0.173,0.000,0.000)  10    -18.4854931
  (0.173,0.000,0.000)  11    -18.6707760
  (0.173,0.000,0.000)  12    -12.1901609
  (0.173,0.000,0.000)  13     -1.3691987
  (0.173,0.000,0.000)  14     -1.9302208
  (0.173,0.000,0.000)  15     -2.4795924
  (0.173,0.000,0.000)  16     -1.7472271
  (0.173,0.000,0.000)  17     -2.0272174
  (0.173,0.000,0.000)  18     -2.0972374
  (0.173,0.000,0.000)  19     -1.8328241
  (0.173,0.000,0.000)  20     -2.1991899
  (0.173,0.000,0.000)  21     -1.5777070
  (0.173,0.000,0.000)  22     -1.6372792
  (0.173,0.000,0.000)  23     -1.8387717
  (0.173,0.000,0.000)  24     -2.0228246
  (0.173,0.000,0.000)  25     -1.9685603
  (0.173,0.000,0.000)  26     -1.9434116
  (0.173,0.000,0.000)  27     -1.4660368
  (0.173,0.000,0.000)  28     -1.4628153
  (0.173,0.000,0.000)  29     -1.1931618
  (0.173,0.000,0.000)  30     -1.6762322
Timing:   0.09




### subroutine: quasiparticle ###

Number of mesh points even: No constraint will be used.

List of k points
    0   0.17307   0.00000   0.00000  (additional)



#####################
### K POINT:    0 ###
#####################


--- DIAGONAL ELEMENTS [eV] ---

 Bd       vxc    sigmax    sigmac         Z        KS        HF          GW lin/dir
  1 -17.95369 -27.78763   8.19177   0.73603  -8.68740 -18.52135  -9.79431   0.99788
                          1.15996  -0.08775                      -9.79895   0.97806
  2 -27.92392 -39.22442   8.80586   0.72607  -7.99048 -19.29098  -9.77732   0.55385
                          0.62943  -0.03882                      -9.72350   0.52910
  3 -42.32454 -55.62877   9.50564   0.73670  -6.40208 -19.70631  -9.19928   0.11613
                          0.07430  -0.01616                      -9.09957   0.14178
  4 -42.43880 -55.75785   9.51833   0.73647  -6.38316 -19.70221  -9.18112   0.11369
                          0.07201  -0.01596                      -9.08108   0.13964
  5 -42.11689 -55.35719   9.46144   0.73688  -6.33568 -19.57599  -9.11895   0.11982
                          0.07719  -0.01666                      -9.02053   0.14546
  6 -42.77482 -56.12619   9.52356   0.73805  -6.30448 -19.65584  -9.12859   0.10618
                          0.06634  -0.01495                      -9.02739   0.13181
  7 -41.61097 -54.76051   9.42384   0.73592  -6.30143 -19.45097  -9.04148   0.13933
                          0.09324  -0.01898                      -8.94671   0.16466
  8 -43.23378 -56.58132   9.43735   0.74266  -6.19194 -19.53948  -9.09562   0.05554
                          0.02882  -0.00873                      -8.98674   0.07990
  9 -43.34867 -56.71207   9.44727   0.74282  -6.16767 -19.53107  -9.07640   0.05394
                          0.02769  -0.00852                      -8.96709   0.07829
 10 -43.41965 -56.78906   9.46784   0.74238  -6.10969 -19.47909  -9.00579   0.06409
                          0.03479  -0.00981                      -8.89848   0.08893
 11 -43.75144 -57.16565   9.49496   0.74287  -6.06615 -19.48036  -8.97736   0.05754
                          0.03008  -0.00898                      -8.86864   0.08228
 12 -34.16576 -45.52305   8.63346   0.73899  -4.64169 -15.99898  -6.63207   0.43576
                          0.35812  -0.06282                      -6.63069   0.43389
 13 -14.81421 -20.28299   4.21403   0.73350   0.42296  -5.04582  -0.49548   0.08851
                          0.07949  -0.02407                      -0.48323   0.09211
 14 -17.47679 -21.75897   3.23855   0.76655   4.22186  -0.06032   3.42188   0.00623
                          0.00391  -0.00310                       3.42934   0.00731
 15 -19.08514 -22.86771   2.93202   0.77205   5.20959   1.42702   4.55293   0.00224
                          0.00121  -0.00154                       4.55736   0.00279
 16 -18.26402 -22.41808   3.21994   0.76903   5.45704   1.30299   4.73867   0.00163
                          0.00088  -0.00102                       4.74438   0.00208
 17 -19.60858 -23.18298   2.87028   0.77431   6.68284   3.10844   6.13763   0.00058
                          0.00044  -0.00034                       6.14040   0.00066
 18 -19.85859 -23.61012   3.01760   0.77330   6.76117   3.00964   6.19362   0.00074
                          0.00051  -0.00047                       6.19668   0.00086
 19 -16.29531 -11.75479  -3.61861   0.79297  10.53783  15.07834  11.26888   0.00242
                          0.00567  -0.00225                      11.26538   0.00008
 20 -15.74381 -10.21228  -4.38416   0.80209  12.63315  18.16468  13.55344  -0.00455
                         -0.00051  -0.00360                      13.54617  -0.00685
 21 -13.93107  -8.07267  -4.86383   0.79577  15.16140  21.01980  15.95269  -0.02303
                         -0.01686  -0.00966                      15.94669  -0.02496
 22 -14.54506  -8.56807  -4.99122   0.78586  15.95995  21.93693  16.73429  -0.03320
                         -0.02648  -0.01257                      16.72821  -0.03521
 23 -14.35069  -7.95656  -5.28759   0.78954  17.45630  23.85043  18.32919  -0.05436
                         -0.04498  -0.01703                      18.32149  -0.05705
 24 -13.94667  -7.79975  -5.10038   0.80155  17.57250  23.71942  18.41079  -0.04561
                         -0.03739  -0.01495                      18.40409  -0.04785
 25 -14.14733  -7.76450  -5.32895   0.79186  18.46578  24.84861  19.29920  -0.06556
                         -0.05655  -0.01972                      19.29215  -0.06801
 26 -14.78330  -8.03808  -5.58275   0.78013  19.31801  26.06323  20.22291  -0.09154
                         -0.08102  -0.02437                      20.21399  -0.09457
 27 -12.51447  -6.66178  -5.15969   0.80143  19.92619  25.77888  20.47964  -0.08234
                         -0.08228  -0.02366                      20.47666  -0.08304
 28 -12.47942  -6.59667  -5.23062   0.80186  22.05146  27.93420  22.57052  -0.12139
                         -0.12672  -0.03033                      22.56782  -0.12175
 29 -11.30563  -4.74819  -6.09809   0.77696  23.63576  30.19321  23.97585  -0.26015
                         -0.30191  -0.05570                      23.97398  -0.25908
 30 -12.22659  -5.25714  -6.31239   0.77740  26.21984  33.18930  26.69829  -0.39839
                         -0.45194  -0.07160                      26.69427  -0.39634

Timing (quasiparticle equation):   0.43331

Timing:       122
