########################
######### SPEX #########
########################
Version 05.00  (Sep  5, 2019)
Execution time: Jan 18, 2020  17:09:27
Hostname: Ontology
MPI: 3,1


### subroutine: getinput ###

Basic parameters:
  Number of spins            =  1
            centers          =  4
            types            =  2
            equivalent atoms =  2  2
  Lattice parameter =      1.00000
  Lattice vectors   =      3.01411  -5.22060   0.00000
                           3.01411   5.22060   0.00000
                           0.00000   0.00000   9.80579
  Unit-cell volume  =    308.59778
  Reciprocal cutoff =      4.60000

Unit-cell geometry:
  # Ty  El              Coord.
  1  1  Ga   0.33333  -0.33333   0.00000
  2  1  Ga  -0.33333   0.33333   0.50000
  3  2  N    0.33333  -0.33333  -0.37700
  4  2  N   -0.33333   0.33333   0.12300

Symmetry information:
  Number of symmetry operations = 24
   #  Det           Axis           Angle   Syp  Inv
   1    1     --     --     --      --     Yes   1
   2   -1    1.00  -0.58  -0.00   180.00   No    2
   3   -1    1.00   0.58  -0.00   180.00   No    3
   4    1    0.00   0.00   1.00   120.00   Yes   9
   5    1    0.00   0.00   1.00   180.00   No    5
   6   -1    0.58   1.00  -0.00   180.00   Yes   6
   7   -1    1.00  -0.00  -0.00   180.00   Yes   7
   8    1    0.00   0.00   1.00    60.00   No   11
   9    1   -0.00  -0.00  -1.00   120.00   Yes   4
  10   -1   -0.00   1.00  -0.00   180.00   No   10
  11    1   -0.00  -0.00  -1.00    60.00   No    8
  12   -1   -0.58   1.00  -0.00   180.00   Yes  12
  13 - 24  Time reversal symmetries

##################
### Input file ###
##################
BZ       4 4 4
JOB      GW +:(1-30)
MPIKPT   
RESTART  
NBAND    200
KPT      +=(.76666,.76666,0)


Info: Simpson and Lagrange integration is used.

Radial mesh and basis functions:
  Number of radial grid points:       759  429
  Number of radial basis functions:    19   18
  Angular momentum quantum number:      8    6
  Maximal index:                        3

Core states:
  Atom type  1  (Ga)
  nl      Energy
  1s  -375.34991
  2s   -45.88297
  3s    -4.96076
  2p   -39.88207
  3p    -3.15226
  Atom type  2  (N )
  nl      Energy
  1s   -13.54409
  Number of valence electrons:   36

Average Coulomb potential: -0.35487  ( -9.65657 eV )

Read wavefunctions from harddisc... done   ( Timing:    0.31 )

Maximal energy difference in deg. subspaces: 3.5E-13
Minimal energy difference between subspaces: 8.4E-07

Wave functions:
  Number of bands:             198 -  200  (  200 )
            k points (IBZ):     64  (  12 /  30 )
            G vectors:         721
  k points of IBZ:
    1  (0.00000,0.00000,0.00000)  [ 0.00000, 0.00000, 0.00000 ]
    2  (0.00000,0.00000,0.25000)  [ 0.00000, 0.00000, 0.02550 ]
    3  (0.00000,0.00000,0.50000)  [ 0.00000, 0.00000, 0.05099 ]
    4  (0.00000,0.25000,0.00000)  [ 0.04147, 0.02394, 0.00000 ]
    5  (0.00000,0.25000,0.25000)  [ 0.04147, 0.02394, 0.02550 ]
    6  (0.00000,0.25000,0.50000)  [ 0.04147, 0.02394, 0.05099 ]
    7  (0.00000,0.50000,0.00000)  [ 0.08294, 0.04789, 0.00000 ]
    8  (0.00000,0.50000,0.25000)  [ 0.08294, 0.04789, 0.02550 ]
    9  (0.00000,0.50000,0.50000)  [ 0.08294, 0.04789, 0.05099 ]
   10  (0.25000,0.25000,0.00000)  [ 0.08294, 0.00000, 0.00000 ]
   11  (0.25000,0.25000,0.25000)  [ 0.08294, 0.00000, 0.02550 ]
   12  (0.25000,0.25000,0.50000)  [ 0.08294, 0.00000, 0.05099 ]
  k points of EIBZ (shifted set):
   65  (0.76666,0.76666,0.00000)  [ 0.25436, 0.00000, 0.00000 ]
   66  (0.76666,0.76666,0.25000)  [ 0.25436, 0.00000, 0.02550 ]
   67  (0.76666,0.76666,0.50000)  [ 0.25436, 0.00000, 0.05099 ]
   68  (0.76666,0.01666,0.00000)  [ 0.12994,-0.07183, 0.00000 ]
   69  (0.76666,0.01666,0.25000)  [ 0.12994,-0.07183, 0.02550 ]
   70  (0.76666,0.01666,0.50000)  [ 0.12994,-0.07183, 0.05099 ]
   71  (0.76666,0.26666,0.00000)  [ 0.17141,-0.04789, 0.00000 ]
   72  (0.76666,0.26666,0.25000)  [ 0.17141,-0.04789, 0.02550 ]
   73  (0.76666,0.26666,0.50000)  [ 0.17141,-0.04789, 0.05099 ]
   74  (0.76666,0.51666,0.00000)  [ 0.21289,-0.02394, 0.00000 ]
   75  (0.76666,0.51666,0.25000)  [ 0.21289,-0.02394, 0.02550 ]
   76  (0.76666,0.51666,0.50000)  [ 0.21289,-0.02394, 0.05099 ]
   77  (0.01666,0.01666,0.00000)  [ 0.00553, 0.00000, 0.00000 ]
   78  (0.01666,0.01666,0.25000)  [ 0.00553, 0.00000, 0.02550 ]
   79  (0.01666,0.01666,0.50000)  [ 0.00553, 0.00000, 0.05099 ]
   80  (0.01666,0.26666,0.00000)  [ 0.04700, 0.02394, 0.00000 ]
   81  (0.01666,0.26666,0.25000)  [ 0.04700, 0.02394, 0.02550 ]
   82  (0.01666,0.26666,0.50000)  [ 0.04700, 0.02394, 0.05099 ]
   83  (0.01666,0.51666,0.00000)  [ 0.08847, 0.04789, 0.00000 ]
   84  (0.01666,0.51666,0.25000)  [ 0.08847, 0.04789, 0.02550 ]
   85  (0.01666,0.51666,0.50000)  [ 0.08847, 0.04789, 0.05099 ]
   86  (0.26666,0.26666,0.00000)  [ 0.08847, 0.00000, 0.00000 ]
   87  (0.26666,0.26666,0.25000)  [ 0.08847, 0.00000, 0.02550 ]
   88  (0.26666,0.26666,0.50000)  [ 0.08847, 0.00000, 0.05099 ]
   89  (0.26666,0.51666,0.00000)  [ 0.12994, 0.02394, 0.00000 ]
   90  (0.26666,0.51666,0.25000)  [ 0.12994, 0.02394, 0.02550 ]
   91  (0.26666,0.51666,0.50000)  [ 0.12994, 0.02394, 0.05099 ]
   92  (0.51666,0.51666,0.00000)  [ 0.17141, 0.00000, 0.00000 ]
   93  (0.51666,0.51666,0.25000)  [ 0.17141, 0.00000, 0.02550 ]
   94  (0.51666,0.51666,0.50000)  [ 0.17141, 0.00000, 0.05099 ]

Generate wavefunctions at equivalent k points... done   ( Timing:   0.27 )

Size of array cpw:   209.8 MB
Size of array cmt:   260.9 MB

The system is not a metal.
The Fermi energy is placed in the center of the band gap.
KS energy gap:    0.07059528 Ha   (  1.92099521 eV )
Fermi energy:     0.29316457 Ha   (  7.97741378 eV )
Maximal energy:   5.57248232 Ha
Electron count error of the shifted k-point set:  0.0000000000000000

Wave-function checksum: -2.869468991153E-02


### subroutine: checkinput ###

Overlap <core|core>
Atom type  1
1s  1.000000
2s -0.000000  1.000000
3s  0.000000 -0.000001  0.999961
2p  0.999418
3p -0.000329  0.999458
Atom type  2
1s  0.999983

Overlap <core|basis>
Atom type  1
         u(s)    udot(s)
1s  0.000000  0.000000
2s  0.000001  0.000000
3s  0.004767 -0.007551
         u(p)    udot(p)
2p -0.000106 -0.000031
3p  0.017150 -0.021254
Atom type  2
         u(s)    udot(s)
1s  0.003209 -0.002046

Average overlap <core|val>
Atom type  1
1s  0.000000
2s  0.000000
3s  0.000679
2p  0.000010  0.000010  0.000010
3p  0.002210  0.002206  0.002210
Atom type  2
1s  0.000234

Maximum overlap <core|val> at (band/kpoint)
Atom type  1
1s  0.000000 (033/ 001)
2s  0.000001 (033/ 001)
3s  0.004391 (156/ 003)
2p  0.000066 (025/ 003)  0.000064 (024/ 077)  0.000069 (026/ 003)
3p  0.012308 (122/ 079)  0.014817 (111/ 001)  0.012905 (124/ 079)
Atom type  2
1s  0.001674 (001/ 079)

Overlap <basis|basis>
Atom type  1
   u(s)  1.000000
udot(s) -0.000000  0.129862
   u(p)  1.000000
udot(p) -0.000000  0.075237
   u(d)  1.000000
udot(d)  0.000000  0.733838
 ulo(d)  0.410292 -0.767526  1.000000
   u(f)  1.000000
udot(f)  0.000000  0.020278
   u(g)  1.000000
udot(g)  0.000000  0.006703
   u(h)  1.000000
udot(h) -0.000000  0.003149
   u(i)  1.000000
udot(i) -0.000000  0.001726
   u(j)  1.000000
udot(j) -0.000000  0.001039
   u(k)  1.000000
udot(k)  0.000000  0.000667
Atom type  2
   u(s)  1.000000
udot(s) -0.000000  0.023146
   u(p)  1.000000
udot(p)  0.000000  0.036192
   u(d)  1.000000
udot(d)  0.000000  0.003612
   u(f)  1.000000
udot(f) -0.000000  0.001183
   u(g)  1.000000
udot(g)  0.000000  0.000520
   u(h)  1.000000
udot(h) -0.000000  0.000271
   u(i)  1.000000
udot(i) -0.000000  0.000157


### subroutine: mixedbasis ( Mode: vv ) ###

Mixed basis
  Plane-wave basis:
    Number of unique G vectors:   338
    Maximal number of G vectors:  233

  MT basis read in from spex.mb (mode: vv).
    Total number of product-basis functions:  264



##### Job index:  1 #####


### subroutine: correlation ###

< GW self-energy >
Calculate periodic function...done   ( Timing:    0.04 )

=========

K point (   1 ):   0.00000   0.00000   0.00000

Coulomb matrix read from spex.cor
Inverse dielectric matrices read from spex.cor
Invert dielectric tensor... done   ( Timing:    0.03 )
Hermiticity of transformed Coulomb matrix: 5.1E-11

Add contribution to self-energy... done
                               Timings
  MT wave-func. products:      2.24178
  PW wave-func. products:      0.44861
  Matrix-vector products:      2.60140
  Transformations:             0.38107
  Exchange self-energy:        0.20022
  Frequency integration:       0.02956
  Tetrahedron weights:         0.00000
  Gamma-point correction:      0.41286
  MPI idle time:               0.03058      0.03058
  Other:                       0.16575
  ------------------------------------
  Total:                       6.51182

=========

K point (   2 ):   0.00000   0.00000   0.25000

Coulomb matrix read from spex.cor
Inverse dielectric matrices read from spex.cor
Hermiticity of transformed Coulomb matrix: 5.9E-10

Add contribution to self-energy... done
                               Timings
  MT wave-func. products:      2.46371
  PW wave-func. products:      0.43398
  Matrix-vector products:      2.65572
  Transformations:             0.32737
  Exchange self-energy:        0.18856
  Frequency integration:       0.05184
  Tetrahedron weights:         0.00000
  MPI idle time:               0.00003      0.03145
  Other:                       0.18293
  ------------------------------------
  Total:                       6.30415

=========

K point (   3 ):   0.00000   0.00000   0.50000

Coulomb matrix read from spex.cor
Inverse dielectric matrices read from spex.cor
Hermiticity of transformed Coulomb matrix: 1.8E-10

Add contribution to self-energy... done
                               Timings
  MT wave-func. products:      1.92194
  PW wave-func. products:      0.44479
  Matrix-vector products:      2.40757
  Transformations:             0.25813
  Exchange self-energy:        0.15622
  Frequency integration:       0.07294
  Tetrahedron weights:         0.00000
  MPI idle time:               0.02673      0.03150
  Other:                       0.18823
  ------------------------------------
  Total:                       5.47656

=========

K point (   4 ):   0.00000   0.25000   0.00000

Coulomb matrix read from spex.cor
Inverse dielectric matrices read from spex.cor
Hermiticity of transformed Coulomb matrix: 8.5E-11

Add contribution to self-energy... done
                               Timings
  MT wave-func. products:      3.94537
  PW wave-func. products:      0.87464
  Matrix-vector products:      7.16145
  Transformations:             0.86181
  Exchange self-energy:        0.24730
  Frequency integration:       0.12661
  Tetrahedron weights:         0.00000
  MPI idle time:               0.02527      0.02527
  Other:                       0.51296
  ------------------------------------
  Total:                      13.75541

=========

K point (   5 ):   0.00000   0.25000   0.25000

Coulomb matrix read from spex.cor
Inverse dielectric matrices read from spex.cor
Hermiticity of transformed Coulomb matrix: 9.7E-11

Add contribution to self-energy... done
                               Timings
  MT wave-func. products:      3.36960
  PW wave-func. products:      0.80386
  Matrix-vector products:      7.29686
  Transformations:             0.93129
  Exchange self-energy:        0.18782
  Frequency integration:       0.17329
  Tetrahedron weights:         0.00000
  MPI idle time:               0.02258      0.02258
  Other:                       0.54287
  ------------------------------------
  Total:                      13.32817

=========

K point (   6 ):   0.00000   0.25000   0.50000

Coulomb matrix read from spex.cor
Inverse dielectric matrices read from spex.cor
Hermiticity of transformed Coulomb matrix: 9.8E-11

Add contribution to self-energy... done
                               Timings
  MT wave-func. products:      3.54182
  PW wave-func. products:      0.81189
  Matrix-vector products:      7.30357
  Transformations:             0.97501
  Exchange self-energy:        0.21877
  Frequency integration:       0.15999
  Tetrahedron weights:         0.00000
  MPI idle time:               0.00003      0.04419
  Other:                       0.48341
  ------------------------------------
  Total:                      13.49450

=========

K point (   7 ):   0.00000   0.50000   0.00000

Coulomb matrix read from spex.cor
Inverse dielectric matrices read from spex.cor
Hermiticity of transformed Coulomb matrix: 1.0E-10

Add contribution to self-energy... done
                               Timings
  MT wave-func. products:      2.34879
  PW wave-func. products:      0.57925
  Matrix-vector products:      4.29951
  Transformations:             0.59283
  Exchange self-energy:        0.16323
  Frequency integration:       0.10640
  Tetrahedron weights:         0.00000
  MPI idle time:               0.03320      0.03608
  Other:                       0.24635
  ------------------------------------
  Total:                       8.36954

=========

K point (   8 ):   0.00000   0.50000   0.25000

Coulomb matrix read from spex.cor
Inverse dielectric matrices read from spex.cor
Hermiticity of transformed Coulomb matrix: 5.3E-11

Add contribution to self-energy... done
                               Timings
  MT wave-func. products:      2.96130
  PW wave-func. products:      0.61140
  Matrix-vector products:      4.57234
  Transformations:             0.64175
  Exchange self-energy:        0.27992
  Frequency integration:       0.09502
  Tetrahedron weights:         0.00000
  MPI idle time:               0.04900      0.04900
  Other:                       0.28869
  ------------------------------------
  Total:                       9.49943

=========

K point (   9 ):   0.00000   0.50000   0.50000

Coulomb matrix read from spex.cor
Inverse dielectric matrices read from spex.cor
Hermiticity of transformed Coulomb matrix: 4.1E-11

Add contribution to self-energy... done
                               Timings
  MT wave-func. products:      2.82131
  PW wave-func. products:      0.57738
  Matrix-vector products:      4.55895
  Transformations:             0.60031
  Exchange self-energy:        0.33687
  Frequency integration:       0.09277
  Tetrahedron weights:         0.00000
  MPI idle time:               0.04048      0.04711
  Other:                       0.41476
  ------------------------------------
  Total:                       9.44283

=========

K point (  10 ):   0.25000   0.25000   0.00000

Coulomb matrix read from spex.cor
Inverse dielectric matrices read from spex.cor
Hermiticity of transformed Coulomb matrix: 3.6E-11

Add contribution to self-energy... done
                               Timings
  MT wave-func. products:      4.06188
  PW wave-func. products:      1.12450
  Matrix-vector products:      9.34415
  Transformations:             1.17564
  Exchange self-energy:        0.35793
  Frequency integration:       0.21844
  Tetrahedron weights:         0.00000
  MPI idle time:               0.00002      0.03712
  Other:                       0.72501
  ------------------------------------
  Total:                      17.00758

=========

K point (  11 ):   0.25000   0.25000   0.25000

Coulomb matrix read from spex.cor
Inverse dielectric matrices read from spex.cor
Hermiticity of transformed Coulomb matrix: 5.4E-11

Add contribution to self-energy... done
                               Timings
  MT wave-func. products:      4.57305
  PW wave-func. products:      1.07890
  Matrix-vector products:     10.03896
  Transformations:             1.27783
  Exchange self-energy:        0.38544
  Frequency integration:       0.23508
  Tetrahedron weights:         0.00000
  MPI idle time:               0.03471      0.05270
  Other:                       0.65234
  ------------------------------------
  Total:                      18.27631

=========

K point (  12 ):   0.25000   0.25000   0.50000

Coulomb matrix read from spex.cor
Inverse dielectric matrices read from spex.cor
Hermiticity of transformed Coulomb matrix: 6.5E-11

Add contribution to self-energy... done
                               Timings
  MT wave-func. products:      4.74916
  PW wave-func. products:      1.08980
  Matrix-vector products:     16.16087
  Transformations:             1.41425
  Exchange self-energy:        0.36819
  Frequency integration:       0.22984
  Tetrahedron weights:         0.00000
  MPI idle time:               0.00003      0.07909
  Other:                       0.65669
  ------------------------------------
  Total:                      24.66884


### subroutine: exchange_core ###

        k point       band      exchange (core contribution)
  (0.767,0.767,0.000)   1     -6.6335097
  (0.767,0.767,0.000)   2     -9.3563786
  (0.767,0.767,0.000)   3    -17.7918430
  (0.767,0.767,0.000)   4    -18.0560145
  (0.767,0.767,0.000)   5    -18.2021443
  (0.767,0.767,0.000)   6    -18.3234512
  (0.767,0.767,0.000)   7    -18.2477264
  (0.767,0.767,0.000)   8    -18.4217863
  (0.767,0.767,0.000)   9    -18.5497602
  (0.767,0.767,0.000)  10    -18.5408418
  (0.767,0.767,0.000)  11    -13.2847653
  (0.767,0.767,0.000)  12    -11.2815625
  (0.767,0.767,0.000)  13     -1.7010931
  (0.767,0.767,0.000)  14     -2.1073887
  (0.767,0.767,0.000)  15     -1.3923528
  (0.767,0.767,0.000)  16     -1.5392380
  (0.767,0.767,0.000)  17     -1.8488199
  (0.767,0.767,0.000)  18     -1.7775959
  (0.767,0.767,0.000)  19     -1.4985416
  (0.767,0.767,0.000)  20     -1.8473731
  (0.767,0.767,0.000)  21     -1.7268184
  (0.767,0.767,0.000)  22     -2.1694564
  (0.767,0.767,0.000)  23     -1.8645127
  (0.767,0.767,0.000)  24     -1.7648563
  (0.767,0.767,0.000)  25     -1.6278564
  (0.767,0.767,0.000)  26     -1.4915382
  (0.767,0.767,0.000)  27     -2.3173280
  (0.767,0.767,0.000)  28     -1.9122032
  (0.767,0.767,0.000)  29     -2.1992813
  (0.767,0.767,0.000)  30     -1.1545447
Timing:   0.09




### subroutine: quasiparticle ###

Number of mesh points even: No constraint will be used.

List of k points
    0   0.76666   0.76666   0.00000  (additional)



#####################
### K POINT:    0 ###
#####################


--- DIAGONAL ELEMENTS [eV] ---

 Bd       vxc    sigmax    sigmac         Z        KS        HF          GW lin/dir
  1 -25.28466 -36.16805   8.61919   0.72920  -8.09287 -18.97626  -9.70827   0.65732
                          0.75473  -0.04724                      -9.67001   0.62521
  2 -29.69393 -41.27065   8.91564   0.72172  -7.89847 -19.47519  -9.80350   0.46231
                          0.53314  -0.02913                      -9.73453   0.44762
  3 -42.27511 -55.54617   9.45780   0.73775  -6.39470 -19.66576  -9.20697   0.10519
                          0.06570  -0.01487                      -9.10584   0.13078
  4 -42.79167 -56.14219   9.52838   0.73789  -6.29369 -19.64421  -9.11296   0.10851
                          0.06807  -0.01525                      -9.01223   0.13423
  5 -42.98633 -56.34704   9.50669   0.73940  -6.23638 -19.59709  -9.08529   0.09261
                          0.05563  -0.01336                      -8.98210   0.11831
  6 -43.13225 -56.49708   9.47296   0.74145  -6.21590 -19.58073  -9.10110   0.07112
                          0.04009  -0.01064                      -8.99447   0.09589
  7 -43.04068 -56.39669   9.49263   0.74016  -6.20624 -19.56225  -9.06512   0.08655
                          0.05127  -0.01258                      -8.96113   0.11195
  8 -43.29576 -56.66768   9.46952   0.74203  -6.16488 -19.53680  -9.06022   0.06532
                          0.03561  -0.00997                      -8.95277   0.09022
  9 -43.56407 -56.97828   9.51577   0.74159  -6.11167 -19.52589  -9.00229   0.07072
                          0.03933  -0.01066                      -8.89578   0.09595
 10 -43.53486 -56.91460   9.48127   0.74213  -6.08352 -19.46327  -8.97635   0.06457
                          0.03505  -0.00989                      -8.86912   0.08968
 11 -35.36278 -47.12923   8.81015   0.72427  -5.32482 -17.09127  -7.45066   0.36680
                          0.29265  -0.05238                      -7.39680   0.40095
 12 -33.09976 -44.12065   8.47713   0.73551  -4.16460 -15.18549  -6.01408   0.41672
                          0.36079  -0.05950                      -5.99604   0.41525
 13 -15.99060 -21.03527   3.94428   0.74362   1.30673  -3.73795   0.48917   0.05130
                          0.04579  -0.01568                       0.49800   0.05343
 14 -16.97123 -22.12556   3.90400   0.74827   2.13746  -3.01687   1.20219   0.03469
                          0.02681  -0.01170                       1.21384   0.03779
 15 -15.64866 -20.48787   3.59357   0.75404   2.81982  -2.01940   1.88067   0.02071
                          0.01520  -0.00742                       1.89260   0.02289
 16 -16.45395 -20.92852   3.40050   0.76003   3.39317  -1.08141   2.57689   0.01302
                          0.00967  -0.00528                       2.58515   0.01429
 17 -18.02117 -22.19706   3.18445   0.77004   5.16191   0.98602   4.39846   0.00200
                          0.00114  -0.00114                       4.40500   0.00250
 18 -18.03255 -22.07907   3.11773   0.76980   5.35643   1.30991   4.64144   0.00137
                          0.00072  -0.00087                       4.64718   0.00176
 19 -12.60729  -7.83201  -4.22936   0.81373  13.07717  17.85245  13.52139  -0.00415
                         -0.00266  -0.00365                      13.51969  -0.00454
 20 -16.68482 -10.78641  -4.60487   0.78170  13.38384  19.28225  14.39497  -0.01274
                         -0.00519  -0.00672                      14.38562  -0.01637
 21 -14.73940  -9.13634  -4.61895   0.79432  14.75199  20.35505  15.53359  -0.01774
                         -0.01223  -0.00815                      15.52788  -0.01955
 22 -17.13512 -10.70603  -4.86217   0.78404  14.84266  21.27176  16.07108  -0.02319
                         -0.01278  -0.00841                      16.05670  -0.02813
 23 -14.57582  -8.59325  -4.98648   0.79287  16.66436  22.64694  17.45369  -0.03922
                         -0.03235  -0.01363                      17.44766  -0.04120
 24 -15.48094  -8.82578  -5.48508   0.77096  17.56680  24.22196  18.46776  -0.06683
                         -0.05654  -0.01986                      18.45875  -0.07003
 25 -13.76567  -7.46315  -5.41185   0.78449  17.84108  24.14359  18.53841  -0.06988
                         -0.06457  -0.02158                      18.53331  -0.07156
 26 -13.72893  -6.86096  -5.98561   0.76694  20.90895  27.77692  21.57946  -0.15861
                         -0.16306  -0.03803                      21.57373  -0.15966
 27 -15.87380  -8.29702  -6.31847   0.75578  21.05916  28.63594  22.00189  -0.19924
                         -0.19162  -0.04324                      21.99001  -0.20260
 28 -13.93118  -7.25220  -5.75307   0.78292  22.57558  29.25456  23.29306  -0.18165
                         -0.18433  -0.04032                      23.28706  -0.18276
 29 -14.96830  -7.48560  -6.49476   0.77011  26.79249  34.27520  27.51453  -0.46656
                         -0.50784  -0.07638                      27.50603  -0.46490
 30 -11.60121  -4.73479  -6.21690   0.78552  27.14761  34.01404  27.62267  -0.42442
                         -0.47970  -0.07331                      27.61885  -0.42229

Timing (quasiparticle equation):   0.43878

Timing:       148
