########################
######### SPEX #########
########################
Version 05.00  (Sep  5, 2019)
Execution time: Jan 17, 2020  23:10:29
Hostname: login18-1.hpc.itc.rwth-aachen.de
MPI: 1,1


### subroutine: getinput ###

Basic parameters:
  Number of spins            =  1
            centers          =  4
            types            =  2
            equivalent atoms =  2  2
  Lattice parameter =      1.00000
  Lattice vectors   =      3.01411  -5.22060   0.00000
                           3.01411   5.22060   0.00000
                           0.00000   0.00000   9.80579
  Unit-cell volume  =    308.59778
  Reciprocal cutoff =      4.60000

Unit-cell geometry:
  # Ty  El              Coord.
  1  1  Ga   0.33333  -0.33333   0.00000
  2  1  Ga  -0.33333   0.33333   0.50000
  3  2  N    0.33333  -0.33333  -0.37700
  4  2  N   -0.33333   0.33333   0.12300

Symmetry information:
  Number of symmetry operations = 24
   #  Det           Axis           Angle   Syp  Inv
   1    1     --     --     --      --     Yes   1
   2   -1    1.00  -0.58   0.00   180.00   No    2
   3   -1    1.00   0.58   0.00   180.00   No    3
   4    1    0.00   0.00   1.00   120.00   Yes   9
   5    1    0.00   0.00   1.00   180.00   No    5
   6   -1    0.58   1.00   0.00   180.00   Yes   6
   7   -1    1.00   0.00   0.00   180.00   Yes   7
   8    1    0.00   0.00   1.00    60.00   No   11
   9    1    0.00   0.00  -1.00   120.00   Yes   4
  10   -1    0.00   1.00   0.00   180.00   No   10
  11    1    0.00   0.00  -1.00    60.00   No    8
  12   -1   -0.58   1.00   0.00   180.00   Yes  12
  13 - 24  Time reversal symmetries

##################
### Input file ###
##################
BZ       4 4 4
JOB      GW +:(1-10)
NBAND    200
RESTART  
KPT      +=(.98889,.98889,0)
 

Info: Simpson and Lagrange integration is used.

Radial mesh and basis functions:
  Number of radial grid points:       759  429
  Number of radial basis functions:    19   18
  Angular momentum quantum number:      8    6
  Maximal index:                        3

Core states:
  Atom type  1  (Ga)
  nl      Energy
  1s  -375.34991
  2s   -45.88297
  3s    -4.96076
  2p   -39.88207
  3p    -3.15226
  Atom type  2  (N )
  nl      Energy
  1s   -13.54409
  Number of valence electrons:   36

Average Coulomb potential: -0.35487  ( -9.65657 eV )

Read wavefunctions from harddisc... done   ( Timing:    0.21 )

Maximal energy difference in deg. subspaces: 1.5E-12
Minimal energy difference between subspaces: 3.1E-06

Wave functions:
  Number of bands:             198 -  200  (  200 )
            k points (IBZ):     64  (  12 /  30 )
            G vectors:         779
  k points of IBZ:
    1  (0.00000,0.00000,0.00000)  [ 0.00000, 0.00000, 0.00000 ]
    2  (0.00000,0.00000,0.25000)  [ 0.00000, 0.00000, 0.02550 ]
    3  (0.00000,0.00000,0.50000)  [ 0.00000, 0.00000, 0.05099 ]
    4  (0.00000,0.25000,0.00000)  [ 0.04147, 0.02394, 0.00000 ]
    5  (0.00000,0.25000,0.25000)  [ 0.04147, 0.02394, 0.02550 ]
    6  (0.00000,0.25000,0.50000)  [ 0.04147, 0.02394, 0.05099 ]
    7  (0.00000,0.50000,0.00000)  [ 0.08294, 0.04789, 0.00000 ]
    8  (0.00000,0.50000,0.25000)  [ 0.08294, 0.04789, 0.02550 ]
    9  (0.00000,0.50000,0.50000)  [ 0.08294, 0.04789, 0.05099 ]
   10  (0.25000,0.25000,0.00000)  [ 0.08294, 0.00000, 0.00000 ]
   11  (0.25000,0.25000,0.25000)  [ 0.08294, 0.00000, 0.02550 ]
   12  (0.25000,0.25000,0.50000)  [ 0.08294, 0.00000, 0.05099 ]
  k points of EIBZ (shifted set):
   65  (0.98889,0.98889,0.00000)  [ 0.32809, 0.00000, 0.00000 ]
   66  (0.98889,0.98889,0.25000)  [ 0.32809, 0.00000, 0.02550 ]
   67  (0.98889,0.98889,0.50000)  [ 0.32809, 0.00000, 0.05099 ]
   68  (0.98889,0.23889,0.00000)  [ 0.20367,-0.07183, 0.00000 ]
   69  (0.98889,0.23889,0.25000)  [ 0.20367,-0.07183, 0.02550 ]
   70  (0.98889,0.23889,0.50000)  [ 0.20367,-0.07183, 0.05099 ]
   71  (0.98889,0.48889,0.00000)  [ 0.24514,-0.04789, 0.00000 ]
   72  (0.98889,0.48889,0.25000)  [ 0.24514,-0.04789, 0.02550 ]
   73  (0.98889,0.48889,0.50000)  [ 0.24514,-0.04789, 0.05099 ]
   74  (0.98889,0.73889,0.00000)  [ 0.28661,-0.02394, 0.00000 ]
   75  (0.98889,0.73889,0.25000)  [ 0.28661,-0.02394, 0.02550 ]
   76  (0.98889,0.73889,0.50000)  [ 0.28661,-0.02394, 0.05099 ]
   77  (0.23889,0.23889,0.00000)  [ 0.07926, 0.00000, 0.00000 ]
   78  (0.23889,0.23889,0.25000)  [ 0.07926, 0.00000, 0.02550 ]
   79  (0.23889,0.23889,0.50000)  [ 0.07926, 0.00000, 0.05099 ]
   80  (0.23889,0.48889,0.00000)  [ 0.12073, 0.02394, 0.00000 ]
   81  (0.23889,0.48889,0.25000)  [ 0.12073, 0.02394, 0.02550 ]
   82  (0.23889,0.48889,0.50000)  [ 0.12073, 0.02394, 0.05099 ]
   83  (0.23889,0.73889,0.00000)  [ 0.16220, 0.04789, 0.00000 ]
   84  (0.23889,0.73889,0.25000)  [ 0.16220, 0.04789, 0.02550 ]
   85  (0.23889,0.73889,0.50000)  [ 0.16220, 0.04789, 0.05099 ]
   86  (0.48889,0.48889,0.00000)  [ 0.16220, 0.00000, 0.00000 ]
   87  (0.48889,0.48889,0.25000)  [ 0.16220, 0.00000, 0.02550 ]
   88  (0.48889,0.48889,0.50000)  [ 0.16220, 0.00000, 0.05099 ]
   89  (0.48889,0.73889,0.00000)  [ 0.20367, 0.02394, 0.00000 ]
   90  (0.48889,0.73889,0.25000)  [ 0.20367, 0.02394, 0.02550 ]
   91  (0.48889,0.73889,0.50000)  [ 0.20367, 0.02394, 0.05099 ]
   92  (0.73889,0.73889,0.00000)  [ 0.24514, 0.00000, 0.00000 ]
   93  (0.73889,0.73889,0.25000)  [ 0.24514, 0.00000, 0.02550 ]
   94  (0.73889,0.73889,0.50000)  [ 0.24514, 0.00000, 0.05099 ]

Generate wavefunctions at equivalent k points... done   ( Timing:   0.31 )

Size of array cpw:   209.8 MB
Size of array cmt:   260.9 MB

The system is not a metal.
The Fermi energy is placed in the center of the band gap.
KS energy gap:    0.07059528 Ha   (  1.92099521 eV )
Fermi energy:     0.29316457 Ha   (  7.97741378 eV )
Maximal energy:   5.57248232 Ha
Electron count error of the shifted k-point set:  0.0000000000000000

Wave-function checksum: -2.762701330438E-02


### subroutine: checkinput ###

Overlap <core|core>
Atom type  1
1s  1.000000 
2s -0.000000  1.000000 
3s  0.000000 -0.000001  0.999961 
2p  0.999418 
3p -0.000329  0.999458 
Atom type  2
1s  0.999983 

Overlap <core|basis>
Atom type  1
         u(s)    udot(s)
1s  0.000000  0.000000 
2s  0.000001  0.000000 
3s  0.004767 -0.007551 
         u(p)    udot(p)
2p -0.000106 -0.000031 
3p  0.017150 -0.021254 
Atom type  2
         u(s)    udot(s)
1s  0.003209 -0.002046 

Average overlap <core|val>
Atom type  1
1s  0.000000
2s  0.000000
3s  0.000679
2p  0.000010  0.000010  0.000010
3p  0.002211  0.002206  0.002210
Atom type  2
1s  0.000234

Maximum overlap <core|val> at (band/kpoint)
Atom type  1
1s  0.000000 (022/ 088)
2s  0.000001 (022/ 088)
3s  0.003895 (097/ 105)
2p  0.000056 (025/ 067)  0.000064 (024/ 065)  0.000057 (023/ 003)
3p  0.012892 (124/ 067)  0.014817 (111/ 001)  0.012583 (122/ 067)
Atom type  2
1s  0.001677 (001/ 067)

Overlap <basis|basis>
Atom type  1
   u(s)  1.000000 
udot(s) -0.000000  0.129862 
   u(p)  1.000000 
udot(p) -0.000000  0.075237 
   u(d)  1.000000 
udot(d) -0.000000  0.733838 
 ulo(d)  0.410292 -0.767526  1.000000 
   u(f)  1.000000 
udot(f) -0.000000  0.020278 
   u(g)  1.000000 
udot(g) -0.000000  0.006703 
   u(h)  1.000000 
udot(h)  0.000000  0.003149 
   u(i)  1.000000 
udot(i) -0.000000  0.001726 
   u(j)  1.000000 
udot(j) -0.000000  0.001039 
   u(k)  1.000000 
udot(k)  0.000000  0.000667 
Atom type  2
   u(s)  1.000000 
udot(s)  0.000000  0.023146 
   u(p)  1.000000 
udot(p)  0.000000  0.036192 
   u(d)  1.000000 
udot(d)  0.000000  0.003612 
   u(f)  1.000000 
udot(f)  0.000000  0.001183 
   u(g)  1.000000 
udot(g) -0.000000  0.000520 
   u(h)  1.000000 
udot(h) -0.000000  0.000271 
   u(i)  1.000000 
udot(i)  0.000000  0.000157 


### subroutine: mixedbasis ( Mode: vv ) ###

Mixed basis
  Plane-wave basis:
    Number of unique G vectors:   380
    Maximal number of G vectors:  233

  MT basis read in from spex.mb (mode: vv).
    Total number of product-basis functions:  264



##### Job index:  1 #####


### subroutine: correlation ###

< GW self-energy >
Calculate periodic function...done   ( Timing:    0.08 )

=========

K point (   1 ):   0.00000   0.00000   0.00000

Coulomb matrix read from spex.cor
Inverse dielectric matrices read from spex.cor 
Invert dielectric tensor... done   ( Timing:    0.02 )
Hermiticity of transformed Coulomb matrix: 6.8E-11

Add contribution to self-energy... done
                               Timings
  MT wave-func. products:      0.11882
  PW wave-func. products:      0.27769
  Matrix-vector products:      0.36793
  Transformations:             0.08632
  Exchange self-energy:        0.07179
  Frequency integration:       0.01862
  Tetrahedron weights:         0.00000
  Gamma-point correction:      1.35182
  MPI idle time:               0.00007      0.00007
  Other:                       0.05905
  ------------------------------------
  Total:                       2.35210

=========

K point (   2 ):   0.00000   0.00000   0.25000

Coulomb matrix read from spex.cor
Inverse dielectric matrices read from spex.cor 
Hermiticity of transformed Coulomb matrix: 8.7E-10

Add contribution to self-energy... done
                               Timings
  MT wave-func. products:      0.11268
  PW wave-func. products:      0.25308
  Matrix-vector products:      0.31897
  Transformations:             0.08048
  Exchange self-energy:        0.05208
  Frequency integration:       0.01821
  Tetrahedron weights:         0.00000
  MPI idle time:               0.00004      0.00004
  Other:                       0.05016
  ------------------------------------
  Total:                       0.88570

=========

K point (   3 ):   0.00000   0.00000   0.50000

Coulomb matrix read from spex.cor
Inverse dielectric matrices read from spex.cor 
Hermiticity of transformed Coulomb matrix: 2.4E-10

Add contribution to self-energy... done
                               Timings
  MT wave-func. products:      0.11342
  PW wave-func. products:      0.23162
  Matrix-vector products:      0.52274
  Transformations:             0.07894
  Exchange self-energy:        0.04951
  Frequency integration:       0.01838
  Tetrahedron weights:         0.00000
  MPI idle time:               0.00003      0.00003
  Other:                       0.05157
  ------------------------------------
  Total:                       1.06620

=========

K point (   4 ):   0.00000   0.25000   0.00000

Coulomb matrix read from spex.cor
Inverse dielectric matrices read from spex.cor 
Hermiticity of transformed Coulomb matrix: 1.5E-10

Add contribution to self-energy... done
                               Timings
  MT wave-func. products:      0.26521
  PW wave-func. products:      0.61302
  Matrix-vector products:      1.60293
  Transformations:             0.25008
  Exchange self-energy:        0.08235
  Frequency integration:       0.05424
  Tetrahedron weights:         0.00000
  MPI idle time:               0.00004      0.00004
  Other:                       0.13432
  ------------------------------------
  Total:                       3.00220

=========

K point (   5 ):   0.00000   0.25000   0.25000

Coulomb matrix read from spex.cor
Inverse dielectric matrices read from spex.cor 
Hermiticity of transformed Coulomb matrix: 1.5E-10

Add contribution to self-energy... done
                               Timings
  MT wave-func. products:      0.25750
  PW wave-func. products:      0.61464
  Matrix-vector products:      1.58798
  Transformations:             0.24676
  Exchange self-energy:        0.08515
  Frequency integration:       0.05314
  Tetrahedron weights:         0.00000
  MPI idle time:               0.00004      0.00004
  Other:                       0.13222
  ------------------------------------
  Total:                       2.97742

=========

K point (   6 ):   0.00000   0.25000   0.50000

Coulomb matrix read from spex.cor
Inverse dielectric matrices read from spex.cor 
Hermiticity of transformed Coulomb matrix: 1.4E-10

Add contribution to self-energy... done
                               Timings
  MT wave-func. products:      0.25639
  PW wave-func. products:      0.63482
  Matrix-vector products:      1.61242
  Transformations:             0.25219
  Exchange self-energy:        0.08582
  Frequency integration:       0.05302
  Tetrahedron weights:         0.00000
  MPI idle time:               0.00004      0.00004
  Other:                       0.13288
  ------------------------------------
  Total:                       3.02758

=========

K point (   7 ):   0.00000   0.50000   0.00000

Coulomb matrix read from spex.cor
Inverse dielectric matrices read from spex.cor 
Hermiticity of transformed Coulomb matrix: 1.3E-10

Add contribution to self-energy... done
                               Timings
  MT wave-func. products:      0.18336
  PW wave-func. products:      0.43291
  Matrix-vector products:      0.66146
  Transformations:             0.16437
  Exchange self-energy:        0.07144
  Frequency integration:       0.03542
  Tetrahedron weights:         0.00000
  MPI idle time:               0.00004      0.00004
  Other:                       0.09014
  ------------------------------------
  Total:                       1.63913

=========

K point (   8 ):   0.00000   0.50000   0.25000

Coulomb matrix read from spex.cor
Inverse dielectric matrices read from spex.cor 
Hermiticity of transformed Coulomb matrix: 7.9E-11

Add contribution to self-energy... done
                               Timings
  MT wave-func. products:      0.18239
  PW wave-func. products:      0.42579
  Matrix-vector products:      0.64385
  Transformations:             0.16343
  Exchange self-energy:        0.06633
  Frequency integration:       0.03586
  Tetrahedron weights:         0.00000
  MPI idle time:               0.00002      0.00002
  Other:                       0.09097
  ------------------------------------
  Total:                       1.60865

=========

K point (   9 ):   0.00000   0.50000   0.50000

Coulomb matrix read from spex.cor
Inverse dielectric matrices read from spex.cor 
Hermiticity of transformed Coulomb matrix: 5.5E-11

Add contribution to self-energy... done
                               Timings
  MT wave-func. products:      0.18240
  PW wave-func. products:      0.40727
  Matrix-vector products:      1.03438
  Transformations:             0.16047
  Exchange self-energy:        0.06424
  Frequency integration:       0.03543
  Tetrahedron weights:         0.00000
  MPI idle time:               0.00002      0.00002
  Other:                       0.09033
  ------------------------------------
  Total:                       1.97455

=========

K point (  10 ):   0.25000   0.25000   0.00000

Coulomb matrix read from spex.cor
Inverse dielectric matrices read from spex.cor 
Hermiticity of transformed Coulomb matrix: 5.5E-11

Add contribution to self-energy... done
                               Timings
  MT wave-func. products:      0.32552
  PW wave-func. products:      0.76100
  Matrix-vector products:      1.95226
  Transformations:             0.31246
  Exchange self-energy:        0.09541
  Frequency integration:       0.07136
  Tetrahedron weights:         0.00000
  MPI idle time:               0.00002      0.00002
  Other:                       0.17487
  ------------------------------------
  Total:                       3.69289

=========

K point (  11 ):   0.25000   0.25000   0.25000

Coulomb matrix read from spex.cor
Inverse dielectric matrices read from spex.cor 
Hermiticity of transformed Coulomb matrix: 8.0E-11

Add contribution to self-energy... done
                               Timings
  MT wave-func. products:      0.32909
  PW wave-func. products:      0.80856
  Matrix-vector products:      2.07454
  Transformations:             0.32444
  Exchange self-energy:        0.10268
  Frequency integration:       0.07214
  Tetrahedron weights:         0.00000
  MPI idle time:               0.00004      0.00004
  Other:                       0.17783
  ------------------------------------
  Total:                       3.88932

=========

K point (  12 ):   0.25000   0.25000   0.50000

Coulomb matrix read from spex.cor
Inverse dielectric matrices read from spex.cor 
Hermiticity of transformed Coulomb matrix: 9.9E-11

Add contribution to self-energy... done
                               Timings
  MT wave-func. products:      0.33169
  PW wave-func. products:      0.82846
  Matrix-vector products:      3.82790
  Transformations:             0.32897
  Exchange self-energy:        0.10304
  Frequency integration:       0.07243
  Tetrahedron weights:         0.00000
  MPI idle time:               0.00002      0.00002
  Other:                       0.17023
  ------------------------------------
  Total:                       5.66274


### subroutine: exchange_core ###

        k point       band      exchange (core contribution)
  (0.989,0.989,0.000)   1     -1.6038403
  (0.989,0.989,0.000)   2     -7.6875992
  (0.989,0.989,0.000)   3    -17.7538986
  (0.989,0.989,0.000)   4    -17.7628211
  (0.989,0.989,0.000)   5    -17.7550386
  (0.989,0.989,0.000)   6    -17.9247532
  (0.989,0.989,0.000)   7    -17.9260796
  (0.989,0.989,0.000)   8    -18.4561056
  (0.989,0.989,0.000)   9    -18.4567942
  (0.989,0.989,0.000)  10    -18.6555511
Timing:   0.13




### subroutine: quasiparticle ###

Number of mesh points even: No constraint will be used.

List of k points
    0   0.98889   0.98889   0.00000  (additional) 



#####################
### K POINT:    0 ###
#####################


--- DIAGONAL ELEMENTS [eV] ---

 Bd       vxc    sigmax    sigmac         Z        KS        HF          GW lin/dir 
  1 -16.63572 -26.33755   8.14120   0.73647  -8.95221 -18.65403  -9.98004   1.07169 
                          1.24897  -0.09730                      -9.98661   1.05899 
  2 -26.96302 -38.12085   8.73835   0.72814  -8.05363 -19.21146  -9.78636   0.59662 
                          0.67706  -0.04283                      -9.73944   0.56793 
  3 -42.27202 -55.57571   9.50618   0.73649  -6.43394 -19.73763  -9.22957   0.11580 
                          0.07409  -0.01612                      -9.12976   0.14140 
  4 -42.29661 -55.60329   9.51245   0.73609  -6.41903 -19.72571  -9.21073   0.11555 
                          0.07358  -0.01618                      -9.11092   0.14146 
  5 -42.28298 -55.58656   9.51054   0.73609  -6.41815 -19.72173  -9.20897   0.11593 
                          0.07390  -0.01622                      -9.10924   0.14182 
  6 -42.55079 -55.87453   9.50580   0.73765  -6.35847 -19.68221  -9.17374   0.10827 
                          0.06814  -0.01519                      -9.07291   0.13379 
  7 -42.55340 -55.87797   9.50652   0.73765  -6.35810 -19.68267  -9.17345   0.10837 
                          0.06822  -0.01520                      -9.07263   0.13389 
  8 -43.35209 -56.70907   9.44157   0.74295  -6.16982 -19.52680  -9.07856   0.05268 
                          0.02678  -0.00837                      -8.96926   0.07694 
  9 -43.35331 -56.71063   9.44175   0.74295  -6.16957 -19.52689  -9.07843   0.05267 
                          0.02678  -0.00837                      -8.96912   0.07693 
 10 -43.72469 -57.13482   9.49344   0.74284  -6.07269 -19.48282  -8.98190   0.05857 
                          0.03084  -0.00910                      -8.87348   0.08326 

Timing (quasiparticle equation):   0.10580

Timing:        34
