########################
######### SPEX #########
########################
Version 05.00  (Sep  5, 2019)
Execution time: Jan 18, 2020  16:49:26
Hostname: Ontology
MPI: 3,1


### subroutine: getinput ###

Basic parameters:
  Number of spins            =  1
            centers          =  4
            types            =  2
            equivalent atoms =  2  2
  Lattice parameter =      1.00000
  Lattice vectors   =      3.01411  -5.22060   0.00000
                           3.01411   5.22060   0.00000
                           0.00000   0.00000   9.80579
  Unit-cell volume  =    308.59778
  Reciprocal cutoff =      4.60000

Unit-cell geometry:
  # Ty  El              Coord.
  1  1  Ga   0.33333  -0.33333   0.00000
  2  1  Ga  -0.33333   0.33333   0.50000
  3  2  N    0.33333  -0.33333  -0.37700
  4  2  N   -0.33333   0.33333   0.12300

Symmetry information:
  Number of symmetry operations = 24
   #  Det           Axis           Angle   Syp  Inv
   1    1     --     --     --      --     Yes   1
   2   -1    1.00  -0.58  -0.00   180.00   No    2
   3   -1    1.00   0.58  -0.00   180.00   No    3
   4    1    0.00   0.00   1.00   120.00   Yes   9
   5    1    0.00   0.00   1.00   180.00   No    5
   6   -1    0.58   1.00  -0.00   180.00   Yes   6
   7   -1    1.00  -0.00  -0.00   180.00   Yes   7
   8    1    0.00   0.00   1.00    60.00   No   11
   9    1   -0.00  -0.00  -1.00   120.00   Yes   4
  10   -1   -0.00   1.00  -0.00   180.00   No   10
  11    1   -0.00  -0.00  -1.00    60.00   No    8
  12   -1   -0.58   1.00  -0.00   180.00   Yes  12
  13 - 24  Time reversal symmetries

##################
### Input file ###
##################
BZ       4 4 4
JOB      GW +:(1-30)
MPIKPT   
RESTART  
NBAND    200
KPT      +=(.98077,1.00000,0)

#  k point is converted from (0.98077,1.00000,0.00000) to (0.98077,0.00000,0.00000)

Info: Simpson and Lagrange integration is used.

Radial mesh and basis functions:
  Number of radial grid points:       759  429
  Number of radial basis functions:    19   18
  Angular momentum quantum number:      8    6
  Maximal index:                        3

Core states:
  Atom type  1  (Ga)
  nl      Energy
  1s  -375.34991
  2s   -45.88297
  3s    -4.96076
  2p   -39.88207
  3p    -3.15226
  Atom type  2  (N )
  nl      Energy
  1s   -13.54409
  Number of valence electrons:   36

Average Coulomb potential: -0.35487  ( -9.65657 eV )

Read wavefunctions from harddisc... done   ( Timing:    0.28 )

Maximal energy difference in deg. subspaces: 1.9E-12
Minimal energy difference between subspaces: 3.1E-06

Wave functions:
  Number of bands:             198 -  200  (  200 )
            k points (IBZ):     64  (  12 /  30 )
            G vectors:         748
  k points of IBZ:
    1  (0.00000,0.00000,0.00000)  [ 0.00000, 0.00000, 0.00000 ]
    2  (0.00000,0.00000,0.25000)  [ 0.00000, 0.00000, 0.02550 ]
    3  (0.00000,0.00000,0.50000)  [ 0.00000, 0.00000, 0.05099 ]
    4  (0.00000,0.25000,0.00000)  [ 0.04147, 0.02394, 0.00000 ]
    5  (0.00000,0.25000,0.25000)  [ 0.04147, 0.02394, 0.02550 ]
    6  (0.00000,0.25000,0.50000)  [ 0.04147, 0.02394, 0.05099 ]
    7  (0.00000,0.50000,0.00000)  [ 0.08294, 0.04789, 0.00000 ]
    8  (0.00000,0.50000,0.25000)  [ 0.08294, 0.04789, 0.02550 ]
    9  (0.00000,0.50000,0.50000)  [ 0.08294, 0.04789, 0.05099 ]
   10  (0.25000,0.25000,0.00000)  [ 0.08294, 0.00000, 0.00000 ]
   11  (0.25000,0.25000,0.25000)  [ 0.08294, 0.00000, 0.02550 ]
   12  (0.25000,0.25000,0.50000)  [ 0.08294, 0.00000, 0.05099 ]
  k points of EIBZ (shifted set):
   65  (0.98077,0.00000,0.00000)  [ 0.16270,-0.09393, 0.00000 ]
   66  (0.98077,0.00000,0.25000)  [ 0.16270,-0.09393, 0.02550 ]
   67  (0.98077,0.00000,0.50000)  [ 0.16270,-0.09393, 0.05099 ]
   68  (0.98077,0.25000,0.00000)  [ 0.20417,-0.06999, 0.00000 ]
   69  (0.98077,0.25000,0.25000)  [ 0.20417,-0.06999, 0.02550 ]
   70  (0.98077,0.25000,0.50000)  [ 0.20417,-0.06999, 0.05099 ]
   71  (0.98077,0.50000,0.00000)  [ 0.24564,-0.04605, 0.00000 ]
   72  (0.98077,0.50000,0.25000)  [ 0.24564,-0.04605, 0.02550 ]
   73  (0.98077,0.50000,0.50000)  [ 0.24564,-0.04605, 0.05099 ]
   74  (0.98077,0.75000,0.00000)  [ 0.28711,-0.02210, 0.00000 ]
   75  (0.98077,0.75000,0.25000)  [ 0.28711,-0.02210, 0.02550 ]
   76  (0.98077,0.75000,0.50000)  [ 0.28711,-0.02210, 0.05099 ]
   77  (0.23077,0.00000,0.00000)  [ 0.03828,-0.02210, 0.00000 ]
   78  (0.23077,0.00000,0.25000)  [ 0.03828,-0.02210, 0.02550 ]
   79  (0.23077,0.00000,0.50000)  [ 0.03828,-0.02210, 0.05099 ]
   80  (0.23077,0.25000,0.00000)  [ 0.07975, 0.00184, 0.00000 ]
   81  (0.23077,0.25000,0.25000)  [ 0.07975, 0.00184, 0.02550 ]
   82  (0.23077,0.25000,0.50000)  [ 0.07975, 0.00184, 0.05099 ]
   83  (0.23077,0.50000,0.00000)  [ 0.12122, 0.02579, 0.00000 ]
   84  (0.23077,0.50000,0.25000)  [ 0.12122, 0.02579, 0.02550 ]
   85  (0.23077,0.50000,0.50000)  [ 0.12122, 0.02579, 0.05099 ]
   86  (0.48077,0.00000,0.00000)  [ 0.07975,-0.04605, 0.00000 ]
   87  (0.48077,0.00000,0.25000)  [ 0.07975,-0.04605, 0.02550 ]
   88  (0.48077,0.00000,0.50000)  [ 0.07975,-0.04605, 0.05099 ]
   89  (0.48077,0.25000,0.00000)  [ 0.12122,-0.02210, 0.00000 ]
   90  (0.48077,0.25000,0.25000)  [ 0.12122,-0.02210, 0.02550 ]
   91  (0.48077,0.25000,0.50000)  [ 0.12122,-0.02210, 0.05099 ]
   92  (0.73077,0.00000,0.00000)  [ 0.12122,-0.06999, 0.00000 ]
   93  (0.73077,0.00000,0.25000)  [ 0.12122,-0.06999, 0.02550 ]
   94  (0.73077,0.00000,0.50000)  [ 0.12122,-0.06999, 0.05099 ]

Generate wavefunctions at equivalent k points... done   ( Timing:   0.30 )

Size of array cpw:   209.8 MB
Size of array cmt:   260.9 MB

The system is not a metal.
The Fermi energy is placed in the center of the band gap.
KS energy gap:    0.07059528 Ha   (  1.92099521 eV )
Fermi energy:     0.29316457 Ha   (  7.97741378 eV )
Maximal energy:   5.57248232 Ha
Electron count error of the shifted k-point set:  0.0000000000000000

Wave-function checksum:  1.357256974789E-02


### subroutine: checkinput ###

Overlap <core|core>
Atom type  1
1s  1.000000
2s -0.000000  1.000000
3s  0.000000 -0.000001  0.999961
2p  0.999418
3p -0.000329  0.999458
Atom type  2
1s  0.999983

Overlap <core|basis>
Atom type  1
         u(s)    udot(s)
1s  0.000000  0.000000
2s  0.000001  0.000000
3s  0.004767 -0.007551
         u(p)    udot(p)
2p -0.000106 -0.000031
3p  0.017150 -0.021254
Atom type  2
         u(s)    udot(s)
1s  0.003209 -0.002046

Average overlap <core|val>
Atom type  1
1s  0.000000
2s  0.000000
3s  0.000679
2p  0.000010  0.000010  0.000010
3p  0.002211  0.002206  0.002211
Atom type  2
1s  0.000234

Maximum overlap <core|val> at (band/kpoint)
Atom type  1
1s  0.000000 (033/ 001)
2s  0.000001 (033/ 001)
3s  0.004367 (156/ 003)
2p  0.000057 (024/ 003)  0.000064 (024/ 065)  0.000060 (025/ 003)
3p  0.012047 (122/ 067)  0.014817 (111/ 001)  0.012047 (122/ 067)
Atom type  2
1s  0.001508 (002/ 070)

Overlap <basis|basis>
Atom type  1
   u(s)  1.000000
udot(s) -0.000000  0.129862
   u(p)  1.000000
udot(p) -0.000000  0.075237
   u(d)  1.000000
udot(d)  0.000000  0.733838
 ulo(d)  0.410292 -0.767526  1.000000
   u(f)  1.000000
udot(f)  0.000000  0.020278
   u(g)  1.000000
udot(g)  0.000000  0.006703
   u(h)  1.000000
udot(h) -0.000000  0.003149
   u(i)  1.000000
udot(i) -0.000000  0.001726
   u(j)  1.000000
udot(j) -0.000000  0.001039
   u(k)  1.000000
udot(k)  0.000000  0.000667
Atom type  2
   u(s)  1.000000
udot(s) -0.000000  0.023146
   u(p)  1.000000
udot(p)  0.000000  0.036192
   u(d)  1.000000
udot(d)  0.000000  0.003612
   u(f)  1.000000
udot(f) -0.000000  0.001183
   u(g)  1.000000
udot(g)  0.000000  0.000520
   u(h)  1.000000
udot(h) -0.000000  0.000271
   u(i)  1.000000
udot(i) -0.000000  0.000157


### subroutine: mixedbasis ( Mode: vv ) ###

Mixed basis
  Plane-wave basis:
    Number of unique G vectors:   357
    Maximal number of G vectors:  233

  MT basis read in from spex.mb (mode: vv).
    Total number of product-basis functions:  264



##### Job index:  1 #####


### subroutine: correlation ###

< GW self-energy >
Calculate periodic function...done   ( Timing:    0.04 )

=========

K point (   1 ):   0.00000   0.00000   0.00000

Coulomb matrix read from spex.cor
Inverse dielectric matrices read from spex.cor
Invert dielectric tensor... done   ( Timing:    0.02 )
Hermiticity of transformed Coulomb matrix: 5.1E-11

Add contribution to self-energy... done
                               Timings
  MT wave-func. products:      2.04257
  PW wave-func. products:      0.43968
  Matrix-vector products:      2.54996
  Transformations:             0.28826
  Exchange self-energy:        0.18245
  Frequency integration:       0.05450
  Tetrahedron weights:         0.00000
  Gamma-point correction:      0.43679
  MPI idle time:               0.00003      0.04587
  Other:                       0.10536
  ------------------------------------
  Total:                       6.09960

=========

K point (   2 ):   0.00000   0.00000   0.25000

Coulomb matrix read from spex.cor
Inverse dielectric matrices read from spex.cor
Hermiticity of transformed Coulomb matrix: 5.9E-10

Add contribution to self-energy... done
                               Timings
  MT wave-func. products:      1.92241
  PW wave-func. products:      0.41162
  Matrix-vector products:      2.43134
  Transformations:             0.26415
  Exchange self-energy:        0.16010
  Frequency integration:       0.03170
  Tetrahedron weights:         0.00000
  MPI idle time:               0.01247      0.01653
  Other:                       0.13416
  ------------------------------------
  Total:                       5.36796

=========

K point (   3 ):   0.00000   0.00000   0.50000

Coulomb matrix read from spex.cor
Inverse dielectric matrices read from spex.cor
Hermiticity of transformed Coulomb matrix: 1.8E-10

Add contribution to self-energy... done
                               Timings
  MT wave-func. products:      2.00961
  PW wave-func. products:      0.41844
  Matrix-vector products:      2.65116
  Transformations:             0.28653
  Exchange self-energy:        0.18434
  Frequency integration:       0.03423
  Tetrahedron weights:         0.00000
  MPI idle time:               0.00002      0.01119
  Other:                       0.10527
  ------------------------------------
  Total:                       5.68960

=========

K point (   4 ):   0.00000   0.25000   0.00000

Coulomb matrix read from spex.cor
Inverse dielectric matrices read from spex.cor
Hermiticity of transformed Coulomb matrix: 8.5E-11

Add contribution to self-energy... done
                               Timings
  MT wave-func. products:      3.62366
  PW wave-func. products:      1.03220
  Matrix-vector products:      9.96814
  Transformations:             1.15211
  Exchange self-energy:        0.29549
  Frequency integration:       0.13692
  Tetrahedron weights:         0.00000
  MPI idle time:               0.01765      0.05056
  Other:                       0.70229
  ------------------------------------
  Total:                      16.92847

=========

K point (   5 ):   0.00000   0.25000   0.25000

Coulomb matrix read from spex.cor
Inverse dielectric matrices read from spex.cor
Hermiticity of transformed Coulomb matrix: 9.7E-11

Add contribution to self-energy... done
                               Timings
  MT wave-func. products:      3.61881
  PW wave-func. products:      1.01219
  Matrix-vector products:      9.16088
  Transformations:             1.18552
  Exchange self-energy:        0.20078
  Frequency integration:       0.16478
  Tetrahedron weights:         0.00000
  MPI idle time:               0.03448      0.03448
  Other:                       0.66633
  ------------------------------------
  Total:                      16.04378

=========

K point (   6 ):   0.00000   0.25000   0.50000

Coulomb matrix read from spex.cor
Inverse dielectric matrices read from spex.cor
Hermiticity of transformed Coulomb matrix: 9.8E-11

Add contribution to self-energy... done
                               Timings
  MT wave-func. products:      3.73373
  PW wave-func. products:      0.94148
  Matrix-vector products:      9.45972
  Transformations:             1.19001
  Exchange self-energy:        0.27316
  Frequency integration:       0.16063
  Tetrahedron weights:         0.00000
  MPI idle time:               0.05687      0.05687
  Other:                       0.68232
  ------------------------------------
  Total:                      16.49792

=========

K point (   7 ):   0.00000   0.50000   0.00000

Coulomb matrix read from spex.cor
Inverse dielectric matrices read from spex.cor
Hermiticity of transformed Coulomb matrix: 1.0E-10

Add contribution to self-energy... done
                               Timings
  MT wave-func. products:      2.23905
  PW wave-func. products:      0.59441
  Matrix-vector products:      4.32210
  Transformations:             0.54469
  Exchange self-energy:        0.24232
  Frequency integration:       0.06057
  Tetrahedron weights:         0.00000
  MPI idle time:               0.02121      0.02121
  Other:                       0.26942
  ------------------------------------
  Total:                       8.29379

=========

K point (   8 ):   0.00000   0.50000   0.25000

Coulomb matrix read from spex.cor
Inverse dielectric matrices read from spex.cor
Hermiticity of transformed Coulomb matrix: 5.3E-11

Add contribution to self-energy... done
                               Timings
  MT wave-func. products:      2.15963
  PW wave-func. products:      0.50690
  Matrix-vector products:      3.85313
  Transformations:             0.51144
  Exchange self-energy:        0.16917
  Frequency integration:       0.08633
  Tetrahedron weights:         0.00000
  MPI idle time:               0.00669      0.03165
  Other:                       0.29682
  ------------------------------------
  Total:                       7.59010

=========

K point (   9 ):   0.00000   0.50000   0.50000

Coulomb matrix read from spex.cor
Inverse dielectric matrices read from spex.cor
Hermiticity of transformed Coulomb matrix: 4.1E-11

Add contribution to self-energy... done
                               Timings
  MT wave-func. products:      2.33326
  PW wave-func. products:      0.58992
  Matrix-vector products:      4.81758
  Transformations:             0.54618
  Exchange self-energy:        0.14436
  Frequency integration:       0.12625
  Tetrahedron weights:         0.00000
  MPI idle time:               0.01276      0.01276
  Other:                       0.39082
  ------------------------------------
  Total:                       8.96114

=========

K point (  10 ):   0.25000   0.25000   0.00000

Coulomb matrix read from spex.cor
Inverse dielectric matrices read from spex.cor
Hermiticity of transformed Coulomb matrix: 3.6E-11

Add contribution to self-energy... done
                               Timings
  MT wave-func. products:      2.87248
  PW wave-func. products:      0.77415
  Matrix-vector products:      6.58858
  Transformations:             0.86075
  Exchange self-energy:        0.19414
  Frequency integration:       0.11897
  Tetrahedron weights:         0.00000
  MPI idle time:               0.03432      0.03432
  Other:                       0.50014
  ------------------------------------
  Total:                      11.94355

=========

K point (  11 ):   0.25000   0.25000   0.25000

Coulomb matrix read from spex.cor
Inverse dielectric matrices read from spex.cor
Hermiticity of transformed Coulomb matrix: 5.4E-11

Add contribution to self-energy... done
                               Timings
  MT wave-func. products:      3.03758
  PW wave-func. products:      0.82897
  Matrix-vector products:      6.90475
  Transformations:             0.82406
  Exchange self-energy:        0.18761
  Frequency integration:       0.17252
  Tetrahedron weights:         0.00000
  MPI idle time:               0.02305      0.02305
  Other:                       0.48959
  ------------------------------------
  Total:                      12.46814

=========

K point (  12 ):   0.25000   0.25000   0.50000

Coulomb matrix read from spex.cor
Inverse dielectric matrices read from spex.cor
Hermiticity of transformed Coulomb matrix: 6.5E-11

Add contribution to self-energy... done
                               Timings
  MT wave-func. products:      2.97160
  PW wave-func. products:      0.73787
  Matrix-vector products:     10.70634
  Transformations:             0.82533
  Exchange self-energy:        0.21634
  Frequency integration:       0.20903
  Tetrahedron weights:         0.00000
  MPI idle time:               0.03987      0.03987
  Other:                       0.66613
  ------------------------------------
  Total:                      16.37252


### subroutine: exchange_core ###

        k point       band      exchange (core contribution)
  (0.981,0.000,0.000)   1     -1.6038308
  (0.981,0.000,0.000)   2     -7.6875590
  (0.981,0.000,0.000)   3    -17.7538945
  (0.981,0.000,0.000)   4    -17.7628208
  (0.981,0.000,0.000)   5    -17.7548814
  (0.981,0.000,0.000)   6    -17.9247486
  (0.981,0.000,0.000)   7    -17.9260522
  (0.981,0.000,0.000)   8    -18.4559927
  (0.981,0.000,0.000)   9    -18.4567921
  (0.981,0.000,0.000)  10    -18.6555567
  (0.981,0.000,0.000)  11    -18.6582331
  (0.981,0.000,0.000)  12    -12.6587445
  (0.981,0.000,0.000)  13     -1.2966679
  (0.981,0.000,0.000)  14     -1.8878585
  (0.981,0.000,0.000)  15     -1.8835574
  (0.981,0.000,0.000)  16     -2.1875596
  (0.981,0.000,0.000)  17     -2.1431087
  (0.981,0.000,0.000)  18     -2.1994975
  (0.981,0.000,0.000)  19     -2.1003988
  (0.981,0.000,0.000)  20     -2.3322649
  (0.981,0.000,0.000)  21     -1.2064302
  (0.981,0.000,0.000)  22     -1.9884712
  (0.981,0.000,0.000)  23     -1.9950618
  (0.981,0.000,0.000)  24     -1.9909300
  (0.981,0.000,0.000)  25     -1.9944373
  (0.981,0.000,0.000)  26     -1.9999670
  (0.981,0.000,0.000)  27     -1.0305326
  (0.981,0.000,0.000)  28     -1.6345375
  (0.981,0.000,0.000)  29     -1.5941394
  (0.981,0.000,0.000)  30     -0.9786278
Timing:   0.09




### subroutine: quasiparticle ###

Number of mesh points even: No constraint will be used.

List of k points
    0   0.98077   0.00000   0.00000  (additional)



#####################
### K POINT:    0 ###
#####################


--- DIAGONAL ELEMENTS [eV] ---

 Bd       vxc    sigmax    sigmac         Z        KS        HF          GW lin/dir
  1 -16.63570 -26.33752   8.14122   0.73647  -8.95222 -18.65404  -9.98002   1.07171
                          1.24899  -0.09731                      -9.98658   1.05901
  2 -26.96295 -38.12079   8.73834   0.72815  -8.05364 -19.21148  -9.78639   0.59664
                          0.67708  -0.04283                      -9.73947   0.56794
  3 -42.27201 -55.57569   9.50618   0.73649  -6.43394 -19.73762  -9.22956   0.11579
                          0.07409  -0.01612                      -9.12975   0.14140
  4 -42.29661 -55.60327   9.51241   0.73609  -6.41903 -19.72569  -9.21075   0.11555
                          0.07358  -0.01618                      -9.11094   0.14146
  5 -42.28267 -55.58624   9.51051   0.73609  -6.41816 -19.72174  -9.20900   0.11592
                          0.07389  -0.01622                      -9.10927   0.14182
  6 -42.55079 -55.87451   9.50580   0.73765  -6.35847 -19.68219  -9.17373   0.10827
                          0.06814  -0.01519                      -9.07290   0.13379
  7 -42.55337 -55.87790   9.50648   0.73765  -6.35812 -19.68265  -9.17347   0.10837
                          0.06823  -0.01520                      -9.07265   0.13389
  8 -43.35188 -56.70884   9.44154   0.74295  -6.16984 -19.52680  -9.07858   0.05268
                          0.02678  -0.00837                      -8.96928   0.07694
  9 -43.35331 -56.71061   9.44172   0.74295  -6.16957 -19.52688  -9.07845   0.05267
                          0.02678  -0.00837                      -8.96914   0.07693
 10 -43.72470 -57.13482   9.49343   0.74284  -6.07269 -19.48281  -8.98190   0.05857
                          0.03084  -0.00910                      -8.87348   0.08326
 11 -43.72954 -57.14055   9.49392   0.74285  -6.07196 -19.48297  -8.98150   0.05851
                          0.03080  -0.00910                      -8.87305   0.08319
 12 -34.77926 -46.30980   8.71482   0.73699  -4.83303 -16.36357  -6.88592   0.43626
                          0.34675  -0.06418                      -6.89761   0.45451
 13 -14.52162 -20.13061   4.33041   0.72964   0.01395  -5.59504  -0.91617   0.10819
                          0.09890  -0.02818                      -0.90320   0.11211
 14 -18.91667 -22.96241   3.18077   0.77050   5.96184   1.91611   5.29539   0.00107
                          0.00060  -0.00070                       5.30008   0.00136
 15 -18.93893 -22.98922   3.18715   0.77040   5.98232   1.93202   5.31735   0.00105
                          0.00060  -0.00069                       5.32202   0.00134
 16 -20.09635 -23.67887   2.89937   0.77437   6.96785   3.38533   6.43884   0.00071
                          0.00052  -0.00045                       6.44137   0.00079
 17 -20.07015 -23.56427   2.83481   0.77479   6.98547   3.49136   6.47465   0.00070
                          0.00054  -0.00042                       6.47695   0.00074
 18 -20.21205 -23.93905   3.01832   0.77342   7.01396   3.28696   6.46586   0.00073
                          0.00051  -0.00048                       6.46864   0.00083
 19 -15.72108 -11.34713  -3.57790   0.79808   8.97876  13.35272   9.61413   0.00167
                          0.00851  -0.00643                       9.61397   0.00044
 20 -15.20292  -9.91816  -4.26948   0.80950  11.31291  16.59767  12.13479   0.00168
                          0.00342  -0.00107                      12.12869  -0.00035
 21 -15.69595  -8.89925  -5.52814   0.75630  16.27104  23.06774  17.22973  -0.05351
                         -0.04165  -0.01735                      17.21884  -0.05761
 22 -13.55771  -7.64662  -4.93679   0.80873  16.91318  22.82428  17.70079  -0.03466
                         -0.02799  -0.01234                      17.69515  -0.03645
 23 -13.58508  -7.66341  -4.94262   0.80853  16.95818  22.87984  17.74941  -0.03506
                         -0.02832  -0.01242                      17.74372  -0.03687
 24 -13.81845  -7.65254  -5.10149   0.80389  17.81783  23.98374  18.67294  -0.04591
                         -0.03725  -0.01500                      18.66605  -0.04827
 25 -14.44649  -7.92707  -5.36477   0.79112  18.74217  25.26158  19.65451  -0.06798
                         -0.05744  -0.01952                      19.64604  -0.07091
 26 -14.46556  -7.93845  -5.36929   0.79095  18.77386  25.30097  19.68850  -0.06841
                         -0.05779  -0.01960                      19.67998  -0.07135
 27 -10.34060  -4.27048  -5.68006   0.79698  21.59936  27.66948  21.90302  -0.15255
                         -0.17074  -0.04223                      21.90166  -0.15219
 28 -13.12104  -7.05141  -5.31253   0.79926  22.65369  28.72333  23.25427  -0.13728
                         -0.14126  -0.03220                      23.25063  -0.13785
 29 -12.88848  -6.79032  -5.37570   0.79793  22.72836  28.82652  23.29943  -0.14959
                         -0.15618  -0.03456                      23.29602  -0.14998
 30 -10.71510  -4.43595  -5.93671   0.78580  24.87949  31.15864  25.12776  -0.29294
                         -0.34662  -0.06007                      25.12675  -0.29168

Timing (quasiparticle equation):   0.43965

Timing:       134
