{
   "url":"www.flapw.de/collect.pl",
   "calculation-id":"D64352C50171535D",
   "data": {
        "Error":"inp.xml-file exists. Cannot write another input file in this directory.",
        "cpu_model":"1",
        "cpu_modelname":"AMD Ryzen 5 1600X Six-Core Processor",
        "VmPeak":329536,
        "VmSize":329536,
        "VmData":263660,
        "VmStk":132,
        "VmExe":988,
        "VmSwap":0
      }
}
