{
   "timername" : "Total Run",
   "totaltime" : 69.16839,
   "subtimers": [
      {
         "timername" : "Initialization",
         "totaltime" : 6.4234E-02,
         "mintime"   : 6.4234E-02,
         "maxtime"   : 6.4234E-02,
         "ncalls"    : 1,
         "subtimers": [
            {
               "timername" : "r_inpXML",
               "totaltime" : 8.8770E-03,
               "mintime"   : 8.8770E-03,
               "maxtime"   : 8.8770E-03,
               "ncalls"    : 1
            },
            {
               "timername" : "postprocessInput",
               "totaltime" : 3.0677E-02,
               "mintime"   : 3.0677E-02,
               "maxtime"   : 3.0677E-02,
               "ncalls"    : 1,
               "subtimers": [
                  {
                     "timername" : "strgn",
                     "totaltime" : 7.3881E-03,
                     "mintime"   : 7.3881E-03,
                     "maxtime"   : 7.3881E-03,
                     "ncalls"    : 1
                  },
                  {
                     "timername" : "stepf",
                     "totaltime" : 1.3640E-03,
                     "mintime"   : 1.3640E-03,
                     "maxtime"   : 1.3640E-03,
                     "ncalls"    : 1
                  }
               ]
            }
         ]
      },
      {
         "timername" : "Qfix",
         "totaltime" : 4.4780E-03,
         "mintime"   : 4.4780E-03,
         "maxtime"   : 4.4780E-03,
         "ncalls"    : 1,
         "subtimers": [
            {
               "timername" : "cdntot",
               "totaltime" : 4.4510E-03,
               "mintime"   : 4.4510E-03,
               "maxtime"   : 4.4510E-03,
               "ncalls"    : 1,
               "subtimers": [
                  {
                     "timername" : "MT",
                     "totaltime" : 3.5760E-03,
                     "mintime"   : 3.5760E-03,
                     "maxtime"   : 3.5760E-03,
                     "ncalls"    : 1
                  }
               ]
            }
         ]
      },
      {
         "timername" : "Open file/memory for IO of eig",
         "totaltime" : 2.0027E-05,
         "mintime"   : 2.0027E-05,
         "maxtime"   : 2.0027E-05,
         "ncalls"    : 1
      },
      {
         "timername" : "Iteration",
         "totaltime" : 69.09378,
         "mintime"   : 1.0000E+99,
         "maxtime"   : 0.0000E+00,
         "ncalls"    : 0,
         "subtimers": [
            {
               "timername" : "generation of potential",
               "totaltime" : 0.27295,
               "mintime"   : 0.27295,
               "maxtime"   : 0.27295,
               "ncalls"    : 1,
               "subtimers": [
                  {
                     "timername" : "psqpw",
                     "totaltime" : 2.1633E-02,
                     "mintime"   : 2.1633E-02,
                     "maxtime"   : 2.1633E-02,
                     "ncalls"    : 1
                  },
                  {
                     "timername" : "interstitial",
                     "totaltime" : 9.0599E-06,
                     "mintime"   : 9.0599E-06,
                     "maxtime"   : 9.0599E-06,
                     "ncalls"    : 1
                  },
                  {
                     "timername" : "MT-spheres",
                     "totaltime" : 1.1889E-02,
                     "mintime"   : 1.1889E-02,
                     "maxtime"   : 1.1889E-02,
                     "ncalls"    : 1
                  },
                  {
                     "timername" : "den-pot integrals",
                     "totaltime" : 1.1461E-02,
                     "mintime"   : 1.1461E-02,
                     "maxtime"   : 1.1461E-02,
                     "ncalls"    : 1
                  },
                  {
                     "timername" : "Vxc in interstitial",
                     "totaltime" : 3.3517E-02,
                     "mintime"   : 3.3517E-02,
                     "maxtime"   : 3.3517E-02,
                     "ncalls"    : 1
                  },
                  {
                     "timername" : "Vxc in MT",
                     "totaltime" : 0.19334,
                     "mintime"   : 0.19334,
                     "maxtime"   : 0.19334,
                     "ncalls"    : 1
                  }
               ]
            },
            {
               "timername" : "gen. of hamil. and diag. (tota",
               "totaltime" : 34.65497,
               "mintime"   : 34.65497,
               "maxtime"   : 34.65497,
               "ncalls"    : 1,
               "subtimers": [
                  {
                     "timername" : "eigen",
                     "totaltime" : 34.65497,
                     "mintime"   : 34.65497,
                     "maxtime"   : 34.65497,
                     "ncalls"    : 1,
                     "subtimers": [
                        {
                           "timername" : "Updating energy parameters",
                           "totaltime" : 0.18400,
                           "mintime"   : 0.18400,
                           "maxtime"   : 0.18400,
                           "ncalls"    : 1
                        },
                        {
                           "timername" : "tlmplm",
                           "totaltime" : 8.9428E-03,
                           "mintime"   : 8.9428E-03,
                           "maxtime"   : 8.9428E-03,
                           "ncalls"    : 1
                        },
                        {
                           "timername" : "Setup of H&S matrices",
                           "totaltime" : 5.86055,
                           "mintime"   : 1.8281E-02,
                           "maxtime"   : 3.4488E-02,
                           "ncalls"    : 241,
                           "subtimers": [
                              {
                                 "timername" : "Interstitial part",
                                 "totaltime" : 0.36052,
                                 "mintime"   : 1.2701E-03,
                                 "maxtime"   : 2.1670E-03,
                                 "ncalls"    : 241
                              },
                              {
                                 "timername" : "MT part",
                                 "totaltime" : 4.37481,
                                 "mintime"   : 1.5485E-02,
                                 "maxtime"   : 2.2721E-02,
                                 "ncalls"    : 241,
                                 "subtimers": [
                                    {
                                       "timername" : "fjgj coefficients",
                                       "totaltime" : 5.0678E-02,
                                       "mintime"   : 7.4863E-05,
                                       "maxtime"   : 1.1721E-03,
                                       "ncalls"    : 482
                                    },
                                    {
                                       "timername" : "spherical setup",
                                       "totaltime" : 1.69024,
                                       "mintime"   : 2.7361E-03,
                                       "maxtime"   : 4.5390E-03,
                                       "ncalls"    : 482
                                    },
                                    {
                                       "timername" : "non-spherical setup",
                                       "totaltime" : 2.37147,
                                       "mintime"   : 2.5411E-03,
                                       "maxtime"   : 9.9869E-03,
                                       "ncalls"    : 482
                                    },
                                    {
                                       "timername" : "LO setup",
                                       "totaltime" : 0.25952,
                                       "mintime"   : 0.0000E+00,
                                       "maxtime"   : 1.7831E-03,
                                       "ncalls"    : 482
                                    }
                                 ]
                              },
                              {
                                 "timername" : "Matrix redistribution",
                                 "totaltime" : 0.52095,
                                 "mintime"   : 8.0299E-04,
                                 "maxtime"   : 6.9299E-03,
                                 "ncalls"    : 241
                              }
                           ]
                        },
                        {
                           "timername" : "Diagonalization",
                           "totaltime" : 28.11681,
                           "mintime"   : 8.7353E-02,
                           "maxtime"   : 0.15108,
                           "ncalls"    : 241
                        },
                        {
                           "timername" : "EV output",
                           "totaltime" : 0.37404,
                           "mintime"   : 7.6818E-04,
                           "maxtime"   : 3.6180E-03,
                           "ncalls"    : 241,
                           "subtimers": [
                              {
                                 "timername" : "IO (write)",
                                 "totaltime" : 0.35035,
                                 "mintime"   : 6.3801E-04,
                                 "maxtime"   : 3.5200E-03,
                                 "ncalls"    : 241
                              }
                           ]
                        }
                     ]
                  }
               ]
            },
            {
               "timername" : "determination of fermi energy",
               "totaltime" : 0.13671,
               "mintime"   : 0.13671,
               "maxtime"   : 0.13671,
               "ncalls"    : 1,
               "subtimers": [
                  {
                     "timername" : "IO (read)",
                     "totaltime" : 6.4182E-04,
                     "mintime"   : 0.0000E+00,
                     "maxtime"   : 1.0014E-05,
                     "ncalls"    : 241
                  },
                  {
                     "timername" : "IO (write)",
                     "totaltime" : 1.2946E-04,
                     "mintime"   : 0.0000E+00,
                     "maxtime"   : 2.8610E-06,
                     "ncalls"    : 241
                  }
               ]
            },
            {
               "timername" : "generation of new charge densi",
               "totaltime" : 34.02936,
               "mintime"   : 1.0000E+99,
               "maxtime"   : 0.0000E+00,
               "ncalls"    : 0,
               "subtimers": [
                  {
                     "timername" : "cdnval",
                     "totaltime" : 33.85381,
                     "mintime"   : 33.85381,
                     "maxtime"   : 33.85381,
                     "ncalls"    : 1,
                     "subtimers": [
                        {
                           "timername" : "IO (read)",
                           "totaltime" : 0.19651,
                           "mintime"   : 2.0409E-04,
                           "maxtime"   : 2.5220E-03,
                           "ncalls"    : 241
                        },
                        {
                           "timername" : "pwden",
                           "totaltime" : 20.46198,
                           "mintime"   : 7.6127E-02,
                           "maxtime"   : 9.4786E-02,
                           "ncalls"    : 241
                        },
                        {
                           "timername" : "abcof",
                           "totaltime" : 11.59805,
                           "mintime"   : 4.2866E-02,
                           "maxtime"   : 5.5772E-02,
                           "ncalls"    : 241
                        },
                        {
                           "timername" : "cdnval: rhomt",
                           "totaltime" : 2.8041E-02,
                           "mintime"   : 8.6069E-05,
                           "maxtime"   : 2.6917E-04,
                           "ncalls"    : 241
                        },
                        {
                           "timername" : "cdnval: rhonmt",
                           "totaltime" : 1.09818,
                           "mintime"   : 3.9780E-03,
                           "maxtime"   : 7.4360E-03,
                           "ncalls"    : 241
                        },
                        {
                           "timername" : "cdnval: rho(n)mtlo",
                           "totaltime" : 0.13082,
                           "mintime"   : 4.6802E-04,
                           "maxtime"   : 8.2207E-04,
                           "ncalls"    : 241
                        },
                        {
                           "timername" : "mpi_col_den",
                           "totaltime" : 1.2221E-02,
                           "mintime"   : 1.2221E-02,
                           "maxtime"   : 1.2221E-02,
                           "ncalls"    : 1
                        },
                        {
                           "timername" : "cdnmt",
                           "totaltime" : 5.5270E-03,
                           "mintime"   : 5.5270E-03,
                           "maxtime"   : 5.5270E-03,
                           "ncalls"    : 1
                        }
                     ]
                  },
                  {
                     "timername" : "cdngen: dos",
                     "totaltime" : 0.14474,
                     "mintime"   : 0.14474,
                     "maxtime"   : 0.14474,
                     "ncalls"    : 1
                  }
               ]
            }
         ]
      }
   ]
}
