########################
######### SPEX #########
########################
Version 05.00  (Sep  5, 2019)
Execution time: Jan 16, 2020  16:42:36
Hostname: login18-1.hpc.itc.rwth-aachen.de
MPI: 1,1


### subroutine: getinput ###

Basic parameters:
  Number of spins            =  1
            centers          =  4
            types            =  2
            equivalent atoms =  2  2
  Lattice parameter =      1.00000
  Lattice vectors   =      3.01411  -5.22060   0.00000
                           3.01411   5.22060   0.00000
                           0.00000   0.00000   9.80579
  Unit-cell volume  =    308.59778
  Reciprocal cutoff =      4.60000

Unit-cell geometry:
  # Ty  El              Coord.
  1  1  Ga   0.33333  -0.33333   0.00000
  2  1  Ga  -0.33333   0.33333   0.50000
  3  2  N    0.33333  -0.33333  -0.37700
  4  2  N   -0.33333   0.33333   0.12300

Symmetry information:
  Number of symmetry operations = 24
   #  Det           Axis           Angle   Syp  Inv
   1    1     --     --     --      --     Yes   1
   2   -1    1.00  -0.58   0.00   180.00   No    2
   3   -1    1.00   0.58   0.00   180.00   No    3
   4    1    0.00   0.00   1.00   120.00   Yes   9
   5    1    0.00   0.00   1.00   180.00   No    5
   6   -1    0.58   1.00   0.00   180.00   Yes   6
   7   -1    1.00   0.00   0.00   180.00   Yes   7
   8    1    0.00   0.00   1.00    60.00   No   11
   9    1    0.00   0.00  -1.00   120.00   Yes   4
  10   -1    0.00   1.00   0.00   180.00   No   10
  11    1    0.00   0.00  -1.00    60.00   No    8
  12   -1   -0.58   1.00   0.00   180.00   Yes  12
  13 - 24  Time reversal symmetries

##################
### Input file ###
##################
BZ       4 4 4
JOB      GW +:(1-10)
NBAND    200
RESTART  
KPT      +=(0,.26923,0)
 

Info: Simpson and Lagrange integration is used.

Radial mesh and basis functions:
  Number of radial grid points:       759  429
  Number of radial basis functions:    19   18
  Angular momentum quantum number:      8    6
  Maximal index:                        3

Core states:
  Atom type  1  (Ga)
  nl      Energy
  1s  -375.34991
  2s   -45.88297
  3s    -4.96076
  2p   -39.88207
  3p    -3.15226
  Atom type  2  (N )
  nl      Energy
  1s   -13.54409
  Number of valence electrons:   36

Average Coulomb potential: -0.35487  ( -9.65657 eV )

Read wavefunctions from harddisc... done   ( Timing:    0.23 )

Maximal energy difference in deg. subspaces: 1.1E-12
Minimal energy difference between subspaces: 3.1E-06

Wave functions:
  Number of bands:             198 -  200  (  200 )
            k points (IBZ):     64  (  12 /  30 )
            G vectors:         721
  k points of IBZ:
    1  (0.00000,0.00000,0.00000)  [ 0.00000, 0.00000, 0.00000 ]
    2  (0.00000,0.00000,0.25000)  [ 0.00000, 0.00000, 0.02550 ]
    3  (0.00000,0.00000,0.50000)  [ 0.00000, 0.00000, 0.05099 ]
    4  (0.00000,0.25000,0.00000)  [ 0.04147, 0.02394, 0.00000 ]
    5  (0.00000,0.25000,0.25000)  [ 0.04147, 0.02394, 0.02550 ]
    6  (0.00000,0.25000,0.50000)  [ 0.04147, 0.02394, 0.05099 ]
    7  (0.00000,0.50000,0.00000)  [ 0.08294, 0.04789, 0.00000 ]
    8  (0.00000,0.50000,0.25000)  [ 0.08294, 0.04789, 0.02550 ]
    9  (0.00000,0.50000,0.50000)  [ 0.08294, 0.04789, 0.05099 ]
   10  (0.25000,0.25000,0.00000)  [ 0.08294, 0.00000, 0.00000 ]
   11  (0.25000,0.25000,0.25000)  [ 0.08294, 0.00000, 0.02550 ]
   12  (0.25000,0.25000,0.50000)  [ 0.08294, 0.00000, 0.05099 ]
  k points of EIBZ (shifted set):
   65  (0.00000,0.26923,0.00000)  [ 0.04466, 0.02579, 0.00000 ]
   66  (0.00000,0.26923,0.25000)  [ 0.04466, 0.02579, 0.02550 ]
   67  (0.00000,0.26923,0.50000)  [ 0.04466, 0.02579, 0.05099 ]
   68  (0.00000,0.51923,0.00000)  [ 0.08613, 0.04973, 0.00000 ]
   69  (0.00000,0.51923,0.25000)  [ 0.08613, 0.04973, 0.02550 ]
   70  (0.00000,0.51923,0.50000)  [ 0.08613, 0.04973, 0.05099 ]
   71  (0.00000,0.76923,0.00000)  [ 0.12760, 0.07367, 0.00000 ]
   72  (0.00000,0.76923,0.25000)  [ 0.12760, 0.07367, 0.02550 ]
   73  (0.00000,0.76923,0.50000)  [ 0.12760, 0.07367, 0.05099 ]
   74  (0.00000,0.01923,0.00000)  [ 0.00319, 0.00184, 0.00000 ]
   75  (0.00000,0.01923,0.25000)  [ 0.00319, 0.00184, 0.02550 ]
   76  (0.00000,0.01923,0.50000)  [ 0.00319, 0.00184, 0.05099 ]
   77  (0.25000,0.26923,0.00000)  [ 0.08613, 0.00184, 0.00000 ]
   78  (0.25000,0.26923,0.25000)  [ 0.08613, 0.00184, 0.02550 ]
   79  (0.25000,0.26923,0.50000)  [ 0.08613, 0.00184, 0.05099 ]
   80  (0.25000,0.51923,0.00000)  [ 0.12760, 0.02579, 0.00000 ]
   81  (0.25000,0.51923,0.25000)  [ 0.12760, 0.02579, 0.02550 ]
   82  (0.25000,0.51923,0.50000)  [ 0.12760, 0.02579, 0.05099 ]
   83  (0.25000,0.76923,0.00000)  [ 0.16908, 0.04973, 0.00000 ]
   84  (0.25000,0.76923,0.25000)  [ 0.16908, 0.04973, 0.02550 ]
   85  (0.25000,0.76923,0.50000)  [ 0.16908, 0.04973, 0.05099 ]
   86  (0.25000,0.01923,0.00000)  [ 0.04466,-0.02210, 0.00000 ]
   87  (0.25000,0.01923,0.25000)  [ 0.04466,-0.02210, 0.02550 ]
   88  (0.25000,0.01923,0.50000)  [ 0.04466,-0.02210, 0.05099 ]
   89  (0.50000,0.26923,0.00000)  [ 0.12760,-0.02210, 0.00000 ]
   90  (0.50000,0.26923,0.25000)  [ 0.12760,-0.02210, 0.02550 ]
   91  (0.50000,0.26923,0.50000)  [ 0.12760,-0.02210, 0.05099 ]
   92  (0.50000,0.51923,0.00000)  [ 0.16908, 0.00184, 0.00000 ]
   93  (0.50000,0.51923,0.25000)  [ 0.16908, 0.00184, 0.02550 ]
   94  (0.50000,0.51923,0.50000)  [ 0.16908, 0.00184, 0.05099 ]

Generate wavefunctions at equivalent k points... done   ( Timing:   0.32 )

Size of array cpw:   209.8 MB
Size of array cmt:   260.9 MB

The system is not a metal.
The Fermi energy is placed in the center of the band gap.
KS energy gap:    0.07059528 Ha   (  1.92099521 eV )
Fermi energy:     0.29316457 Ha   (  7.97741378 eV )
Maximal energy:   5.57248232 Ha
Electron count error of the shifted k-point set:  0.0000000000000000

Wave-function checksum: -6.383984614991E-02


### subroutine: checkinput ###

Overlap <core|core>
Atom type  1
1s  1.000000 
2s -0.000000  1.000000 
3s  0.000000 -0.000001  0.999961 
2p  0.999418 
3p -0.000329  0.999458 
Atom type  2
1s  0.999983 

Overlap <core|basis>
Atom type  1
         u(s)    udot(s)
1s  0.000000  0.000000 
2s  0.000001  0.000000 
3s  0.004767 -0.007551 
         u(p)    udot(p)
2p -0.000106 -0.000031 
3p  0.017150 -0.021254 
Atom type  2
         u(s)    udot(s)
1s  0.003209 -0.002046 

Average overlap <core|val>
Atom type  1
1s  0.000000
2s  0.000000
3s  0.000679
2p  0.000010  0.000010  0.000010
3p  0.002211  0.002206  0.002211
Atom type  2
1s  0.000234

Maximum overlap <core|val> at (band/kpoint)
Atom type  1
1s  0.000000 (022/ 009)
2s  0.000001 (022/ 009)
3s  0.004021 (098/ 070)
2p  0.000060 (025/ 003)  0.000064 (024/ 074)  0.000067 (026/ 003)
3p  0.012494 (122/ 003)  0.014817 (111/ 001)  0.013262 (124/ 003)
Atom type  2
1s  0.001586 (001/ 076)

Overlap <basis|basis>
Atom type  1
   u(s)  1.000000 
udot(s)  0.000000  0.129862 
   u(p)  1.000000 
udot(p) -0.000000  0.075237 
   u(d)  1.000000 
udot(d) -0.000000  0.733838 
 ulo(d)  0.410292 -0.767526  1.000000 
   u(f)  1.000000 
udot(f) -0.000000  0.020278 
   u(g)  1.000000 
udot(g) -0.000000  0.006703 
   u(h)  1.000000 
udot(h)  0.000000  0.003149 
   u(i)  1.000000 
udot(i) -0.000000  0.001726 
   u(j)  1.000000 
udot(j)  0.000000  0.001039 
   u(k)  1.000000 
udot(k) -0.000000  0.000667 
Atom type  2
   u(s)  1.000000 
udot(s)  0.000000  0.023146 
   u(p)  1.000000 
udot(p)  0.000000  0.036192 
   u(d)  1.000000 
udot(d)  0.000000  0.003612 
   u(f)  1.000000 
udot(f)  0.000000  0.001183 
   u(g)  1.000000 
udot(g)  0.000000  0.000520 
   u(h)  1.000000 
udot(h) -0.000000  0.000271 
   u(i)  1.000000 
udot(i)  0.000000  0.000157 


### subroutine: mixedbasis ( Mode: vv ) ###

Mixed basis
  Plane-wave basis:
    Number of unique G vectors:   338
    Maximal number of G vectors:  233

  MT basis read in from spex.mb (mode: vv).
    Total number of product-basis functions:  264



##### Job index:  1 #####


### subroutine: correlation ###

< GW self-energy >
Calculate periodic function...done   ( Timing:    0.09 )

=========

K point (   1 ):   0.00000   0.00000   0.00000

Coulomb matrix read from spex.cor
Inverse dielectric matrices read from spex.cor 
Invert dielectric tensor... done   ( Timing:    0.02 )
Hermiticity of transformed Coulomb matrix: 6.8E-11

Add contribution to self-energy... done
                               Timings
  MT wave-func. products:      0.12251
  PW wave-func. products:      0.26970
  Matrix-vector products:      0.37522
  Transformations:             0.09042
  Exchange self-energy:        0.07267
  Frequency integration:       0.01980
  Tetrahedron weights:         0.00000
  Gamma-point correction:      1.46146
  MPI idle time:               0.00004      0.00004
  Other:                       0.05780
  ------------------------------------
  Total:                       2.46961

=========

K point (   2 ):   0.00000   0.00000   0.25000

Coulomb matrix read from spex.cor
Inverse dielectric matrices read from spex.cor 
Hermiticity of transformed Coulomb matrix: 8.7E-10

Add contribution to self-energy... done
                               Timings
  MT wave-func. products:      0.12514
  PW wave-func. products:      0.26387
  Matrix-vector products:      0.36081
  Transformations:             0.08679
  Exchange self-energy:        0.05646
  Frequency integration:       0.01979
  Tetrahedron weights:         0.00000
  MPI idle time:               0.00002      0.00002
  Other:                       0.05331
  ------------------------------------
  Total:                       0.96619

=========

K point (   3 ):   0.00000   0.00000   0.50000

Coulomb matrix read from spex.cor
Inverse dielectric matrices read from spex.cor 
Hermiticity of transformed Coulomb matrix: 2.4E-10

Add contribution to self-energy... done
                               Timings
  MT wave-func. products:      0.12585
  PW wave-func. products:      0.26622
  Matrix-vector products:      0.58124
  Transformations:             0.08482
  Exchange self-energy:        0.05284
  Frequency integration:       0.02020
  Tetrahedron weights:         0.00000
  MPI idle time:               0.00004      0.00004
  Other:                       0.05529
  ------------------------------------
  Total:                       1.18650

=========

K point (   4 ):   0.00000   0.25000   0.00000

Coulomb matrix read from spex.cor
Inverse dielectric matrices read from spex.cor 
Hermiticity of transformed Coulomb matrix: 1.5E-10

Add contribution to self-energy... done
                               Timings
  MT wave-func. products:      0.38987
  PW wave-func. products:      0.85302
  Matrix-vector products:      2.34534
  Transformations:             0.35593
  Exchange self-energy:        0.11301
  Frequency integration:       0.07970
  Tetrahedron weights:         0.00000
  MPI idle time:               0.00007      0.00007
  Other:                       0.19428
  ------------------------------------
  Total:                       4.33122

=========

K point (   5 ):   0.00000   0.25000   0.25000

Coulomb matrix read from spex.cor
Inverse dielectric matrices read from spex.cor 
Hermiticity of transformed Coulomb matrix: 1.5E-10

Add contribution to self-energy... done
                               Timings
  MT wave-func. products:      0.37367
  PW wave-func. products:      0.84883
  Matrix-vector products:      2.40055
  Transformations:             0.35297
  Exchange self-energy:        0.11499
  Frequency integration:       0.08097
  Tetrahedron weights:         0.00000
  MPI idle time:               0.00004      0.00004
  Other:                       0.19596
  ------------------------------------
  Total:                       4.36798

=========

K point (   6 ):   0.00000   0.25000   0.50000

Coulomb matrix read from spex.cor
Inverse dielectric matrices read from spex.cor 
Hermiticity of transformed Coulomb matrix: 1.4E-10

Add contribution to self-energy... done
                               Timings
  MT wave-func. products:      0.36809
  PW wave-func. products:      0.82243
  Matrix-vector products:      2.32569
  Transformations:             0.35631
  Exchange self-energy:        0.11082
  Frequency integration:       0.07863
  Tetrahedron weights:         0.00000
  MPI idle time:               0.00002      0.00002
  Other:                       0.19159
  ------------------------------------
  Total:                       4.25358

=========

K point (   7 ):   0.00000   0.50000   0.00000

Coulomb matrix read from spex.cor
Inverse dielectric matrices read from spex.cor 
Hermiticity of transformed Coulomb matrix: 1.3E-10

Add contribution to self-energy... done
                               Timings
  MT wave-func. products:      0.20320
  PW wave-func. products:      0.45796
  Matrix-vector products:      0.71543
  Transformations:             0.18138
  Exchange self-energy:        0.08071
  Frequency integration:       0.03937
  Tetrahedron weights:         0.00000
  MPI idle time:               0.00002      0.00002
  Other:                       0.09924
  ------------------------------------
  Total:                       1.77732

=========

K point (   8 ):   0.00000   0.50000   0.25000

Coulomb matrix read from spex.cor
Inverse dielectric matrices read from spex.cor 
Hermiticity of transformed Coulomb matrix: 7.9E-11

Add contribution to self-energy... done
                               Timings
  MT wave-func. products:      0.20632
  PW wave-func. products:      0.45498
  Matrix-vector products:      0.71109
  Transformations:             0.18048
  Exchange self-energy:        0.07315
  Frequency integration:       0.03959
  Tetrahedron weights:         0.00000
  MPI idle time:               0.00002      0.00002
  Other:                       0.09898
  ------------------------------------
  Total:                       1.76462

=========

K point (   9 ):   0.00000   0.50000   0.50000

Coulomb matrix read from spex.cor
Inverse dielectric matrices read from spex.cor 
Hermiticity of transformed Coulomb matrix: 5.5E-11

Add contribution to self-energy... done
                               Timings
  MT wave-func. products:      0.20473
  PW wave-func. products:      0.44900
  Matrix-vector products:      1.16968
  Transformations:             0.17358
  Exchange self-energy:        0.06990
  Frequency integration:       0.03958
  Tetrahedron weights:         0.00000
  MPI idle time:               0.00002      0.00002
  Other:                       0.10013
  ------------------------------------
  Total:                       2.20663

=========

K point (  10 ):   0.25000   0.25000   0.00000

Coulomb matrix read from spex.cor
Inverse dielectric matrices read from spex.cor 
Hermiticity of transformed Coulomb matrix: 5.5E-11

Add contribution to self-energy... done
                               Timings
  MT wave-func. products:      0.28938
  PW wave-func. products:      0.59937
  Matrix-vector products:      1.58013
  Transformations:             0.26704
  Exchange self-energy:        0.08679
  Frequency integration:       0.06012
  Tetrahedron weights:         0.00000
  MPI idle time:               0.00004      0.00004
  Other:                       0.14650
  ------------------------------------
  Total:                       3.02938

=========

K point (  11 ):   0.25000   0.25000   0.25000

Coulomb matrix read from spex.cor
Inverse dielectric matrices read from spex.cor 
Hermiticity of transformed Coulomb matrix: 8.0E-11

Add contribution to self-energy... done
                               Timings
  MT wave-func. products:      0.29433
  PW wave-func. products:      0.66006
  Matrix-vector products:      1.70472
  Transformations:             0.27277
  Exchange self-energy:        0.09489
  Frequency integration:       0.06017
  Tetrahedron weights:         0.00000
  MPI idle time:               0.00002      0.00002
  Other:                       0.14855
  ------------------------------------
  Total:                       3.23552

=========

K point (  12 ):   0.25000   0.25000   0.50000

Coulomb matrix read from spex.cor
Inverse dielectric matrices read from spex.cor 
Hermiticity of transformed Coulomb matrix: 9.9E-11

Add contribution to self-energy... done
                               Timings
  MT wave-func. products:      0.29451
  PW wave-func. products:      0.64057
  Matrix-vector products:      3.18907
  Transformations:             0.27876
  Exchange self-energy:        0.09091
  Frequency integration:       0.06026
  Tetrahedron weights:         0.00000
  MPI idle time:               0.00005      0.00005
  Other:                       0.14405
  ------------------------------------
  Total:                       4.69819


### subroutine: exchange_core ###

        k point       band      exchange (core contribution)
  (0.000,0.269,0.000)   1     -3.7376121
  (0.000,0.269,0.000)   2     -8.8691445
  (0.000,0.269,0.000)   3    -17.8371340
  (0.000,0.269,0.000)   4    -17.9138583
  (0.000,0.269,0.000)   5    -17.9371101
  (0.000,0.269,0.000)   6    -18.2036616
  (0.000,0.269,0.000)   7    -18.3334036
  (0.000,0.269,0.000)   8    -17.9124240
  (0.000,0.269,0.000)   9    -18.4891872
  (0.000,0.269,0.000)  10    -18.6828558
Timing:   0.15




### subroutine: quasiparticle ###

Number of mesh points even: No constraint will be used.

List of k points
    0   0.00000   0.26923   0.00000  (additional) 



#####################
### K POINT:    0 ###
#####################


--- DIAGONAL ELEMENTS [eV] ---

 Bd       vxc    sigmax    sigmac         Z        KS        HF          GW lin/dir 
  1 -20.44682 -30.60693   8.31380   0.73448  -8.40759 -18.56770  -9.69140   0.87291 
                          1.00833  -0.07167                      -9.68515   0.84333 
  2 -28.90438 -40.35831   8.86568   0.72351  -7.93750 -19.39143  -9.79092   0.50218 
                          0.57447  -0.03344                      -9.72864   0.48273 
  3 -42.40478 -55.70755   9.49707   0.73724  -6.37524 -19.67801  -9.17984   0.11247 
                          0.07142  -0.01572                      -9.07974   0.13805 
  4 -42.54208 -55.86602   9.51326   0.73711  -6.35701 -19.68095  -9.16483   0.10960 
                          0.06888  -0.01544                      -9.06424   0.13544 
  5 -42.53897 -55.83313   9.47401   0.73839  -6.28733 -19.58150  -9.10716   0.10432 
                          0.06485  -0.01477                      -9.00613   0.12999 
  6 -43.03270 -56.41629   9.54472   0.73855  -6.24548 -19.62907  -9.07974   0.10384 
                          0.06445  -0.01465                      -8.97812   0.12949 
  7 -43.14227 -56.49388   9.45551   0.74185  -6.20922 -19.56083  -9.09918   0.06560 
                          0.03601  -0.00998                      -8.99190   0.09029 
  8 -42.47181 -55.70814   9.41855   0.74009  -6.17612 -19.41246  -9.00077   0.09891 
                          0.06188  -0.01391                      -8.89987   0.12341 
  9 -43.42038 -56.79712   9.46497   0.74251  -6.14791 -19.52464  -9.05217   0.05720 
                          0.02986  -0.00895                      -8.94345   0.08183 
 10 -43.77158 -57.18424   9.49307   0.74290  -6.05999 -19.47265  -8.97159   0.05586 
                          0.02880  -0.00879                      -8.86266   0.08068 

Timing (quasiparticle equation):   0.11585

Timing:        36
