########################
######### SPEX #########
########################
Version 05.00  (Sep  5, 2019)
Execution time: Jan 18, 2020  17:48:19
Hostname: Ontology
MPI: 3,1


### subroutine: getinput ###

Basic parameters:
  Number of spins            =  1
            centers          =  4
            types            =  2
            equivalent atoms =  2  2
  Lattice parameter =      1.00000
  Lattice vectors   =      3.01411  -5.22060   0.00000
                           3.01411   5.22060   0.00000
                           0.00000   0.00000   9.80579
  Unit-cell volume  =    308.59778
  Reciprocal cutoff =      4.60000

Unit-cell geometry:
  # Ty  El              Coord.
  1  1  Ga   0.33333  -0.33333   0.00000
  2  1  Ga  -0.33333   0.33333   0.50000
  3  2  N    0.33333  -0.33333  -0.37700
  4  2  N   -0.33333   0.33333   0.12300

Symmetry information:
  Number of symmetry operations = 24
   #  Det           Axis           Angle   Syp  Inv
   1    1     --     --     --      --     Yes   1
   2   -1    1.00  -0.58  -0.00   180.00   No    2
   3   -1    1.00   0.58  -0.00   180.00   No    3
   4    1    0.00   0.00   1.00   120.00   Yes   9
   5    1    0.00   0.00   1.00   180.00   No    5
   6   -1    0.58   1.00  -0.00   180.00   Yes   6
   7   -1    1.00  -0.00  -0.00   180.00   Yes   7
   8    1    0.00   0.00   1.00    60.00   No   11
   9    1   -0.00  -0.00  -1.00   120.00   Yes   4
  10   -1   -0.00   1.00  -0.00   180.00   No   10
  11    1   -0.00  -0.00  -1.00    60.00   No    8
  12   -1   -0.58   1.00  -0.00   180.00   Yes  12
  13 - 24  Time reversal symmetries

##################
### Input file ###
##################
BZ       4 4 4
JOB      GW +:(1-30)
MPIKPT   
RESTART  
NBAND    200
KPT      +=(.26666,.26666,0)


Info: Simpson and Lagrange integration is used.

Radial mesh and basis functions:
  Number of radial grid points:       759  429
  Number of radial basis functions:    19   18
  Angular momentum quantum number:      8    6
  Maximal index:                        3

Core states:
  Atom type  1  (Ga)
  nl      Energy
  1s  -375.34991
  2s   -45.88297
  3s    -4.96076
  2p   -39.88207
  3p    -3.15226
  Atom type  2  (N )
  nl      Energy
  1s   -13.54409
  Number of valence electrons:   36

Average Coulomb potential: -0.35487  ( -9.65657 eV )

Read wavefunctions from harddisc... done   ( Timing:    0.30 )

Maximal energy difference in deg. subspaces: 4.2E-13
Minimal energy difference between subspaces: 8.4E-07

Wave functions:
  Number of bands:             198 -  200  (  200 )
            k points (IBZ):     64  (  12 /  30 )
            G vectors:         721
  k points of IBZ:
    1  (0.00000,0.00000,0.00000)  [ 0.00000, 0.00000, 0.00000 ]
    2  (0.00000,0.00000,0.25000)  [ 0.00000, 0.00000, 0.02550 ]
    3  (0.00000,0.00000,0.50000)  [ 0.00000, 0.00000, 0.05099 ]
    4  (0.00000,0.25000,0.00000)  [ 0.04147, 0.02394, 0.00000 ]
    5  (0.00000,0.25000,0.25000)  [ 0.04147, 0.02394, 0.02550 ]
    6  (0.00000,0.25000,0.50000)  [ 0.04147, 0.02394, 0.05099 ]
    7  (0.00000,0.50000,0.00000)  [ 0.08294, 0.04789, 0.00000 ]
    8  (0.00000,0.50000,0.25000)  [ 0.08294, 0.04789, 0.02550 ]
    9  (0.00000,0.50000,0.50000)  [ 0.08294, 0.04789, 0.05099 ]
   10  (0.25000,0.25000,0.00000)  [ 0.08294, 0.00000, 0.00000 ]
   11  (0.25000,0.25000,0.25000)  [ 0.08294, 0.00000, 0.02550 ]
   12  (0.25000,0.25000,0.50000)  [ 0.08294, 0.00000, 0.05099 ]
  k points of EIBZ (shifted set):
   65  (0.26666,0.26666,0.00000)  [ 0.08847, 0.00000, 0.00000 ]
   66  (0.26666,0.26666,0.25000)  [ 0.08847, 0.00000, 0.02550 ]
   67  (0.26666,0.26666,0.50000)  [ 0.08847, 0.00000, 0.05099 ]
   68  (0.26666,0.51666,0.00000)  [ 0.12994, 0.02394, 0.00000 ]
   69  (0.26666,0.51666,0.25000)  [ 0.12994, 0.02394, 0.02550 ]
   70  (0.26666,0.51666,0.50000)  [ 0.12994, 0.02394, 0.05099 ]
   71  (0.26666,0.76666,0.00000)  [ 0.17141, 0.04789, 0.00000 ]
   72  (0.26666,0.76666,0.25000)  [ 0.17141, 0.04789, 0.02550 ]
   73  (0.26666,0.76666,0.50000)  [ 0.17141, 0.04789, 0.05099 ]
   74  (0.26666,0.01666,0.00000)  [ 0.04700,-0.02394, 0.00000 ]
   75  (0.26666,0.01666,0.25000)  [ 0.04700,-0.02394, 0.02550 ]
   76  (0.26666,0.01666,0.50000)  [ 0.04700,-0.02394, 0.05099 ]
   77  (0.51666,0.51666,0.00000)  [ 0.17141, 0.00000, 0.00000 ]
   78  (0.51666,0.51666,0.25000)  [ 0.17141, 0.00000, 0.02550 ]
   79  (0.51666,0.51666,0.50000)  [ 0.17141, 0.00000, 0.05099 ]
   80  (0.51666,0.76666,0.00000)  [ 0.21289, 0.02394, 0.00000 ]
   81  (0.51666,0.76666,0.25000)  [ 0.21289, 0.02394, 0.02550 ]
   82  (0.51666,0.76666,0.50000)  [ 0.21289, 0.02394, 0.05099 ]
   83  (0.51666,0.01666,0.00000)  [ 0.08847,-0.04789, 0.00000 ]
   84  (0.51666,0.01666,0.25000)  [ 0.08847,-0.04789, 0.02550 ]
   85  (0.51666,0.01666,0.50000)  [ 0.08847,-0.04789, 0.05099 ]
   86  (0.76666,0.76666,0.00000)  [ 0.25436, 0.00000, 0.00000 ]
   87  (0.76666,0.76666,0.25000)  [ 0.25436, 0.00000, 0.02550 ]
   88  (0.76666,0.76666,0.50000)  [ 0.25436, 0.00000, 0.05099 ]
   89  (0.76666,0.01666,0.00000)  [ 0.12994,-0.07183, 0.00000 ]
   90  (0.76666,0.01666,0.25000)  [ 0.12994,-0.07183, 0.02550 ]
   91  (0.76666,0.01666,0.50000)  [ 0.12994,-0.07183, 0.05099 ]
   92  (0.01666,0.01666,0.00000)  [ 0.00553, 0.00000, 0.00000 ]
   93  (0.01666,0.01666,0.25000)  [ 0.00553, 0.00000, 0.02550 ]
   94  (0.01666,0.01666,0.50000)  [ 0.00553, 0.00000, 0.05099 ]

Generate wavefunctions at equivalent k points... done   ( Timing:   0.26 )

Size of array cpw:   209.8 MB
Size of array cmt:   260.9 MB

The system is not a metal.
The Fermi energy is placed in the center of the band gap.
KS energy gap:    0.07059528 Ha   (  1.92099521 eV )
Fermi energy:     0.29316457 Ha   (  7.97741378 eV )
Maximal energy:   5.57248232 Ha
Electron count error of the shifted k-point set:  0.0000000000000000

Wave-function checksum:  1.698549986837E-01


### subroutine: checkinput ###

Overlap <core|core>
Atom type  1
1s  1.000000
2s -0.000000  1.000000
3s  0.000000 -0.000001  0.999961
2p  0.999418
3p -0.000329  0.999458
Atom type  2
1s  0.999983

Overlap <core|basis>
Atom type  1
         u(s)    udot(s)
1s  0.000000  0.000000
2s  0.000001  0.000000
3s  0.004767 -0.007551
         u(p)    udot(p)
2p -0.000106 -0.000031
3p  0.017150 -0.021254
Atom type  2
         u(s)    udot(s)
1s  0.003209 -0.002046

Average overlap <core|val>
Atom type  1
1s  0.000000
2s  0.000000
3s  0.000679
2p  0.000010  0.000010  0.000010
3p  0.002210  0.002206  0.002210
Atom type  2
1s  0.000234

Maximum overlap <core|val> at (band/kpoint)
Atom type  1
1s  0.000000 (033/ 001)
2s  0.000001 (033/ 001)
3s  0.004405 (156/ 003)
2p  0.000061 (023/ 003)  0.000064 (024/ 092)  0.000061 (025/ 003)
3p  0.012363 (121/ 003)  0.014817 (111/ 001)  0.012884 (124/ 094)
Atom type  2
1s  0.001659 (001/ 094)

Overlap <basis|basis>
Atom type  1
   u(s)  1.000000
udot(s) -0.000000  0.129862
   u(p)  1.000000
udot(p)  0.000000  0.075237
   u(d)  1.000000
udot(d) -0.000000  0.733838
 ulo(d)  0.410292 -0.767526  1.000000
   u(f)  1.000000
udot(f) -0.000000  0.020278
   u(g)  1.000000
udot(g) -0.000000  0.006703
   u(h)  1.000000
udot(h) -0.000000  0.003149
   u(i)  1.000000
udot(i)  0.000000  0.001726
   u(j)  1.000000
udot(j) -0.000000  0.001039
   u(k)  1.000000
udot(k) -0.000000  0.000667
Atom type  2
   u(s)  1.000000
udot(s)  0.000000  0.023146
   u(p)  1.000000
udot(p)  0.000000  0.036192
   u(d)  1.000000
udot(d) -0.000000  0.003612
   u(f)  1.000000
udot(f)  0.000000  0.001183
   u(g)  1.000000
udot(g) -0.000000  0.000520
   u(h)  1.000000
udot(h) -0.000000  0.000271
   u(i)  1.000000
udot(i) -0.000000  0.000157


### subroutine: mixedbasis ( Mode: vv ) ###

Mixed basis
  Plane-wave basis:
    Number of unique G vectors:   338
    Maximal number of G vectors:  233

  MT basis read in from spex.mb (mode: vv).
    Total number of product-basis functions:  264



##### Job index:  1 #####


### subroutine: correlation ###

< GW self-energy >
Calculate periodic function...done   ( Timing:    0.04 )

=========

K point (   1 ):   0.00000   0.00000   0.00000

Coulomb matrix read from spex.cor
Inverse dielectric matrices read from spex.cor
Invert dielectric tensor... done   ( Timing:    0.02 )
Hermiticity of transformed Coulomb matrix: 5.1E-11

Add contribution to self-energy... done
                               Timings
  MT wave-func. products:      2.33225
  PW wave-func. products:      0.46572
  Matrix-vector products:      2.36661
  Transformations:             0.32258
  Exchange self-energy:        0.20103
  Frequency integration:       0.03180
  Tetrahedron weights:         0.00000
  Gamma-point correction:      0.42823
  MPI idle time:               0.00003      0.01170
  Other:                       0.12122
  ------------------------------------
  Total:                       6.26946

=========

K point (   2 ):   0.00000   0.00000   0.25000

Coulomb matrix read from spex.cor
Inverse dielectric matrices read from spex.cor
Hermiticity of transformed Coulomb matrix: 5.9E-10

Add contribution to self-energy... done
                               Timings
  MT wave-func. products:      1.60774
  PW wave-func. products:      0.48038
  Matrix-vector products:      2.27787
  Transformations:             0.27549
  Exchange self-energy:        0.16897
  Frequency integration:       0.05248
  Tetrahedron weights:         0.00000
  MPI idle time:               0.02056      0.02056
  Other:                       0.11804
  ------------------------------------
  Total:                       5.00152

=========

K point (   3 ):   0.00000   0.00000   0.50000

Coulomb matrix read from spex.cor
Inverse dielectric matrices read from spex.cor
Hermiticity of transformed Coulomb matrix: 1.8E-10

Add contribution to self-energy... done
                               Timings
  MT wave-func. products:      1.69623
  PW wave-func. products:      0.39670
  Matrix-vector products:      2.37221
  Transformations:             0.24606
  Exchange self-energy:        0.17134
  Frequency integration:       0.06728
  Tetrahedron weights:         0.00000
  MPI idle time:               0.01915      0.03135
  Other:                       0.17564
  ------------------------------------
  Total:                       5.14461

=========

K point (   4 ):   0.00000   0.25000   0.00000

Coulomb matrix read from spex.cor
Inverse dielectric matrices read from spex.cor
Hermiticity of transformed Coulomb matrix: 8.5E-11

Add contribution to self-energy... done
                               Timings
  MT wave-func. products:      2.99037
  PW wave-func. products:      0.73653
  Matrix-vector products:      7.25334
  Transformations:             0.82437
  Exchange self-energy:        0.18456
  Frequency integration:       0.13351
  Tetrahedron weights:         0.00000
  MPI idle time:               0.00003      0.03240
  Other:                       0.50119
  ------------------------------------
  Total:                      12.62390

=========

K point (   5 ):   0.00000   0.25000   0.25000

Coulomb matrix read from spex.cor
Inverse dielectric matrices read from spex.cor
Hermiticity of transformed Coulomb matrix: 9.7E-11

Add contribution to self-energy... done
                               Timings
  MT wave-func. products:      3.18668
  PW wave-func. products:      0.78293
  Matrix-vector products:      6.80988
  Transformations:             0.91656
  Exchange self-energy:        0.22227
  Frequency integration:       0.18076
  Tetrahedron weights:         0.00000
  MPI idle time:               0.00003      0.02450
  Other:                       0.50451
  ------------------------------------
  Total:                      12.60361

=========

K point (   6 ):   0.00000   0.25000   0.50000

Coulomb matrix read from spex.cor
Inverse dielectric matrices read from spex.cor
Hermiticity of transformed Coulomb matrix: 9.8E-11

Add contribution to self-energy... done
                               Timings
  MT wave-func. products:      2.97402
  PW wave-func. products:      0.77203
  Matrix-vector products:      6.66334
  Transformations:             0.91215
  Exchange self-energy:        0.22930
  Frequency integration:       0.16945
  Tetrahedron weights:         0.00000
  MPI idle time:               0.02201      0.02645
  Other:                       0.40903
  ------------------------------------
  Total:                      12.15133

=========

K point (   7 ):   0.00000   0.50000   0.00000

Coulomb matrix read from spex.cor
Inverse dielectric matrices read from spex.cor
Hermiticity of transformed Coulomb matrix: 1.0E-10

Add contribution to self-energy... done
                               Timings
  MT wave-func. products:      3.06292
  PW wave-func. products:      0.63300
  Matrix-vector products:      4.40188
  Transformations:             0.65081
  Exchange self-energy:        0.16558
  Frequency integration:       0.11185
  Tetrahedron weights:         0.00000
  MPI idle time:               0.00002      0.02185
  Other:                       0.29242
  ------------------------------------
  Total:                       9.31849

=========

K point (   8 ):   0.00000   0.50000   0.25000

Coulomb matrix read from spex.cor
Inverse dielectric matrices read from spex.cor
Hermiticity of transformed Coulomb matrix: 5.3E-11

Add contribution to self-energy... done
                               Timings
  MT wave-func. products:      3.07732
  PW wave-func. products:      0.63320
  Matrix-vector products:      4.31644
  Transformations:             0.67960
  Exchange self-energy:        0.34074
  Frequency integration:       0.09349
  Tetrahedron weights:         0.00000
  MPI idle time:               0.02680      0.02680
  Other:                       0.30437
  ------------------------------------
  Total:                       9.47195

=========

K point (   9 ):   0.00000   0.50000   0.50000

Coulomb matrix read from spex.cor
Inverse dielectric matrices read from spex.cor
Hermiticity of transformed Coulomb matrix: 4.1E-11

Add contribution to self-energy... done
                               Timings
  MT wave-func. products:      2.51332
  PW wave-func. products:      0.55931
  Matrix-vector products:      4.33023
  Transformations:             0.55576
  Exchange self-energy:        0.21568
  Frequency integration:       0.14941
  Tetrahedron weights:         0.00000
  MPI idle time:               0.00602      0.00655
  Other:                       0.36641
  ------------------------------------
  Total:                       8.69615

=========

K point (  10 ):   0.25000   0.25000   0.00000

Coulomb matrix read from spex.cor
Inverse dielectric matrices read from spex.cor
Hermiticity of transformed Coulomb matrix: 3.6E-11

Add contribution to self-energy... done
                               Timings
  MT wave-func. products:      3.48215
  PW wave-func. products:      0.95688
  Matrix-vector products:      8.48159
  Transformations:             1.05364
  Exchange self-energy:        0.23798
  Frequency integration:       0.12931
  Tetrahedron weights:         0.00000
  MPI idle time:               0.00004      0.05315
  Other:                       0.71157
  ------------------------------------
  Total:                      15.05316

=========

K point (  11 ):   0.25000   0.25000   0.25000

Coulomb matrix read from spex.cor
Inverse dielectric matrices read from spex.cor
Hermiticity of transformed Coulomb matrix: 5.4E-11

Add contribution to self-energy... done
                               Timings
  MT wave-func. products:      4.00761
  PW wave-func. products:      0.95557
  Matrix-vector products:      9.30340
  Transformations:             1.17120
  Exchange self-energy:        0.31253
  Frequency integration:       0.13344
  Tetrahedron weights:         0.00000
  MPI idle time:               0.02319      0.02319
  Other:                       0.84219
  ------------------------------------
  Total:                      16.74913

=========

K point (  12 ):   0.25000   0.25000   0.50000

Coulomb matrix read from spex.cor
Inverse dielectric matrices read from spex.cor
Hermiticity of transformed Coulomb matrix: 6.5E-11

Add contribution to self-energy... done
                               Timings
  MT wave-func. products:      4.10419
  PW wave-func. products:      1.00555
  Matrix-vector products:     14.82454
  Transformations:             1.30008
  Exchange self-energy:        0.25800
  Frequency integration:       0.22176
  Tetrahedron weights:         0.00000
  MPI idle time:               0.08031      0.08031
  Other:                       0.81293
  ------------------------------------
  Total:                      22.60735


### subroutine: exchange_core ###

        k point       band      exchange (core contribution)
  (0.267,0.267,0.000)   1     -7.6349052
  (0.267,0.267,0.000)   2     -9.3226166
  (0.267,0.267,0.000)   3    -17.7580427
  (0.267,0.267,0.000)   4    -18.1137751
  (0.267,0.267,0.000)   5    -18.2442634
  (0.267,0.267,0.000)   6    -18.3431202
  (0.267,0.267,0.000)   7    -18.3212414
  (0.267,0.267,0.000)   8    -18.4217472
  (0.267,0.267,0.000)   9    -18.5437967
  (0.267,0.267,0.000)  10    -18.5612848
  (0.267,0.267,0.000)  11    -12.4723164
  (0.267,0.267,0.000)  12    -11.3026449
  (0.267,0.267,0.000)  13     -1.6977917
  (0.267,0.267,0.000)  14     -1.8619190
  (0.267,0.267,0.000)  15     -1.4872293
  (0.267,0.267,0.000)  16     -1.4415710
  (0.267,0.267,0.000)  17     -1.7946008
  (0.267,0.267,0.000)  18     -1.7167303
  (0.267,0.267,0.000)  19     -1.5137628
  (0.267,0.267,0.000)  20     -1.9425623
  (0.267,0.267,0.000)  21     -1.6008008
  (0.267,0.267,0.000)  22     -2.1184216
  (0.267,0.267,0.000)  23     -1.8357834
  (0.267,0.267,0.000)  24     -1.7000615
  (0.267,0.267,0.000)  25     -1.8261316
  (0.267,0.267,0.000)  26     -1.4296466
  (0.267,0.267,0.000)  27     -2.3483139
  (0.267,0.267,0.000)  28     -1.9863564
  (0.267,0.267,0.000)  29     -2.2345598
  (0.267,0.267,0.000)  30     -1.4381329
Timing:   0.09




### subroutine: quasiparticle ###

Number of mesh points even: No constraint will be used.

List of k points
    0   0.26666   0.26666   0.00000  (additional)



#####################
### K POINT:    0 ###
#####################


--- DIAGONAL ELEMENTS [eV] ---

 Bd       vxc    sigmax    sigmac         Z        KS        HF          GW lin/dir
  1 -26.91801 -38.05394   8.72683   0.72654  -8.01555 -19.15148  -9.73892   0.58415
                          0.67093  -0.04013                      -9.68886   0.55660
  2 -29.64163 -41.20918   8.91276   0.72161  -7.89871 -19.46626  -9.79866   0.46456
                          0.53532  -0.02948                      -9.73027   0.44981
  3 -42.20665 -55.46828   9.44926   0.73775  -6.40771 -19.66934  -9.21932   0.10536
                          0.06585  -0.01489                      -9.11819   0.13096
  4 -42.88674 -56.24339   9.52860   0.73824  -6.26644 -19.62308  -9.09148   0.10587
                          0.06597  -0.01493                      -8.99042   0.13159
  5 -43.06307 -56.42892   9.50933   0.73960  -6.21774 -19.58360  -9.06932   0.09131
                          0.05469  -0.01319                      -8.96602   0.11694
  6 -43.16252 -56.53096   9.47418   0.74152  -6.21010 -19.57855  -9.09736   0.07016
                          0.03930  -0.01053                      -8.99055   0.09500
  7 -43.16316 -56.54327   9.50671   0.74038  -6.19492 -19.57503  -9.06211   0.08425
                          0.04948  -0.01229                      -8.95753   0.10966
  8 -43.29613 -56.67204   9.47357   0.74194  -6.17129 -19.54720  -9.06625   0.06573
                          0.03587  -0.01002                      -8.95881   0.09067
  9 -43.55278 -56.96834   9.51750   0.74153  -6.11409 -19.52966  -9.00419   0.07157
                          0.03997  -0.01076                      -8.89775   0.09682
 10 -43.56526 -56.95001   9.48177   0.74221  -6.08593 -19.47068  -8.98244   0.06226
                          0.03326  -0.00963                      -8.87475   0.08744
 11 -34.31173 -45.77110   8.66753   0.72941  -4.96105 -16.42043  -6.97613   0.42302
                          0.33924  -0.06289                      -6.96089   0.46057
 12 -33.11770 -44.14376   8.47728   0.73568  -4.17440 -15.20046  -6.02814   0.41599
                          0.36026  -0.05922                      -6.00962   0.41415
 13 -16.02240 -21.06127   3.93711   0.74402   1.34777  -3.69110   0.52872   0.05012
                          0.04463  -0.01535                       0.53754   0.05223
 14 -16.30895 -21.55006   3.97136   0.74517   1.76710  -3.47401   0.82141   0.04336
                          0.03474  -0.01376                       0.83359   0.04664
 15 -16.04318 -20.71762   3.55092   0.75512   2.78151  -1.89294   1.93324   0.02133
                          0.01668  -0.00777                       1.94247   0.02302
 16 -15.99354 -20.71008   3.52139   0.75640   3.20167  -1.51488   2.29771   0.01488
                          0.01063  -0.00572                       2.30866   0.01661
 17 -17.63049 -21.95423   3.26981   0.76777   4.76138   0.43764   3.95221   0.00325
                          0.00192  -0.00168                       3.95990   0.00395
 18 -17.59870 -21.78811   3.19913   0.76753   4.91477   0.72536   4.15470   0.00238
                          0.00134  -0.00137                       4.16151   0.00296
 19 -12.19301  -7.61837  -4.12379   0.81962  12.62963  17.20427  12.99915  -0.00224
                         -0.00131  -0.00259                      12.99800  -0.00246
 20 -17.10493 -10.86167  -4.80161   0.77807  14.02121  20.26447  15.14284  -0.01920
                         -0.00962  -0.00813                      15.13085  -0.02379
 21 -14.82104  -9.12912  -4.72549   0.78700  14.98732  20.67923  15.74774  -0.02179
                         -0.01590  -0.00960                      15.74205  -0.02367
 22 -17.47484 -10.87046  -4.95558   0.77869  15.02408  21.62845  16.30783  -0.02724
                         -0.01527  -0.00931                      16.29171  -0.03299
 23 -14.89085  -8.81406  -5.02992   0.78868  16.65640  22.73320  17.48159  -0.04077
                         -0.03317  -0.01396                      17.47487  -0.04302
 24 -15.45628  -8.93169  -5.35876   0.77365  17.33468  23.85926  18.23575  -0.05826
                         -0.04833  -0.01790                      18.22696  -0.06135
 25 -14.01851  -7.48851  -5.63889   0.77822  18.36235  24.89235  19.05343  -0.09357
                         -0.08933  -0.02699                      19.04810  -0.09527
 26 -13.61903  -6.84068  -5.90690   0.76938  20.60279  27.38113  21.26799  -0.14499
                         -0.14807  -0.03565                      21.26252  -0.14609
 27 -15.73491  -8.19828  -6.34050   0.75528  20.79323  28.32985  21.68817  -0.19833
                         -0.19313  -0.04386                      21.67733  -0.20128
 28 -14.04882  -7.30739  -5.79778   0.78361  23.45628  30.19771  24.18593  -0.21385
                         -0.21910  -0.04469                      24.17961  -0.21479
 29 -15.10624  -7.58834  -6.47303   0.76859  26.65788  34.17577  27.42588  -0.44361
                         -0.47729  -0.07348                      27.41654  -0.44247
 30 -12.57013  -5.54043  -6.23505   0.78254  27.10572  34.13543  27.69447  -0.41864
                         -0.46227  -0.07159                      27.68899  -0.41691

Timing (quasiparticle equation):   0.43484

Timing:       137
