########################
######### SPEX #########
########################
Version 05.00  (Sep  5, 2019)
Execution time: Jan 18, 2020  00:06:19
Hostname: login18-1.hpc.itc.rwth-aachen.de
MPI: 1,1


### subroutine: getinput ###

Basic parameters:
  Number of spins            =  1
            centers          =  4
            types            =  2
            equivalent atoms =  2  2
  Lattice parameter =      1.00000
  Lattice vectors   =      3.01411  -5.22060   0.00000
                           3.01411   5.22060   0.00000
                           0.00000   0.00000   9.80579
  Unit-cell volume  =    308.59778
  Reciprocal cutoff =      4.60000

Unit-cell geometry:
  # Ty  El              Coord.
  1  1  Ga   0.33333  -0.33333   0.00000
  2  1  Ga  -0.33333   0.33333   0.50000
  3  2  N    0.33333  -0.33333  -0.37700
  4  2  N   -0.33333   0.33333   0.12300

Symmetry information:
  Number of symmetry operations = 24
   #  Det           Axis           Angle   Syp  Inv
   1    1     --     --     --      --     Yes   1
   2   -1    1.00  -0.58   0.00   180.00   No    2
   3   -1    1.00   0.58   0.00   180.00   No    3
   4    1    0.00   0.00   1.00   120.00   Yes   9
   5    1    0.00   0.00   1.00   180.00   No    5
   6   -1    0.58   1.00   0.00   180.00   Yes   6
   7   -1    1.00   0.00   0.00   180.00   Yes   7
   8    1    0.00   0.00   1.00    60.00   No   11
   9    1    0.00   0.00  -1.00   120.00   Yes   4
  10   -1    0.00   1.00   0.00   180.00   No   10
  11    1    0.00   0.00  -1.00    60.00   No    8
  12   -1   -0.58   1.00   0.00   180.00   Yes  12
  13 - 24  Time reversal symmetries

##################
### Input file ###
##################
BZ       4 4 4
JOB      GW +:(1-10)
NBAND    200
RESTART  
KPT      +=(.22222,.22222,0)
 

Info: Simpson and Lagrange integration is used.

Radial mesh and basis functions:
  Number of radial grid points:       759  429
  Number of radial basis functions:    19   18
  Angular momentum quantum number:      8    6
  Maximal index:                        3

Core states:
  Atom type  1  (Ga)
  nl      Energy
  1s  -375.34991
  2s   -45.88297
  3s    -4.96076
  2p   -39.88207
  3p    -3.15226
  Atom type  2  (N )
  nl      Energy
  1s   -13.54409
  Number of valence electrons:   36

Average Coulomb potential: -0.35487  ( -9.65657 eV )

Read wavefunctions from harddisc... done   ( Timing:    0.22 )

Maximal energy difference in deg. subspaces: 1.3E-12
Minimal energy difference between subspaces: 1.4E-05

Wave functions:
  Number of bands:             198 -  200  (  200 )
            k points (IBZ):     64  (  12 /  30 )
            G vectors:         775
  k points of IBZ:
    1  (0.00000,0.00000,0.00000)  [ 0.00000, 0.00000, 0.00000 ]
    2  (0.00000,0.00000,0.25000)  [ 0.00000, 0.00000, 0.02550 ]
    3  (0.00000,0.00000,0.50000)  [ 0.00000, 0.00000, 0.05099 ]
    4  (0.00000,0.25000,0.00000)  [ 0.04147, 0.02394, 0.00000 ]
    5  (0.00000,0.25000,0.25000)  [ 0.04147, 0.02394, 0.02550 ]
    6  (0.00000,0.25000,0.50000)  [ 0.04147, 0.02394, 0.05099 ]
    7  (0.00000,0.50000,0.00000)  [ 0.08294, 0.04789, 0.00000 ]
    8  (0.00000,0.50000,0.25000)  [ 0.08294, 0.04789, 0.02550 ]
    9  (0.00000,0.50000,0.50000)  [ 0.08294, 0.04789, 0.05099 ]
   10  (0.25000,0.25000,0.00000)  [ 0.08294, 0.00000, 0.00000 ]
   11  (0.25000,0.25000,0.25000)  [ 0.08294, 0.00000, 0.02550 ]
   12  (0.25000,0.25000,0.50000)  [ 0.08294, 0.00000, 0.05099 ]
  k points of EIBZ (shifted set):
   65  (0.22222,0.22222,0.00000)  [ 0.07373, 0.00000, 0.00000 ]
   66  (0.22222,0.22222,0.25000)  [ 0.07373, 0.00000, 0.02550 ]
   67  (0.22222,0.22222,0.50000)  [ 0.07373, 0.00000, 0.05099 ]
   68  (0.22222,0.47222,0.00000)  [ 0.11520, 0.02394, 0.00000 ]
   69  (0.22222,0.47222,0.25000)  [ 0.11520, 0.02394, 0.02550 ]
   70  (0.22222,0.47222,0.50000)  [ 0.11520, 0.02394, 0.05099 ]
   71  (0.22222,0.72222,0.00000)  [ 0.15667, 0.04789, 0.00000 ]
   72  (0.22222,0.72222,0.25000)  [ 0.15667, 0.04789, 0.02550 ]
   73  (0.22222,0.72222,0.50000)  [ 0.15667, 0.04789, 0.05099 ]
   74  (0.22222,0.97222,0.00000)  [ 0.19814, 0.07183, 0.00000 ]
   75  (0.22222,0.97222,0.25000)  [ 0.19814, 0.07183, 0.02550 ]
   76  (0.22222,0.97222,0.50000)  [ 0.19814, 0.07183, 0.05099 ]
   77  (0.47222,0.47222,0.00000)  [ 0.15667, 0.00000, 0.00000 ]
   78  (0.47222,0.47222,0.25000)  [ 0.15667, 0.00000, 0.02550 ]
   79  (0.47222,0.47222,0.50000)  [ 0.15667, 0.00000, 0.05099 ]
   80  (0.47222,0.72222,0.00000)  [ 0.19814, 0.02394, 0.00000 ]
   81  (0.47222,0.72222,0.25000)  [ 0.19814, 0.02394, 0.02550 ]
   82  (0.47222,0.72222,0.50000)  [ 0.19814, 0.02394, 0.05099 ]
   83  (0.47222,0.97222,0.00000)  [ 0.23961, 0.04789, 0.00000 ]
   84  (0.47222,0.97222,0.25000)  [ 0.23961, 0.04789, 0.02550 ]
   85  (0.47222,0.97222,0.50000)  [ 0.23961, 0.04789, 0.05099 ]
   86  (0.72222,0.72222,0.00000)  [ 0.23961, 0.00000, 0.00000 ]
   87  (0.72222,0.72222,0.25000)  [ 0.23961, 0.00000, 0.02550 ]
   88  (0.72222,0.72222,0.50000)  [ 0.23961, 0.00000, 0.05099 ]
   89  (0.72222,0.97222,0.00000)  [ 0.28108, 0.02394, 0.00000 ]
   90  (0.72222,0.97222,0.25000)  [ 0.28108, 0.02394, 0.02550 ]
   91  (0.72222,0.97222,0.50000)  [ 0.28108, 0.02394, 0.05099 ]
   92  (0.97222,0.97222,0.00000)  [ 0.32256, 0.00000, 0.00000 ]
   93  (0.97222,0.97222,0.25000)  [ 0.32256, 0.00000, 0.02550 ]
   94  (0.97222,0.97222,0.50000)  [ 0.32256, 0.00000, 0.05099 ]

Generate wavefunctions at equivalent k points... done   ( Timing:   0.41 )

Size of array cpw:   209.8 MB
Size of array cmt:   260.9 MB

The system is not a metal.
The Fermi energy is placed in the center of the band gap.
KS energy gap:    0.07059528 Ha   (  1.92099521 eV )
Fermi energy:     0.29316457 Ha   (  7.97741378 eV )
Maximal energy:   5.57248232 Ha
Electron count error of the shifted k-point set:  0.0000000000000000

Wave-function checksum: -1.493672003073E-01


### subroutine: checkinput ###

Overlap <core|core>
Atom type  1
1s  1.000000 
2s -0.000000  1.000000 
3s  0.000000 -0.000001  0.999961 
2p  0.999418 
3p -0.000329  0.999458 
Atom type  2
1s  0.999983 

Overlap <core|basis>
Atom type  1
         u(s)    udot(s)
1s  0.000000  0.000000 
2s  0.000001  0.000000 
3s  0.004767 -0.007551 
         u(p)    udot(p)
2p -0.000106 -0.000031 
3p  0.017150 -0.021254 
Atom type  2
         u(s)    udot(s)
1s  0.003209 -0.002046 

Average overlap <core|val>
Atom type  1
1s  0.000000
2s  0.000000
3s  0.000679
2p  0.000010  0.000010  0.000010
3p  0.002209  0.002204  0.002209
Atom type  2
1s  0.000234

Maximum overlap <core|val> at (band/kpoint)
Atom type  1
1s  0.000000 (022/ 009)
2s  0.000001 (022/ 009)
3s  0.003767 (156/ 003)
2p  0.000060 (025/ 003)  0.000064 (024/ 092)  0.000067 (026/ 003)
3p  0.012494 (122/ 003)  0.014817 (111/ 001)  0.013262 (124/ 003)
Atom type  2
1s  0.001660 (002/ 094)

Overlap <basis|basis>
Atom type  1
   u(s)  1.000000 
udot(s)  0.000000  0.129862 
   u(p)  1.000000 
udot(p) -0.000000  0.075237 
   u(d)  1.000000 
udot(d) -0.000000  0.733838 
 ulo(d)  0.410292 -0.767526  1.000000 
   u(f)  1.000000 
udot(f) -0.000000  0.020278 
   u(g)  1.000000 
udot(g) -0.000000  0.006703 
   u(h)  1.000000 
udot(h)  0.000000  0.003149 
   u(i)  1.000000 
udot(i) -0.000000  0.001726 
   u(j)  1.000000 
udot(j)  0.000000  0.001039 
   u(k)  1.000000 
udot(k) -0.000000  0.000667 
Atom type  2
   u(s)  1.000000 
udot(s)  0.000000  0.023146 
   u(p)  1.000000 
udot(p)  0.000000  0.036192 
   u(d)  1.000000 
udot(d)  0.000000  0.003612 
   u(f)  1.000000 
udot(f)  0.000000  0.001183 
   u(g)  1.000000 
udot(g)  0.000000  0.000520 
   u(h)  1.000000 
udot(h) -0.000000  0.000271 
   u(i)  1.000000 
udot(i)  0.000000  0.000157 


### subroutine: mixedbasis ( Mode: vv ) ###

Mixed basis
  Plane-wave basis:
    Number of unique G vectors:   375
    Maximal number of G vectors:  233

  MT basis read in from spex.mb (mode: vv).
    Total number of product-basis functions:  264



##### Job index:  1 #####


### subroutine: correlation ###

< GW self-energy >
Calculate periodic function...done   ( Timing:    0.09 )

=========

K point (   1 ):   0.00000   0.00000   0.00000

Coulomb matrix read from spex.cor
Inverse dielectric matrices read from spex.cor 
Invert dielectric tensor... done   ( Timing:    0.02 )
Hermiticity of transformed Coulomb matrix: 6.8E-11

Add contribution to self-energy... done
                               Timings
  MT wave-func. products:      0.11652
  PW wave-func. products:      0.25251
  Matrix-vector products:      0.34638
  Transformations:             0.08403
  Exchange self-energy:        0.06433
  Frequency integration:       0.01826
  Tetrahedron weights:         0.00000
  Gamma-point correction:      1.38516
  MPI idle time:               0.00007      0.00007
  Other:                       0.05238
  ------------------------------------
  Total:                       2.31963

=========

K point (   2 ):   0.00000   0.00000   0.25000

Coulomb matrix read from spex.cor
Inverse dielectric matrices read from spex.cor 
Hermiticity of transformed Coulomb matrix: 8.7E-10

Add contribution to self-energy... done
                               Timings
  MT wave-func. products:      0.11893
  PW wave-func. products:      0.24962
  Matrix-vector products:      0.34060
  Transformations:             0.08203
  Exchange self-energy:        0.05195
  Frequency integration:       0.01861
  Tetrahedron weights:         0.00000
  MPI idle time:               0.00008      0.00008
  Other:                       0.05127
  ------------------------------------
  Total:                       0.91310

=========

K point (   3 ):   0.00000   0.00000   0.50000

Coulomb matrix read from spex.cor
Inverse dielectric matrices read from spex.cor 
Hermiticity of transformed Coulomb matrix: 2.4E-10

Add contribution to self-energy... done
                               Timings
  MT wave-func. products:      0.11472
  PW wave-func. products:      0.23827
  Matrix-vector products:      0.53077
  Transformations:             0.07823
  Exchange self-energy:        0.04879
  Frequency integration:       0.01810
  Tetrahedron weights:         0.00000
  MPI idle time:               0.00002      0.00002
  Other:                       0.05355
  ------------------------------------
  Total:                       1.08245

=========

K point (   4 ):   0.00000   0.25000   0.00000

Coulomb matrix read from spex.cor
Inverse dielectric matrices read from spex.cor 
Hermiticity of transformed Coulomb matrix: 1.5E-10

Add contribution to self-energy... done
                               Timings
  MT wave-func. products:      0.27425
  PW wave-func. products:      0.61558
  Matrix-vector products:      1.61642
  Transformations:             0.24678
  Exchange self-energy:        0.08197
  Frequency integration:       0.05368
  Tetrahedron weights:         0.00000
  MPI idle time:               0.00004      0.00004
  Other:                       0.13309
  ------------------------------------
  Total:                       3.02180

=========

K point (   5 ):   0.00000   0.25000   0.25000

Coulomb matrix read from spex.cor
Inverse dielectric matrices read from spex.cor 
Hermiticity of transformed Coulomb matrix: 1.5E-10

Add contribution to self-energy... done
                               Timings
  MT wave-func. products:      0.27394
  PW wave-func. products:      0.63085
  Matrix-vector products:      1.64882
  Transformations:             0.24895
  Exchange self-energy:        0.08564
  Frequency integration:       0.05319
  Tetrahedron weights:         0.00000
  MPI idle time:               0.00006      0.00006
  Other:                       0.13532
  ------------------------------------
  Total:                       3.07677

=========

K point (   6 ):   0.00000   0.25000   0.50000

Coulomb matrix read from spex.cor
Inverse dielectric matrices read from spex.cor 
Hermiticity of transformed Coulomb matrix: 1.4E-10

Add contribution to self-energy... done
                               Timings
  MT wave-func. products:      0.28139
  PW wave-func. products:      0.64211
  Matrix-vector products:      1.68997
  Transformations:             0.25059
  Exchange self-energy:        0.08933
  Frequency integration:       0.05360
  Tetrahedron weights:         0.00000
  MPI idle time:               0.00005      0.00005
  Other:                       0.13419
  ------------------------------------
  Total:                       3.14124

=========

K point (   7 ):   0.00000   0.50000   0.00000

Coulomb matrix read from spex.cor
Inverse dielectric matrices read from spex.cor 
Hermiticity of transformed Coulomb matrix: 1.3E-10

Add contribution to self-energy... done
                               Timings
  MT wave-func. products:      0.19310
  PW wave-func. products:      0.44248
  Matrix-vector products:      0.67141
  Transformations:             0.16543
  Exchange self-energy:        0.07114
  Frequency integration:       0.03629
  Tetrahedron weights:         0.00000
  MPI idle time:               0.00005      0.00005
  Other:                       0.09354
  ------------------------------------
  Total:                       1.67344

=========

K point (   8 ):   0.00000   0.50000   0.25000

Coulomb matrix read from spex.cor
Inverse dielectric matrices read from spex.cor 
Hermiticity of transformed Coulomb matrix: 7.9E-11

Add contribution to self-energy... done
                               Timings
  MT wave-func. products:      0.19627
  PW wave-func. products:      0.44077
  Matrix-vector products:      0.66747
  Transformations:             0.16832
  Exchange self-energy:        0.07012
  Frequency integration:       0.03657
  Tetrahedron weights:         0.00000
  MPI idle time:               0.00008      0.00008
  Other:                       0.09325
  ------------------------------------
  Total:                       1.67286

=========

K point (   9 ):   0.00000   0.50000   0.50000

Coulomb matrix read from spex.cor
Inverse dielectric matrices read from spex.cor 
Hermiticity of transformed Coulomb matrix: 5.5E-11

Add contribution to self-energy... done
                               Timings
  MT wave-func. products:      0.19560
  PW wave-func. products:      0.41697
  Matrix-vector products:      1.07209
  Transformations:             0.15964
  Exchange self-energy:        0.06384
  Frequency integration:       0.03609
  Tetrahedron weights:         0.00000
  MPI idle time:               0.00004      0.00004
  Other:                       0.09275
  ------------------------------------
  Total:                       2.03702

=========

K point (  10 ):   0.25000   0.25000   0.00000

Coulomb matrix read from spex.cor
Inverse dielectric matrices read from spex.cor 
Hermiticity of transformed Coulomb matrix: 5.5E-11

Add contribution to self-energy... done
                               Timings
  MT wave-func. products:      0.34845
  PW wave-func. products:      0.77698
  Matrix-vector products:      1.97328
  Transformations:             0.31591
  Exchange self-energy:        0.09675
  Frequency integration:       0.07132
  Tetrahedron weights:         0.00000
  MPI idle time:               0.00004      0.00004
  Other:                       0.17581
  ------------------------------------
  Total:                       3.75854

=========

K point (  11 ):   0.25000   0.25000   0.25000

Coulomb matrix read from spex.cor
Inverse dielectric matrices read from spex.cor 
Hermiticity of transformed Coulomb matrix: 8.0E-11

Add contribution to self-energy... done
                               Timings
  MT wave-func. products:      0.35319
  PW wave-func. products:      0.81671
  Matrix-vector products:      2.09691
  Transformations:             0.32587
  Exchange self-energy:        0.10264
  Frequency integration:       0.07217
  Tetrahedron weights:         0.00000
  MPI idle time:               0.00004      0.00004
  Other:                       0.17929
  ------------------------------------
  Total:                       3.94682

=========

K point (  12 ):   0.25000   0.25000   0.50000

Coulomb matrix read from spex.cor
Inverse dielectric matrices read from spex.cor 
Hermiticity of transformed Coulomb matrix: 9.9E-11

Add contribution to self-energy... done
                               Timings
  MT wave-func. products:      0.35819
  PW wave-func. products:      0.83158
  Matrix-vector products:      3.84255
  Transformations:             0.33718
  Exchange self-energy:        0.10383
  Frequency integration:       0.07332
  Tetrahedron weights:         0.00000
  MPI idle time:               0.00005      0.00005
  Other:                       0.17290
  ------------------------------------
  Total:                       5.71960


### subroutine: exchange_core ###

        k point       band      exchange (core contribution)
  (0.222,0.222,0.000)   1     -6.2406134
  (0.222,0.222,0.000)   2     -9.3321125
  (0.222,0.222,0.000)   3    -17.8041187
  (0.222,0.222,0.000)   4    -18.0361485
  (0.222,0.222,0.000)   5    -18.1834008
  (0.222,0.222,0.000)   6    -18.2966086
  (0.222,0.222,0.000)   7    -18.2398998
  (0.222,0.222,0.000)   8    -18.4230872
  (0.222,0.222,0.000)   9    -18.5451622
  (0.222,0.222,0.000)  10    -18.5276608
Timing:   0.14




### subroutine: quasiparticle ###

Number of mesh points even: No constraint will be used.

List of k points
    0   0.22222   0.22222   0.00000  (additional) 



#####################
### K POINT:    0 ###
#####################


--- DIAGONAL ELEMENTS [eV] ---

 Bd       vxc    sigmax    sigmac         Z        KS        HF          GW lin/dir 
  1 -24.63964 -35.42258   8.57930   0.73008  -8.12579 -18.90874  -9.69466   0.68774 
                          0.78913  -0.05065                      -9.66147   0.65484 
  2 -29.65449 -41.22388   8.91463   0.72198  -7.90064 -19.47004  -9.80138   0.46639 
                          0.53669  -0.02973                      -9.73323   0.45122 
  3 -42.30090 -55.57582   9.46172   0.73772  -6.39009 -19.66501  -9.20220   0.10524 
                          0.06572  -0.01489                      -9.10109   0.13086 
  4 -42.75849 -56.10698   9.52809   0.73777  -6.30290 -19.65139  -9.12043   0.10931 
                          0.06871  -0.01534                      -9.01979   0.13504 
  5 -42.95391 -56.31151   9.50531   0.73929  -6.24347 -19.60107  -9.09069   0.09333 
                          0.05616  -0.01345                      -8.98759   0.11907 
  6 -43.11014 -56.48420   9.49539   0.74070  -6.21786 -19.59193  -9.09024   0.08069 
                          0.04712  -0.01181                      -8.98507   0.10571 
  7 -43.00645 -56.34346   9.46495   0.74078  -6.21077 -19.54778  -9.07858   0.07834 
                          0.04522  -0.01158                      -8.97346   0.10354 
  8 -43.29853 -56.67029   9.46946   0.74204  -6.16241 -19.53417  -9.05771   0.06547 
                          0.03572  -0.00998                      -8.95029   0.09037 
  9 -43.55379 -56.96573   9.51239   0.74164  -6.11407 -19.52601  -9.00573   0.06983 
                          0.03869  -0.01055                      -8.89907   0.09504 
 10 -43.51460 -56.89162   9.48100   0.74207  -6.08321 -19.46024  -8.97398   0.06588 
                          0.03605  -0.01004                      -8.86699   0.09096 

Timing (quasiparticle equation):   0.10936

Timing:        34
