########################
######### SPEX #########
########################
Version 05.00  (Sep  5, 2019)
Execution time: Jan 18, 2020  16:41:13
Hostname: Ontology
MPI: 3,1


### subroutine: getinput ###

Basic parameters:
  Number of spins            =  1
            centers          =  4
            types            =  2
            equivalent atoms =  2  2
  Lattice parameter =      1.00000
  Lattice vectors   =      3.01411  -5.22060   0.00000
                           3.01411   5.22060   0.00000
                           0.00000   0.00000   9.80579
  Unit-cell volume  =    308.59778
  Reciprocal cutoff =      4.60000

Unit-cell geometry:
  # Ty  El              Coord.
  1  1  Ga   0.33333  -0.33333   0.00000
  2  1  Ga  -0.33333   0.33333   0.50000
  3  2  N    0.33333  -0.33333  -0.37700
  4  2  N   -0.33333   0.33333   0.12300

Symmetry information:
  Number of symmetry operations = 24
   #  Det           Axis           Angle   Syp  Inv
   1    1     --     --     --      --     Yes   1
   2   -1    1.00  -0.58  -0.00   180.00   No    2
   3   -1    1.00   0.58  -0.00   180.00   No    3
   4    1    0.00   0.00   1.00   120.00   Yes   9
   5    1    0.00   0.00   1.00   180.00   No    5
   6   -1    0.58   1.00  -0.00   180.00   Yes   6
   7   -1    1.00  -0.00  -0.00   180.00   Yes   7
   8    1    0.00   0.00   1.00    60.00   No   11
   9    1   -0.00  -0.00  -1.00   120.00   Yes   4
  10   -1   -0.00   1.00  -0.00   180.00   No   10
  11    1   -0.00  -0.00  -1.00    60.00   No    8
  12   -1   -0.58   1.00  -0.00   180.00   Yes  12
  13 - 24  Time reversal symmetries

##################
### Input file ###
##################
BZ       4 4 4
JOB      GW +:(1-30)
MPIKPT   
RESTART  
NBAND    200
KPT      +=(.80769,1.00000,0)

#  k point is converted from (0.80769,1.00000,0.00000) to (0.80769,0.00000,0.00000)

Info: Simpson and Lagrange integration is used.

Radial mesh and basis functions:
  Number of radial grid points:       759  429
  Number of radial basis functions:    19   18
  Angular momentum quantum number:      8    6
  Maximal index:                        3

Core states:
  Atom type  1  (Ga)
  nl      Energy
  1s  -375.34991
  2s   -45.88297
  3s    -4.96076
  2p   -39.88207
  3p    -3.15226
  Atom type  2  (N )
  nl      Energy
  1s   -13.54409
  Number of valence electrons:   36

Average Coulomb potential: -0.35487  ( -9.65657 eV )

Read wavefunctions from harddisc... done   ( Timing:    0.28 )

Maximal energy difference in deg. subspaces: 8.4E-13
Minimal energy difference between subspaces: 4.7E-07

Wave functions:
  Number of bands:             198 -  200  (  200 )
            k points (IBZ):     64  (  12 /  30 )
            G vectors:         724
  k points of IBZ:
    1  (0.00000,0.00000,0.00000)  [ 0.00000, 0.00000, 0.00000 ]
    2  (0.00000,0.00000,0.25000)  [ 0.00000, 0.00000, 0.02550 ]
    3  (0.00000,0.00000,0.50000)  [ 0.00000, 0.00000, 0.05099 ]
    4  (0.00000,0.25000,0.00000)  [ 0.04147, 0.02394, 0.00000 ]
    5  (0.00000,0.25000,0.25000)  [ 0.04147, 0.02394, 0.02550 ]
    6  (0.00000,0.25000,0.50000)  [ 0.04147, 0.02394, 0.05099 ]
    7  (0.00000,0.50000,0.00000)  [ 0.08294, 0.04789, 0.00000 ]
    8  (0.00000,0.50000,0.25000)  [ 0.08294, 0.04789, 0.02550 ]
    9  (0.00000,0.50000,0.50000)  [ 0.08294, 0.04789, 0.05099 ]
   10  (0.25000,0.25000,0.00000)  [ 0.08294, 0.00000, 0.00000 ]
   11  (0.25000,0.25000,0.25000)  [ 0.08294, 0.00000, 0.02550 ]
   12  (0.25000,0.25000,0.50000)  [ 0.08294, 0.00000, 0.05099 ]
  k points of EIBZ (shifted set):
   65  (0.80769,0.00000,0.00000)  [ 0.13398,-0.07736, 0.00000 ]
   66  (0.80769,0.00000,0.25000)  [ 0.13398,-0.07736, 0.02550 ]
   67  (0.80769,0.00000,0.50000)  [ 0.13398,-0.07736, 0.05099 ]
   68  (0.80769,0.25000,0.00000)  [ 0.17546,-0.05341, 0.00000 ]
   69  (0.80769,0.25000,0.25000)  [ 0.17546,-0.05341, 0.02550 ]
   70  (0.80769,0.25000,0.50000)  [ 0.17546,-0.05341, 0.05099 ]
   71  (0.80769,0.50000,0.00000)  [ 0.21693,-0.02947, 0.00000 ]
   72  (0.80769,0.50000,0.25000)  [ 0.21693,-0.02947, 0.02550 ]
   73  (0.80769,0.50000,0.50000)  [ 0.21693,-0.02947, 0.05099 ]
   74  (0.80769,0.75000,0.00000)  [ 0.25840,-0.00553, 0.00000 ]
   75  (0.80769,0.75000,0.25000)  [ 0.25840,-0.00553, 0.02550 ]
   76  (0.80769,0.75000,0.50000)  [ 0.25840,-0.00553, 0.05099 ]
   77  (0.05769,0.00000,0.00000)  [ 0.00957,-0.00553, 0.00000 ]
   78  (0.05769,0.00000,0.25000)  [ 0.00957,-0.00553, 0.02550 ]
   79  (0.05769,0.00000,0.50000)  [ 0.00957,-0.00553, 0.05099 ]
   80  (0.05769,0.25000,0.00000)  [ 0.05104, 0.01842, 0.00000 ]
   81  (0.05769,0.25000,0.25000)  [ 0.05104, 0.01842, 0.02550 ]
   82  (0.05769,0.25000,0.50000)  [ 0.05104, 0.01842, 0.05099 ]
   83  (0.05769,0.50000,0.00000)  [ 0.09251, 0.04236, 0.00000 ]
   84  (0.05769,0.50000,0.25000)  [ 0.09251, 0.04236, 0.02550 ]
   85  (0.05769,0.50000,0.50000)  [ 0.09251, 0.04236, 0.05099 ]
   86  (0.30769,0.00000,0.00000)  [ 0.05104,-0.02947, 0.00000 ]
   87  (0.30769,0.00000,0.25000)  [ 0.05104,-0.02947, 0.02550 ]
   88  (0.30769,0.00000,0.50000)  [ 0.05104,-0.02947, 0.05099 ]
   89  (0.30769,0.25000,0.00000)  [ 0.09251,-0.00553, 0.00000 ]
   90  (0.30769,0.25000,0.25000)  [ 0.09251,-0.00553, 0.02550 ]
   91  (0.30769,0.25000,0.50000)  [ 0.09251,-0.00553, 0.05099 ]
   92  (0.55769,0.00000,0.00000)  [ 0.09251,-0.05341, 0.00000 ]
   93  (0.55769,0.00000,0.25000)  [ 0.09251,-0.05341, 0.02550 ]
   94  (0.55769,0.00000,0.50000)  [ 0.09251,-0.05341, 0.05099 ]

Generate wavefunctions at equivalent k points... done   ( Timing:   0.26 )

Size of array cpw:   209.8 MB
Size of array cmt:   260.9 MB

The system is not a metal.
The Fermi energy is placed in the center of the band gap.
KS energy gap:    0.07059528 Ha   (  1.92099521 eV )
Fermi energy:     0.29316457 Ha   (  7.97741378 eV )
Maximal energy:   5.57248232 Ha
Electron count error of the shifted k-point set:  0.0000000000000000

Wave-function checksum: -1.077094187874E-01


### subroutine: checkinput ###

Overlap <core|core>
Atom type  1
1s  1.000000
2s -0.000000  1.000000
3s  0.000000 -0.000001  0.999961
2p  0.999418
3p -0.000329  0.999458
Atom type  2
1s  0.999983

Overlap <core|basis>
Atom type  1
         u(s)    udot(s)
1s  0.000000  0.000000
2s  0.000001  0.000000
3s  0.004767 -0.007551
         u(p)    udot(p)
2p -0.000106 -0.000031
3p  0.017150 -0.021254
Atom type  2
         u(s)    udot(s)
1s  0.003209 -0.002046

Average overlap <core|val>
Atom type  1
1s  0.000000
2s  0.000000
3s  0.000679
2p  0.000010  0.000010  0.000010
3p  0.002209  0.002205  0.002209
Atom type  2
1s  0.000234

Maximum overlap <core|val> at (band/kpoint)
Atom type  1
1s  0.000000 (033/ 001)
2s  0.000001 (033/ 001)
3s  0.004410 (156/ 003)
2p  0.000064 (024/ 003)  0.000064 (024/ 001)  0.000062 (023/ 003)
3p  0.011686 (121/ 003)  0.014817 (111/ 001)  0.011620 (124/ 079)
Atom type  2
1s  0.001623 (001/ 079)

Overlap <basis|basis>
Atom type  1
   u(s)  1.000000
udot(s) -0.000000  0.129862
   u(p)  1.000000
udot(p)  0.000000  0.075237
   u(d)  1.000000
udot(d) -0.000000  0.733838
 ulo(d)  0.410292 -0.767526  1.000000
   u(f)  1.000000
udot(f) -0.000000  0.020278
   u(g)  1.000000
udot(g) -0.000000  0.006703
   u(h)  1.000000
udot(h) -0.000000  0.003149
   u(i)  1.000000
udot(i)  0.000000  0.001726
   u(j)  1.000000
udot(j) -0.000000  0.001039
   u(k)  1.000000
udot(k) -0.000000  0.000667
Atom type  2
   u(s)  1.000000
udot(s)  0.000000  0.023146
   u(p)  1.000000
udot(p)  0.000000  0.036192
   u(d)  1.000000
udot(d) -0.000000  0.003612
   u(f)  1.000000
udot(f)  0.000000  0.001183
   u(g)  1.000000
udot(g) -0.000000  0.000520
   u(h)  1.000000
udot(h) -0.000000  0.000271
   u(i)  1.000000
udot(i) -0.000000  0.000157


### subroutine: mixedbasis ( Mode: vv ) ###

Mixed basis
  Plane-wave basis:
    Number of unique G vectors:   342
    Maximal number of G vectors:  233

  MT basis read in from spex.mb (mode: vv).
    Total number of product-basis functions:  264



##### Job index:  1 #####


### subroutine: correlation ###

< GW self-energy >
Calculate periodic function...done   ( Timing:    0.04 )

=========

K point (   1 ):   0.00000   0.00000   0.00000

Coulomb matrix read from spex.cor
Inverse dielectric matrices read from spex.cor
Invert dielectric tensor... done   ( Timing:    0.01 )
Hermiticity of transformed Coulomb matrix: 5.1E-11

Add contribution to self-energy... done
                               Timings
  MT wave-func. products:      1.45920
  PW wave-func. products:      0.45901
  Matrix-vector products:      2.35404
  Transformations:             0.30348
  Exchange self-energy:        0.16703
  Frequency integration:       0.02673
  Tetrahedron weights:         0.00000
  Gamma-point correction:      0.44503
  MPI idle time:               0.02286      0.02286
  Other:                       0.13276
  ------------------------------------
  Total:                       5.37014

=========

K point (   2 ):   0.00000   0.00000   0.25000

Coulomb matrix read from spex.cor
Inverse dielectric matrices read from spex.cor
Hermiticity of transformed Coulomb matrix: 5.9E-10

Add contribution to self-energy... done
                               Timings
  MT wave-func. products:      1.41272
  PW wave-func. products:      0.35954
  Matrix-vector products:      2.05245
  Transformations:             0.23856
  Exchange self-energy:        0.11384
  Frequency integration:       0.02941
  Tetrahedron weights:         0.00000
  MPI idle time:               0.01553      0.01553
  Other:                       0.14573
  ------------------------------------
  Total:                       4.36777

=========

K point (   3 ):   0.00000   0.00000   0.50000

Coulomb matrix read from spex.cor
Inverse dielectric matrices read from spex.cor
Hermiticity of transformed Coulomb matrix: 1.8E-10

Add contribution to self-energy... done
                               Timings
  MT wave-func. products:      1.37016
  PW wave-func. products:      0.41549
  Matrix-vector products:      2.10740
  Transformations:             0.25490
  Exchange self-energy:        0.12094
  Frequency integration:       0.06303
  Tetrahedron weights:         0.00000
  MPI idle time:               0.00002      0.01816
  Other:                       0.17807
  ------------------------------------
  Total:                       4.51002

=========

K point (   4 ):   0.00000   0.25000   0.00000

Coulomb matrix read from spex.cor
Inverse dielectric matrices read from spex.cor
Hermiticity of transformed Coulomb matrix: 8.5E-11

Add contribution to self-energy... done
                               Timings
  MT wave-func. products:      3.11855
  PW wave-func. products:      0.93220
  Matrix-vector products:      9.47882
  Transformations:             1.12857
  Exchange self-energy:        0.22337
  Frequency integration:       0.31587
  Tetrahedron weights:         0.00000
  MPI idle time:               0.01862      0.03477
  Other:                       0.76135
  ------------------------------------
  Total:                      15.97735

=========

K point (   5 ):   0.00000   0.25000   0.25000

Coulomb matrix read from spex.cor
Inverse dielectric matrices read from spex.cor
Hermiticity of transformed Coulomb matrix: 9.7E-11

Add contribution to self-energy... done
                               Timings
  MT wave-func. products:      3.63079
  PW wave-func. products:      0.97709
  Matrix-vector products:      9.23240
  Transformations:             1.12373
  Exchange self-energy:        0.25383
  Frequency integration:       0.29481
  Tetrahedron weights:         0.00000
  MPI idle time:               0.01148      0.02914
  Other:                       0.60115
  ------------------------------------
  Total:                      16.12528

=========

K point (   6 ):   0.00000   0.25000   0.50000

Coulomb matrix read from spex.cor
Inverse dielectric matrices read from spex.cor
Hermiticity of transformed Coulomb matrix: 9.8E-11

Add contribution to self-energy... done
                               Timings
  MT wave-func. products:      3.21329
  PW wave-func. products:      0.92182
  Matrix-vector products:      9.90993
  Transformations:             1.16421
  Exchange self-energy:        0.22886
  Frequency integration:       0.20531
  Tetrahedron weights:         0.00000
  MPI idle time:               0.02425      0.02448
  Other:                       0.49007
  ------------------------------------
  Total:                      16.15774

=========

K point (   7 ):   0.00000   0.50000   0.00000

Coulomb matrix read from spex.cor
Inverse dielectric matrices read from spex.cor
Hermiticity of transformed Coulomb matrix: 1.0E-10

Add contribution to self-energy... done
                               Timings
  MT wave-func. products:      2.11241
  PW wave-func. products:      0.55090
  Matrix-vector products:      3.85697
  Transformations:             0.55243
  Exchange self-energy:        0.20596
  Frequency integration:       0.06932
  Tetrahedron weights:         0.00000
  MPI idle time:               0.00003      0.02847
  Other:                       0.41801
  ------------------------------------
  Total:                       7.76604

=========

K point (   8 ):   0.00000   0.50000   0.25000

Coulomb matrix read from spex.cor
Inverse dielectric matrices read from spex.cor
Hermiticity of transformed Coulomb matrix: 5.3E-11

Add contribution to self-energy... done
                               Timings
  MT wave-func. products:      2.07440
  PW wave-func. products:      0.54311
  Matrix-vector products:      4.14491
  Transformations:             0.55270
  Exchange self-energy:        0.13971
  Frequency integration:       0.08140
  Tetrahedron weights:         0.00000
  MPI idle time:               0.00003      0.01381
  Other:                       0.33508
  ------------------------------------
  Total:                       7.87134

=========

K point (   9 ):   0.00000   0.50000   0.50000

Coulomb matrix read from spex.cor
Inverse dielectric matrices read from spex.cor
Hermiticity of transformed Coulomb matrix: 4.1E-11

Add contribution to self-energy... done
                               Timings
  MT wave-func. products:      2.91187
  PW wave-func. products:      0.54839
  Matrix-vector products:      4.90456
  Transformations:             0.61979
  Exchange self-energy:        0.14477
  Frequency integration:       0.14974
  Tetrahedron weights:         0.00000
  MPI idle time:               0.01226      0.03007
  Other:                       0.33509
  ------------------------------------
  Total:                       9.62646

=========

K point (  10 ):   0.25000   0.25000   0.00000

Coulomb matrix read from spex.cor
Inverse dielectric matrices read from spex.cor
Hermiticity of transformed Coulomb matrix: 3.6E-11

Add contribution to self-energy... done
                               Timings
  MT wave-func. products:      3.49121
  PW wave-func. products:      0.72899
  Matrix-vector products:      6.42979
  Transformations:             0.85730
  Exchange self-energy:        0.22598
  Frequency integration:       0.15240
  Tetrahedron weights:         0.00000
  MPI idle time:               0.05872      0.07956
  Other:                       0.52008
  ------------------------------------
  Total:                      12.46446

=========

K point (  11 ):   0.25000   0.25000   0.25000

Coulomb matrix read from spex.cor
Inverse dielectric matrices read from spex.cor
Hermiticity of transformed Coulomb matrix: 5.4E-11

Add contribution to self-energy... done
                               Timings
  MT wave-func. products:      4.60248
  PW wave-func. products:      0.87738
  Matrix-vector products:      7.62000
  Transformations:             0.96745
  Exchange self-energy:        0.42026
  Frequency integration:       0.16621
  Tetrahedron weights:         0.00000
  MPI idle time:               0.00003      0.03545
  Other:                       0.59027
  ------------------------------------
  Total:                      15.24407

=========

K point (  12 ):   0.25000   0.25000   0.50000

Coulomb matrix read from spex.cor
Inverse dielectric matrices read from spex.cor
Hermiticity of transformed Coulomb matrix: 6.5E-11

Add contribution to self-energy... done
                               Timings
  MT wave-func. products:      4.47780
  PW wave-func. products:      0.88123
  Matrix-vector products:     11.95721
  Transformations:             1.07883
  Exchange self-energy:        0.35968
  Frequency integration:       0.22595
  Tetrahedron weights:         0.00000
  MPI idle time:               0.00003      0.07384
  Other:                       0.59798
  ------------------------------------
  Total:                      19.57871


### subroutine: exchange_core ###

        k point       band      exchange (core contribution)
  (0.808,0.000,0.000)   1     -2.5203809
  (0.808,0.000,0.000)   2     -8.3868961
  (0.808,0.000,0.000)   3    -17.8011077
  (0.808,0.000,0.000)   4    -17.8611955
  (0.808,0.000,0.000)   5    -17.7843015
  (0.808,0.000,0.000)   6    -18.0819420
  (0.808,0.000,0.000)   7    -17.0962549
  (0.808,0.000,0.000)   8    -18.3796697
  (0.808,0.000,0.000)   9    -18.4577998
  (0.808,0.000,0.000)  10    -18.4233605
  (0.808,0.000,0.000)  11    -18.6732928
  (0.808,0.000,0.000)  12    -12.0874266
  (0.808,0.000,0.000)  13     -1.3881791
  (0.808,0.000,0.000)  14     -1.9125276
  (0.808,0.000,0.000)  15     -2.4982197
  (0.808,0.000,0.000)  16     -1.7165175
  (0.808,0.000,0.000)  17     -2.0052921
  (0.808,0.000,0.000)  18     -2.0764911
  (0.808,0.000,0.000)  19     -1.8065648
  (0.808,0.000,0.000)  20     -2.1999385
  (0.808,0.000,0.000)  21     -1.5542375
  (0.808,0.000,0.000)  22     -1.6839766
  (0.808,0.000,0.000)  23     -1.7986212
  (0.808,0.000,0.000)  24     -2.0254261
  (0.808,0.000,0.000)  25     -1.9120393
  (0.808,0.000,0.000)  26     -1.9189935
  (0.808,0.000,0.000)  27     -1.5445015
  (0.808,0.000,0.000)  28     -1.4752038
  (0.808,0.000,0.000)  29     -1.2486409
  (0.808,0.000,0.000)  30     -1.7227822
Timing:   0.09




### subroutine: quasiparticle ###

Number of mesh points even: No constraint will be used.

List of k points
    0   0.80769   0.00000   0.00000  (additional)



#####################
### K POINT:    0 ###
#####################


--- DIAGONAL ELEMENTS [eV] ---

 Bd       vxc    sigmax    sigmac         Z        KS        HF          GW lin/dir
  1 -18.32913 -28.20923   8.20594   0.73596  -8.63303 -18.51312  -9.76911   0.97669
                          1.13454  -0.08464                      -9.77259   0.95468
  2 -28.11856 -39.45009   8.81677   0.72554  -7.97914 -19.31066  -9.78054   0.54255
                          0.61790  -0.03747                      -9.72469   0.51874
  3 -42.35160 -55.65763   9.50555   0.73681  -6.39570 -19.70173  -9.19474   0.11539
                          0.07371  -0.01607                      -9.09493   0.14103
  4 -42.46341 -55.78429   9.51864   0.73657  -6.37699 -19.69787  -9.17648   0.11317
                          0.07161  -0.01589                      -9.07639   0.13910
  5 -42.29854 -55.56675   9.47237   0.73738  -6.32500 -19.59321  -9.12281   0.11417
                          0.07265  -0.01596                      -9.02335   0.13984
  6 -42.82271 -56.17989   9.52751   0.73814  -6.29326 -19.65044  -9.11912   0.10576
                          0.06600  -0.01490                      -9.01785   0.13140
  7 -41.16059 -54.22619   9.38364   0.73525  -6.27389 -19.33950  -8.97887   0.15449
                          0.10599  -0.02079                      -8.88698   0.17946
  8 -43.21143 -56.55743   9.43710   0.74260  -6.19611 -19.54211  -9.09858   0.05629
                          0.02936  -0.00882                      -8.98981   0.08067
  9 -43.35531 -56.71976   9.44919   0.74278  -6.16551 -19.52995  -9.07342   0.05431
                          0.02794  -0.00857                      -8.96420   0.07868
 10 -43.31520 -56.66847   9.46036   0.74219  -6.11339 -19.46666  -9.00228   0.06740
                          0.03731  -0.01020                      -8.89567   0.09221
 11 -43.75577 -57.16945   9.49465   0.74287  -6.06500 -19.47868  -8.97608   0.05722
                          0.02984  -0.00894                      -8.86734   0.08197
 12 -34.03158 -45.35227   8.61432   0.73899  -4.60046 -15.92115  -6.57807   0.43419
                          0.35968  -0.06222                      -6.57344   0.43124
 13 -14.88678 -20.31956   4.18447   0.73446   0.51569  -4.91708  -0.39939   0.08417
                          0.07527  -0.02313                      -0.38731   0.08768
 14 -17.25877 -21.64916   3.30940   0.76449   3.92196  -0.46843   3.09557   0.00837
                          0.00549  -0.00386                       3.10374   0.00967
 15 -18.99571 -22.91309   3.02406   0.77050   4.95031   1.03294   4.26201   0.00303
                          0.00173  -0.00190                       4.26703   0.00369
 16 -18.13764 -22.32430   3.23639   0.76860   5.35919   1.17252   4.62881   0.00182
                          0.00100  -0.00111                       4.63477   0.00229
 17 -19.49578 -23.09893   2.88132   0.77427   6.61399   3.01084   6.05510   0.00059
                          0.00044  -0.00034                       6.05804   0.00068
 18 -19.78235 -23.55556   3.02858   0.77318   6.70672   2.93351   6.13099   0.00076
                          0.00053  -0.00048                       6.13416   0.00089
 19 -16.22912 -11.59234  -3.69872   0.79281  10.75469  15.39147  11.49841   0.00169
                          0.00514  -0.00254                      11.49465  -0.00059
 20 -15.64049 -10.07485  -4.42011   0.80249  12.78488  18.35052  13.70416  -0.00521
                         -0.00104  -0.00382                      13.69685  -0.00750
 21 -14.00837  -8.17400  -4.83176   0.79514  14.96254  20.79691  15.75961  -0.02134
                         -0.01525  -0.00919                      15.75353  -0.02330
 22 -14.53091  -8.63331  -4.92973   0.78820  15.85827  21.75587  16.62085  -0.03098
                         -0.02463  -0.01195                      16.61506  -0.03287
 23 -14.46065  -8.03944  -5.30582   0.78716  17.35772  23.77893  18.23494  -0.05465
                         -0.04516  -0.01712                      18.22708  -0.05741
 24 -13.97754  -7.80228  -5.12293   0.80065  17.65487  23.83013  18.49681  -0.04796
                         -0.03957  -0.01547                      18.49002  -0.05024
 25 -13.99724  -7.65346  -5.33991   0.79097  18.50686  24.85064  19.29965  -0.06831
                         -0.06035  -0.02049                      19.29323  -0.07048
 26 -14.81542  -8.02722  -5.63049   0.77784  19.41979  26.20799  20.31807  -0.09746
                         -0.08727  -0.02555                      20.30915  -0.10046
 27 -12.83449  -6.88553  -5.18419   0.79996  19.82037  25.76933  20.43030  -0.08156
                         -0.07971  -0.02327                      20.42668  -0.08252
 28 -12.53645  -6.60657  -5.26155   0.80089  22.12231  28.05220  22.65354  -0.12507
                         -0.13035  -0.03093                      22.65069  -0.12546
 29 -11.47216  -4.86763  -6.11013   0.77642  23.57394  30.17848  23.94112  -0.26066
                         -0.30033  -0.05558                      23.93896  -0.25962
 30 -12.57123  -5.39906  -6.48276   0.77251  26.54744  33.71961  27.04064  -0.44555
                         -0.50752  -0.07758                      27.03605  -0.44296

Timing (quasiparticle equation):   0.44511

Timing:       137
