########################
######### SPEX #########
########################
Version 05.00  (Sep  5, 2019)
Execution time: Jan 17, 2020  23:09:41
Hostname: login18-1.hpc.itc.rwth-aachen.de
MPI: 1,1


### subroutine: getinput ###

Basic parameters:
  Number of spins            =  1
            centers          =  4
            types            =  2
            equivalent atoms =  2  2
  Lattice parameter =      1.00000
  Lattice vectors   =      3.01411  -5.22060   0.00000
                           3.01411   5.22060   0.00000
                           0.00000   0.00000   9.80579
  Unit-cell volume  =    308.59778
  Reciprocal cutoff =      4.60000

Unit-cell geometry:
  # Ty  El              Coord.
  1  1  Ga   0.33333  -0.33333   0.00000
  2  1  Ga  -0.33333   0.33333   0.50000
  3  2  N    0.33333  -0.33333  -0.37700
  4  2  N   -0.33333   0.33333   0.12300

Symmetry information:
  Number of symmetry operations = 24
   #  Det           Axis           Angle   Syp  Inv
   1    1     --     --     --      --     Yes   1
   2   -1    1.00  -0.58   0.00   180.00   No    2
   3   -1    1.00   0.58   0.00   180.00   No    3
   4    1    0.00   0.00   1.00   120.00   Yes   9
   5    1    0.00   0.00   1.00   180.00   No    5
   6   -1    0.58   1.00   0.00   180.00   Yes   6
   7   -1    1.00   0.00   0.00   180.00   Yes   7
   8    1    0.00   0.00   1.00    60.00   No   11
   9    1    0.00   0.00  -1.00   120.00   Yes   4
  10   -1    0.00   1.00   0.00   180.00   No   10
  11    1    0.00   0.00  -1.00    60.00   No    8
  12   -1   -0.58   1.00   0.00   180.00   Yes  12
  13 - 24  Time reversal symmetries

##################
### Input file ###
##################
BZ       4 4 4
JOB      GW +:(1-10)
NBAND    200
RESTART  
KPT      +=(.99500,1.00000,0)
 
#  k point is converted from (0.99500,1.00000,0.00000) to (0.99500,0.00000,0.00000)

Info: Simpson and Lagrange integration is used.

Radial mesh and basis functions:
  Number of radial grid points:       759  429
  Number of radial basis functions:    19   18
  Angular momentum quantum number:      8    6
  Maximal index:                        3

Core states:
  Atom type  1  (Ga)
  nl      Energy
  1s  -375.34991
  2s   -45.88297
  3s    -4.96076
  2p   -39.88207
  3p    -3.15226
  Atom type  2  (N )
  nl      Energy
  1s   -13.54409
  Number of valence electrons:   36

Average Coulomb potential: -0.35487  ( -9.65657 eV )

Read wavefunctions from harddisc... done   ( Timing:    0.21 )

Maximal energy difference in deg. subspaces: 9.0E-12
Minimal energy difference between subspaces: 2.1E-07

Wave functions:
  Number of bands:             198 -  200  (  200 )
            k points (IBZ):     64  (  12 /  30 )
            G vectors:         750
  k points of IBZ:
    1  (0.00000,0.00000,0.00000)  [ 0.00000, 0.00000, 0.00000 ]
    2  (0.00000,0.00000,0.25000)  [ 0.00000, 0.00000, 0.02550 ]
    3  (0.00000,0.00000,0.50000)  [ 0.00000, 0.00000, 0.05099 ]
    4  (0.00000,0.25000,0.00000)  [ 0.04147, 0.02394, 0.00000 ]
    5  (0.00000,0.25000,0.25000)  [ 0.04147, 0.02394, 0.02550 ]
    6  (0.00000,0.25000,0.50000)  [ 0.04147, 0.02394, 0.05099 ]
    7  (0.00000,0.50000,0.00000)  [ 0.08294, 0.04789, 0.00000 ]
    8  (0.00000,0.50000,0.25000)  [ 0.08294, 0.04789, 0.02550 ]
    9  (0.00000,0.50000,0.50000)  [ 0.08294, 0.04789, 0.05099 ]
   10  (0.25000,0.25000,0.00000)  [ 0.08294, 0.00000, 0.00000 ]
   11  (0.25000,0.25000,0.25000)  [ 0.08294, 0.00000, 0.02550 ]
   12  (0.25000,0.25000,0.50000)  [ 0.08294, 0.00000, 0.05099 ]
  k points of EIBZ (shifted set):
   65  (0.99500,0.00000,0.00000)  [ 0.16506,-0.09530, 0.00000 ]
   66  (0.99500,0.00000,0.25000)  [ 0.16506,-0.09530, 0.02550 ]
   67  (0.99500,0.00000,0.50000)  [ 0.16506,-0.09530, 0.05099 ]
   68  (0.99500,0.25000,0.00000)  [ 0.20653,-0.07135, 0.00000 ]
   69  (0.99500,0.25000,0.25000)  [ 0.20653,-0.07135, 0.02550 ]
   70  (0.99500,0.25000,0.50000)  [ 0.20653,-0.07135, 0.05099 ]
   71  (0.99500,0.50000,0.00000)  [ 0.24800,-0.04741, 0.00000 ]
   72  (0.99500,0.50000,0.25000)  [ 0.24800,-0.04741, 0.02550 ]
   73  (0.99500,0.50000,0.50000)  [ 0.24800,-0.04741, 0.05099 ]
   74  (0.99500,0.75000,0.00000)  [ 0.28947,-0.02346, 0.00000 ]
   75  (0.99500,0.75000,0.25000)  [ 0.28947,-0.02346, 0.02550 ]
   76  (0.99500,0.75000,0.50000)  [ 0.28947,-0.02346, 0.05099 ]
   77  (0.24500,0.00000,0.00000)  [ 0.04064,-0.02346, 0.00000 ]
   78  (0.24500,0.00000,0.25000)  [ 0.04064,-0.02346, 0.02550 ]
   79  (0.24500,0.00000,0.50000)  [ 0.04064,-0.02346, 0.05099 ]
   80  (0.24500,0.25000,0.00000)  [ 0.08211, 0.00048, 0.00000 ]
   81  (0.24500,0.25000,0.25000)  [ 0.08211, 0.00048, 0.02550 ]
   82  (0.24500,0.25000,0.50000)  [ 0.08211, 0.00048, 0.05099 ]
   83  (0.24500,0.50000,0.00000)  [ 0.12359, 0.02442, 0.00000 ]
   84  (0.24500,0.50000,0.25000)  [ 0.12359, 0.02442, 0.02550 ]
   85  (0.24500,0.50000,0.50000)  [ 0.12359, 0.02442, 0.05099 ]
   86  (0.49500,0.00000,0.00000)  [ 0.08211,-0.04741, 0.00000 ]
   87  (0.49500,0.00000,0.25000)  [ 0.08211,-0.04741, 0.02550 ]
   88  (0.49500,0.00000,0.50000)  [ 0.08211,-0.04741, 0.05099 ]
   89  (0.49500,0.25000,0.00000)  [ 0.12359,-0.02346, 0.00000 ]
   90  (0.49500,0.25000,0.25000)  [ 0.12359,-0.02346, 0.02550 ]
   91  (0.49500,0.25000,0.50000)  [ 0.12359,-0.02346, 0.05099 ]
   92  (0.74500,0.00000,0.00000)  [ 0.12359,-0.07135, 0.00000 ]
   93  (0.74500,0.00000,0.25000)  [ 0.12359,-0.07135, 0.02550 ]
   94  (0.74500,0.00000,0.50000)  [ 0.12359,-0.07135, 0.05099 ]

Generate wavefunctions at equivalent k points... done   ( Timing:   0.30 )

Size of array cpw:   209.8 MB
Size of array cmt:   260.9 MB

The system is not a metal.
The Fermi energy is placed in the center of the band gap.
KS energy gap:    0.07059528 Ha   (  1.92099521 eV )
Fermi energy:     0.29316457 Ha   (  7.97741378 eV )
Maximal energy:   5.57583970 Ha
Electron count error of the shifted k-point set:  0.0000000000000000

Wave-function checksum: -9.498183701761E-02


### subroutine: checkinput ###

Overlap <core|core>
Atom type  1
1s  1.000000 
2s -0.000000  1.000000 
3s  0.000000 -0.000001  0.999961 
2p  0.999418 
3p -0.000329  0.999458 
Atom type  2
1s  0.999983 

Overlap <core|basis>
Atom type  1
         u(s)    udot(s)
1s  0.000000  0.000000 
2s  0.000001  0.000000 
3s  0.004767 -0.007551 
         u(p)    udot(p)
2p -0.000106 -0.000031 
3p  0.017150 -0.021254 
Atom type  2
         u(s)    udot(s)
1s  0.003209 -0.002046 

Average overlap <core|val>
Atom type  1
1s  0.000000
2s  0.000000
3s  0.000679
2p  0.000010  0.000010  0.000010
3p  0.002211  0.002206  0.002211
Atom type  2
1s  0.000234

Maximum overlap <core|val> at (band/kpoint)
Atom type  1
1s  0.000000 (022/ 009)
2s  0.000001 (022/ 009)
3s  0.004059 (098/ 088)
2p  0.000060 (025/ 003)  0.000064 (024/ 065)  0.000067 (026/ 003)
3p  0.012578 (124/ 067)  0.014817 (111/ 001)  0.013262 (124/ 003)
Atom type  2
1s  0.001529 (002/ 003)

Overlap <basis|basis>
Atom type  1
   u(s)  1.000000 
udot(s)  0.000000  0.129862 
   u(p)  1.000000 
udot(p) -0.000000  0.075237 
   u(d)  1.000000 
udot(d) -0.000000  0.733838 
 ulo(d)  0.410292 -0.767526  1.000000 
   u(f)  1.000000 
udot(f) -0.000000  0.020278 
   u(g)  1.000000 
udot(g) -0.000000  0.006703 
   u(h)  1.000000 
udot(h)  0.000000  0.003149 
   u(i)  1.000000 
udot(i) -0.000000  0.001726 
   u(j)  1.000000 
udot(j)  0.000000  0.001039 
   u(k)  1.000000 
udot(k) -0.000000  0.000667 
Atom type  2
   u(s)  1.000000 
udot(s)  0.000000  0.023146 
   u(p)  1.000000 
udot(p)  0.000000  0.036192 
   u(d)  1.000000 
udot(d)  0.000000  0.003612 
   u(f)  1.000000 
udot(f)  0.000000  0.001183 
   u(g)  1.000000 
udot(g)  0.000000  0.000520 
   u(h)  1.000000 
udot(h) -0.000000  0.000271 
   u(i)  1.000000 
udot(i)  0.000000  0.000157 


### subroutine: mixedbasis ( Mode: vv ) ###

Mixed basis
  Plane-wave basis:
    Number of unique G vectors:   358
    Maximal number of G vectors:  233

  MT basis read in from spex.mb (mode: vv).
    Total number of product-basis functions:  264



##### Job index:  1 #####


### subroutine: correlation ###

< GW self-energy >
Calculate periodic function...done   ( Timing:    0.09 )

=========

K point (   1 ):   0.00000   0.00000   0.00000

Coulomb matrix read from spex.cor
Inverse dielectric matrices read from spex.cor 
Invert dielectric tensor... done   ( Timing:    0.02 )
Hermiticity of transformed Coulomb matrix: 6.8E-11

Add contribution to self-energy... done
                               Timings
  MT wave-func. products:      0.11527
  PW wave-func. products:      0.28448
  Matrix-vector products:      0.35039
  Transformations:             0.08256
  Exchange self-energy:        0.06552
  Frequency integration:       0.01772
  Tetrahedron weights:         0.00000
  Gamma-point correction:      1.34429
  MPI idle time:               0.00007      0.00007
  Other:                       0.05265
  ------------------------------------
  Total:                       2.31295

=========

K point (   2 ):   0.00000   0.00000   0.25000

Coulomb matrix read from spex.cor
Inverse dielectric matrices read from spex.cor 
Hermiticity of transformed Coulomb matrix: 8.7E-10

Add contribution to self-energy... done
                               Timings
  MT wave-func. products:      0.10793
  PW wave-func. products:      0.25009
  Matrix-vector products:      0.31667
  Transformations:             0.07733
  Exchange self-energy:        0.05054
  Frequency integration:       0.01737
  Tetrahedron weights:         0.00000
  MPI idle time:               0.00002      0.00002
  Other:                       0.04807
  ------------------------------------
  Total:                       0.86802

=========

K point (   3 ):   0.00000   0.00000   0.50000

Coulomb matrix read from spex.cor
Inverse dielectric matrices read from spex.cor 
Hermiticity of transformed Coulomb matrix: 2.4E-10

Add contribution to self-energy... done
                               Timings
  MT wave-func. products:      0.10987
  PW wave-func. products:      0.23082
  Matrix-vector products:      0.50947
  Transformations:             0.07684
  Exchange self-energy:        0.04850
  Frequency integration:       0.01763
  Tetrahedron weights:         0.00000
  MPI idle time:               0.00004      0.00004
  Other:                       0.04969
  ------------------------------------
  Total:                       1.04286

=========

K point (   4 ):   0.00000   0.25000   0.00000

Coulomb matrix read from spex.cor
Inverse dielectric matrices read from spex.cor 
Hermiticity of transformed Coulomb matrix: 1.5E-10

Add contribution to self-energy... done
                               Timings
  MT wave-func. products:      0.35126
  PW wave-func. products:      0.81521
  Matrix-vector products:      2.17022
  Transformations:             0.31399
  Exchange self-energy:        0.10073
  Frequency integration:       0.07059
  Tetrahedron weights:         0.00000
  MPI idle time:               0.00004      0.00004
  Other:                       0.17596
  ------------------------------------
  Total:                       3.99800

=========

K point (   5 ):   0.00000   0.25000   0.25000

Coulomb matrix read from spex.cor
Inverse dielectric matrices read from spex.cor 
Hermiticity of transformed Coulomb matrix: 1.5E-10

Add contribution to self-energy... done
                               Timings
  MT wave-func. products:      0.34619
  PW wave-func. products:      0.83566
  Matrix-vector products:      2.24696
  Transformations:             0.31662
  Exchange self-energy:        0.10298
  Frequency integration:       0.07293
  Tetrahedron weights:         0.00000
  MPI idle time:               0.00005      0.00005
  Other:                       0.17712
  ------------------------------------
  Total:                       4.09850

=========

K point (   6 ):   0.00000   0.25000   0.50000

Coulomb matrix read from spex.cor
Inverse dielectric matrices read from spex.cor 
Hermiticity of transformed Coulomb matrix: 1.4E-10

Add contribution to self-energy... done
                               Timings
  MT wave-func. products:      0.34559
  PW wave-func. products:      0.83412
  Matrix-vector products:      2.26817
  Transformations:             0.32087
  Exchange self-energy:        0.09976
  Frequency integration:       0.07162
  Tetrahedron weights:         0.00000
  MPI idle time:               0.00004      0.00004
  Other:                       0.17783
  ------------------------------------
  Total:                       4.11801

=========

K point (   7 ):   0.00000   0.50000   0.00000

Coulomb matrix read from spex.cor
Inverse dielectric matrices read from spex.cor 
Hermiticity of transformed Coulomb matrix: 1.3E-10

Add contribution to self-energy... done
                               Timings
  MT wave-func. products:      0.17854
  PW wave-func. products:      0.43128
  Matrix-vector products:      0.68805
  Transformations:             0.14899
  Exchange self-energy:        0.07232
  Frequency integration:       0.03451
  Tetrahedron weights:         0.00000
  MPI idle time:               0.00002      0.00002
  Other:                       0.08928
  ------------------------------------
  Total:                       1.64298

=========

K point (   8 ):   0.00000   0.50000   0.25000

Coulomb matrix read from spex.cor
Inverse dielectric matrices read from spex.cor 
Hermiticity of transformed Coulomb matrix: 7.9E-11

Add contribution to self-energy... done
                               Timings
  MT wave-func. products:      0.17460
  PW wave-func. products:      0.42071
  Matrix-vector products:      0.62689
  Transformations:             0.14277
  Exchange self-energy:        0.06437
  Frequency integration:       0.03327
  Tetrahedron weights:         0.00000
  MPI idle time:               0.00001      0.00001
  Other:                       0.08619
  ------------------------------------
  Total:                       1.54881

=========

K point (   9 ):   0.00000   0.50000   0.50000

Coulomb matrix read from spex.cor
Inverse dielectric matrices read from spex.cor 
Hermiticity of transformed Coulomb matrix: 5.5E-11

Add contribution to self-energy... done
                               Timings
  MT wave-func. products:      0.17610
  PW wave-func. products:      0.40880
  Matrix-vector products:      1.04894
  Transformations:             0.13725
  Exchange self-energy:        0.06038
  Frequency integration:       0.03380
  Tetrahedron weights:         0.00000
  MPI idle time:               0.00004      0.00004
  Other:                       0.08744
  ------------------------------------
  Total:                       1.95275

=========

K point (  10 ):   0.25000   0.25000   0.00000

Coulomb matrix read from spex.cor
Inverse dielectric matrices read from spex.cor 
Hermiticity of transformed Coulomb matrix: 5.5E-11

Add contribution to self-energy... done
                               Timings
  MT wave-func. products:      0.25070
  PW wave-func. products:      0.57686
  Matrix-vector products:      1.40077
  Transformations:             0.22547
  Exchange self-energy:        0.07836
  Frequency integration:       0.05033
  Tetrahedron weights:         0.00000
  MPI idle time:               0.00002      0.00002
  Other:                       0.12692
  ------------------------------------
  Total:                       2.70942

=========

K point (  11 ):   0.25000   0.25000   0.25000

Coulomb matrix read from spex.cor
Inverse dielectric matrices read from spex.cor 
Hermiticity of transformed Coulomb matrix: 8.0E-11

Add contribution to self-energy... done
                               Timings
  MT wave-func. products:      0.26374
  PW wave-func. products:      0.64105
  Matrix-vector products:      1.53210
  Transformations:             0.24435
  Exchange self-energy:        0.08322
  Frequency integration:       0.05209
  Tetrahedron weights:         0.00000
  MPI idle time:               0.00004      0.00004
  Other:                       0.13188
  ------------------------------------
  Total:                       2.94847

=========

K point (  12 ):   0.25000   0.25000   0.50000

Coulomb matrix read from spex.cor
Inverse dielectric matrices read from spex.cor 
Hermiticity of transformed Coulomb matrix: 9.9E-11

Add contribution to self-energy... done
                               Timings
  MT wave-func. products:      0.27074
  PW wave-func. products:      0.66568
  Matrix-vector products:      3.02370
  Transformations:             0.25375
  Exchange self-energy:        0.08623
  Frequency integration:       0.05726
  Tetrahedron weights:         0.00000
  MPI idle time:               0.00002      0.00002
  Other:                       0.13459
  ------------------------------------
  Total:                       4.49197


### subroutine: exchange_core ###

        k point       band      exchange (core contribution)
  (0.995,0.000,0.000)   1     -1.5973463
  (0.995,0.000,0.000)   2     -7.6800055
  (0.995,0.000,0.000)   3    -17.7540574
  (0.995,0.000,0.000)   4    -17.7614160
  (0.995,0.000,0.000)   5    -17.7608801
  (0.995,0.000,0.000)   6    -17.9243525
  (0.995,0.000,0.000)   7    -17.9244422
  (0.995,0.000,0.000)   8    -18.4567844
  (0.995,0.000,0.000)   9    -18.4568305
  (0.995,0.000,0.000)  10    -18.6577025
Timing:   0.14




### subroutine: quasiparticle ###

Number of mesh points even: No constraint will be used.

List of k points
    0   0.99500   0.00000   0.00000  (additional) 



#####################
### K POINT:    0 ###
#####################


--- DIAGONAL ELEMENTS [eV] ---

 Bd       vxc    sigmax    sigmac         Z        KS        HF          GW lin/dir 
  1 -16.62306 -26.32420   8.14036   0.73652  -8.95564 -18.65678  -9.98352   1.07242 
                          1.24977  -0.09735                      -9.99012   1.05978 
  2 -26.95033 -38.10657   8.73699   0.72819  -8.05456 -19.21080  -9.78723   0.59690 
                          0.67750  -0.04280                      -9.74032   0.56812 
  3 -42.27230 -55.57596   9.50614   0.73650  -6.43402 -19.73768  -9.22972   0.11583 
                          0.07413  -0.01612                      -9.12992   0.14141 
  4 -42.29410 -55.60057   9.51230   0.73609  -6.41957 -19.72605  -9.21122   0.11558 
                          0.07361  -0.01618                      -9.11141   0.14148 
  5 -42.29316 -55.59942   9.51218   0.73609  -6.41951 -19.72577  -9.21110   0.11560 
                          0.07363  -0.01618                      -9.11129   0.14151 
  6 -42.55043 -55.87453   9.50627   0.73765  -6.35884 -19.68294  -9.17401   0.10840 
                          0.06825  -0.01521                      -9.07320   0.13392 
  7 -42.55060 -55.87476   9.50631   0.73765  -6.35881 -19.68297  -9.17399   0.10841 
                          0.06826  -0.01521                      -9.07318   0.13393 
  8 -43.35332 -56.71041   9.44164   0.74295  -6.16955 -19.52664  -9.07833   0.05265 
                          0.02676  -0.00837                      -8.96903   0.07691 
  9 -43.35341 -56.71052   9.44164   0.74296  -6.16954 -19.52665  -9.07833   0.05265 
                          0.02676  -0.00837                      -8.96903   0.07691 
 10 -43.72857 -57.13935   9.49384   0.74285  -6.07211 -19.48289  -8.98154   0.05851 
                          0.03080  -0.00910                      -8.87310   0.08320 

Timing (quasiparticle equation):   0.11320

Timing:        34
