########################
######### SPEX #########
########################
Version 05.00  (Sep  5, 2019)
Execution time: Jan 18, 2020  16:30:20
Hostname: Ontology
MPI: 3,1


### subroutine: getinput ###

Basic parameters:
  Number of spins            =  1
            centers          =  4
            types            =  2
            equivalent atoms =  2  2
  Lattice parameter =      1.00000
  Lattice vectors   =      3.01411  -5.22060   0.00000
                           3.01411   5.22060   0.00000
                           0.00000   0.00000   9.80579
  Unit-cell volume  =    308.59778
  Reciprocal cutoff =      4.60000

Unit-cell geometry:
  # Ty  El              Coord.
  1  1  Ga   0.33333  -0.33333   0.00000
  2  1  Ga  -0.33333   0.33333   0.50000
  3  2  N    0.33333  -0.33333  -0.37700
  4  2  N   -0.33333   0.33333   0.12300

Symmetry information:
  Number of symmetry operations = 24
   #  Det           Axis           Angle   Syp  Inv
   1    1     --     --     --      --     Yes   1
   2   -1    1.00  -0.58  -0.00   180.00   No    2
   3   -1    1.00   0.58  -0.00   180.00   No    3
   4    1    0.00   0.00   1.00   120.00   Yes   9
   5    1    0.00   0.00   1.00   180.00   No    5
   6   -1    0.58   1.00  -0.00   180.00   Yes   6
   7   -1    1.00  -0.00  -0.00   180.00   Yes   7
   8    1    0.00   0.00   1.00    60.00   No   11
   9    1   -0.00  -0.00  -1.00   120.00   Yes   4
  10   -1   -0.00   1.00  -0.00   180.00   No   10
  11    1   -0.00  -0.00  -1.00    60.00   No    8
  12   -1   -0.58   1.00  -0.00   180.00   Yes  12
  13 - 24  Time reversal symmetries

##################
### Input file ###
##################
BZ       4 4 4
JOB      GW +:(1-30)
MPIKPT   
RESTART  
NBAND    200
KPT      +=(.55769,1.00000,0)

#  k point is converted from (0.55769,1.00000,0.00000) to (0.55769,0.00000,0.00000)

Info: Simpson and Lagrange integration is used.

Radial mesh and basis functions:
  Number of radial grid points:       759  429
  Number of radial basis functions:    19   18
  Angular momentum quantum number:      8    6
  Maximal index:                        3

Core states:
  Atom type  1  (Ga)
  nl      Energy
  1s  -375.34991
  2s   -45.88297
  3s    -4.96076
  2p   -39.88207
  3p    -3.15226
  Atom type  2  (N )
  nl      Energy
  1s   -13.54409
  Number of valence electrons:   36

Average Coulomb potential: -0.35487  ( -9.65657 eV )

Read wavefunctions from harddisc... done   ( Timing:    0.28 )

Maximal energy difference in deg. subspaces: 2.1E-12
Minimal energy difference between subspaces: 4.7E-07

Wave functions:
  Number of bands:             198 -  200  (  200 )
            k points (IBZ):     64  (  12 /  30 )
            G vectors:         724
  k points of IBZ:
    1  (0.00000,0.00000,0.00000)  [ 0.00000, 0.00000, 0.00000 ]
    2  (0.00000,0.00000,0.25000)  [ 0.00000, 0.00000, 0.02550 ]
    3  (0.00000,0.00000,0.50000)  [ 0.00000, 0.00000, 0.05099 ]
    4  (0.00000,0.25000,0.00000)  [ 0.04147, 0.02394, 0.00000 ]
    5  (0.00000,0.25000,0.25000)  [ 0.04147, 0.02394, 0.02550 ]
    6  (0.00000,0.25000,0.50000)  [ 0.04147, 0.02394, 0.05099 ]
    7  (0.00000,0.50000,0.00000)  [ 0.08294, 0.04789, 0.00000 ]
    8  (0.00000,0.50000,0.25000)  [ 0.08294, 0.04789, 0.02550 ]
    9  (0.00000,0.50000,0.50000)  [ 0.08294, 0.04789, 0.05099 ]
   10  (0.25000,0.25000,0.00000)  [ 0.08294, 0.00000, 0.00000 ]
   11  (0.25000,0.25000,0.25000)  [ 0.08294, 0.00000, 0.02550 ]
   12  (0.25000,0.25000,0.50000)  [ 0.08294, 0.00000, 0.05099 ]
  k points of EIBZ (shifted set):
   65  (0.55769,0.00000,0.00000)  [ 0.09251,-0.05341, 0.00000 ]
   66  (0.55769,0.00000,0.25000)  [ 0.09251,-0.05341, 0.02550 ]
   67  (0.55769,0.00000,0.50000)  [ 0.09251,-0.05341, 0.05099 ]
   68  (0.55769,0.25000,0.00000)  [ 0.13398,-0.02947, 0.00000 ]
   69  (0.55769,0.25000,0.25000)  [ 0.13398,-0.02947, 0.02550 ]
   70  (0.55769,0.25000,0.50000)  [ 0.13398,-0.02947, 0.05099 ]
   71  (0.55769,0.50000,0.00000)  [ 0.17546,-0.00553, 0.00000 ]
   72  (0.55769,0.50000,0.25000)  [ 0.17546,-0.00553, 0.02550 ]
   73  (0.55769,0.50000,0.50000)  [ 0.17546,-0.00553, 0.05099 ]
   74  (0.55769,0.75000,0.00000)  [ 0.21693, 0.01842, 0.00000 ]
   75  (0.55769,0.75000,0.25000)  [ 0.21693, 0.01842, 0.02550 ]
   76  (0.55769,0.75000,0.50000)  [ 0.21693, 0.01842, 0.05099 ]
   77  (0.80769,0.00000,0.00000)  [ 0.13398,-0.07736, 0.00000 ]
   78  (0.80769,0.00000,0.25000)  [ 0.13398,-0.07736, 0.02550 ]
   79  (0.80769,0.00000,0.50000)  [ 0.13398,-0.07736, 0.05099 ]
   80  (0.80769,0.25000,0.00000)  [ 0.17546,-0.05341, 0.00000 ]
   81  (0.80769,0.25000,0.25000)  [ 0.17546,-0.05341, 0.02550 ]
   82  (0.80769,0.25000,0.50000)  [ 0.17546,-0.05341, 0.05099 ]
   83  (0.80769,0.50000,0.00000)  [ 0.21693,-0.02947, 0.00000 ]
   84  (0.80769,0.50000,0.25000)  [ 0.21693,-0.02947, 0.02550 ]
   85  (0.80769,0.50000,0.50000)  [ 0.21693,-0.02947, 0.05099 ]
   86  (0.05769,0.00000,0.00000)  [ 0.00957,-0.00553, 0.00000 ]
   87  (0.05769,0.00000,0.25000)  [ 0.00957,-0.00553, 0.02550 ]
   88  (0.05769,0.00000,0.50000)  [ 0.00957,-0.00553, 0.05099 ]
   89  (0.05769,0.25000,0.00000)  [ 0.05104, 0.01842, 0.00000 ]
   90  (0.05769,0.25000,0.25000)  [ 0.05104, 0.01842, 0.02550 ]
   91  (0.05769,0.25000,0.50000)  [ 0.05104, 0.01842, 0.05099 ]
   92  (0.30769,0.00000,0.00000)  [ 0.05104,-0.02947, 0.00000 ]
   93  (0.30769,0.00000,0.25000)  [ 0.05104,-0.02947, 0.02550 ]
   94  (0.30769,0.00000,0.50000)  [ 0.05104,-0.02947, 0.05099 ]

Generate wavefunctions at equivalent k points... done   ( Timing:   0.26 )

Size of array cpw:   209.8 MB
Size of array cmt:   260.9 MB

The system is not a metal.
The Fermi energy is placed in the center of the band gap.
KS energy gap:    0.07059528 Ha   (  1.92099521 eV )
Fermi energy:     0.29316457 Ha   (  7.97741378 eV )
Maximal energy:   5.57248232 Ha
Electron count error of the shifted k-point set:  0.0000000000000000

Wave-function checksum:  1.393869722751E-02


### subroutine: checkinput ###

Overlap <core|core>
Atom type  1
1s  1.000000
2s -0.000000  1.000000
3s  0.000000 -0.000001  0.999961
2p  0.999418
3p -0.000329  0.999458
Atom type  2
1s  0.999983

Overlap <core|basis>
Atom type  1
         u(s)    udot(s)
1s  0.000000  0.000000
2s  0.000001  0.000000
3s  0.004767 -0.007551
         u(p)    udot(p)
2p -0.000106 -0.000031
3p  0.017150 -0.021254
Atom type  2
         u(s)    udot(s)
1s  0.003209 -0.002046

Average overlap <core|val>
Atom type  1
1s  0.000000
2s  0.000000
3s  0.000679
2p  0.000010  0.000010  0.000010
3p  0.002209  0.002205  0.002209
Atom type  2
1s  0.000234

Maximum overlap <core|val> at (band/kpoint)
Atom type  1
1s  0.000000 (033/ 001)
2s  0.000001 (033/ 001)
3s  0.004363 (156/ 003)
2p  0.000058 (026/ 082)  0.000064 (024/ 001)  0.000058 (026/ 116)
3p  0.011569 (124/ 088)  0.014817 (111/ 001)  0.011569 (124/ 088)
Atom type  2
1s  0.001671 (002/ 088)

Overlap <basis|basis>
Atom type  1
   u(s)  1.000000
udot(s) -0.000000  0.129862
   u(p)  1.000000
udot(p) -0.000000  0.075237
   u(d)  1.000000
udot(d)  0.000000  0.733838
 ulo(d)  0.410292 -0.767526  1.000000
   u(f)  1.000000
udot(f)  0.000000  0.020278
   u(g)  1.000000
udot(g)  0.000000  0.006703
   u(h)  1.000000
udot(h) -0.000000  0.003149
   u(i)  1.000000
udot(i) -0.000000  0.001726
   u(j)  1.000000
udot(j) -0.000000  0.001039
   u(k)  1.000000
udot(k)  0.000000  0.000667
Atom type  2
   u(s)  1.000000
udot(s) -0.000000  0.023146
   u(p)  1.000000
udot(p)  0.000000  0.036192
   u(d)  1.000000
udot(d)  0.000000  0.003612
   u(f)  1.000000
udot(f) -0.000000  0.001183
   u(g)  1.000000
udot(g)  0.000000  0.000520
   u(h)  1.000000
udot(h) -0.000000  0.000271
   u(i)  1.000000
udot(i) -0.000000  0.000157


### subroutine: mixedbasis ( Mode: vv ) ###

Mixed basis
  Plane-wave basis:
    Number of unique G vectors:   342
    Maximal number of G vectors:  233

  MT basis read in from spex.mb (mode: vv).
    Total number of product-basis functions:  264



##### Job index:  1 #####


### subroutine: correlation ###

< GW self-energy >
Calculate periodic function...done   ( Timing:    0.04 )

=========

K point (   1 ):   0.00000   0.00000   0.00000

Coulomb matrix read from spex.cor
Inverse dielectric matrices read from spex.cor
Invert dielectric tensor... done   ( Timing:    0.02 )
Hermiticity of transformed Coulomb matrix: 5.1E-11

Add contribution to self-energy... done
                               Timings
  MT wave-func. products:      1.56843
  PW wave-func. products:      0.47124
  Matrix-vector products:      2.48417
  Transformations:             0.27539
  Exchange self-energy:        0.16758
  Frequency integration:       0.02426
  Tetrahedron weights:         0.00000
  Gamma-point correction:      0.43044
  MPI idle time:               0.02853      0.02853
  Other:                       0.15215
  ------------------------------------
  Total:                       5.60220

=========

K point (   2 ):   0.00000   0.00000   0.25000

Coulomb matrix read from spex.cor
Inverse dielectric matrices read from spex.cor
Hermiticity of transformed Coulomb matrix: 5.9E-10

Add contribution to self-energy... done
                               Timings
  MT wave-func. products:      1.59899
  PW wave-func. products:      0.39989
  Matrix-vector products:      1.64170
  Transformations:             0.24935
  Exchange self-energy:        0.12706
  Frequency integration:       0.03380
  Tetrahedron weights:         0.00000
  MPI idle time:               0.00931      0.01280
  Other:                       0.20508
  ------------------------------------
  Total:                       4.26518

=========

K point (   3 ):   0.00000   0.00000   0.50000

Coulomb matrix read from spex.cor
Inverse dielectric matrices read from spex.cor
Hermiticity of transformed Coulomb matrix: 1.8E-10

Add contribution to self-energy... done
                               Timings
  MT wave-func. products:      1.43394
  PW wave-func. products:      0.43684
  Matrix-vector products:      2.06528
  Transformations:             0.26874
  Exchange self-energy:        0.14153
  Frequency integration:       0.03237
  Tetrahedron weights:         0.00000
  MPI idle time:               0.02450      0.02450
  Other:                       0.13609
  ------------------------------------
  Total:                       4.53928

=========

K point (   4 ):   0.00000   0.25000   0.00000

Coulomb matrix read from spex.cor
Inverse dielectric matrices read from spex.cor
Hermiticity of transformed Coulomb matrix: 8.5E-11

Add contribution to self-energy... done
                               Timings
  MT wave-func. products:      3.26776
  PW wave-func. products:      0.84784
  Matrix-vector products:      8.36665
  Transformations:             1.03872
  Exchange self-energy:        0.21130
  Frequency integration:       0.15825
  Tetrahedron weights:         0.00000
  MPI idle time:               0.00002      0.03386
  Other:                       0.81529
  ------------------------------------
  Total:                      14.70583

=========

K point (   5 ):   0.00000   0.25000   0.25000

Coulomb matrix read from spex.cor
Inverse dielectric matrices read from spex.cor
Hermiticity of transformed Coulomb matrix: 9.7E-11

Add contribution to self-energy... done
                               Timings
  MT wave-func. products:      2.99892
  PW wave-func. products:      0.88529
  Matrix-vector products:      9.15024
  Transformations:             1.17470
  Exchange self-energy:        0.18793
  Frequency integration:       0.16019
  Tetrahedron weights:         0.00000
  MPI idle time:               0.00002      0.02158
  Other:                       0.64671
  ------------------------------------
  Total:                      15.20400

=========

K point (   6 ):   0.00000   0.25000   0.50000

Coulomb matrix read from spex.cor
Inverse dielectric matrices read from spex.cor
Hermiticity of transformed Coulomb matrix: 9.8E-11

Add contribution to self-energy... done
                               Timings
  MT wave-func. products:      2.80428
  PW wave-func. products:      0.88422
  Matrix-vector products:      9.05442
  Transformations:             1.19701
  Exchange self-energy:        0.19565
  Frequency integration:       0.28783
  Tetrahedron weights:         0.00000
  MPI idle time:               0.00002      0.02816
  Other:                       0.67168
  ------------------------------------
  Total:                      15.09512

=========

K point (   7 ):   0.00000   0.50000   0.00000

Coulomb matrix read from spex.cor
Inverse dielectric matrices read from spex.cor
Hermiticity of transformed Coulomb matrix: 1.0E-10

Add contribution to self-energy... done
                               Timings
  MT wave-func. products:      2.05676
  PW wave-func. products:      0.52435
  Matrix-vector products:      3.98843
  Transformations:             0.60903
  Exchange self-energy:        0.13918
  Frequency integration:       0.13412
  Tetrahedron weights:         0.00000
  MPI idle time:               0.01393      0.01393
  Other:                       0.35736
  ------------------------------------
  Total:                       7.82317

=========

K point (   8 ):   0.00000   0.50000   0.25000

Coulomb matrix read from spex.cor
Inverse dielectric matrices read from spex.cor
Hermiticity of transformed Coulomb matrix: 5.3E-11

Add contribution to self-energy... done
                               Timings
  MT wave-func. products:      2.08510
  PW wave-func. products:      0.48785
  Matrix-vector products:      3.51592
  Transformations:             0.53841
  Exchange self-energy:        0.14921
  Frequency integration:       0.08175
  Tetrahedron weights:         0.00000
  MPI idle time:               0.00002      0.01688
  Other:                       0.30233
  ------------------------------------
  Total:                       7.16058

=========

K point (   9 ):   0.00000   0.50000   0.50000

Coulomb matrix read from spex.cor
Inverse dielectric matrices read from spex.cor
Hermiticity of transformed Coulomb matrix: 4.1E-11

Add contribution to self-energy... done
                               Timings
  MT wave-func. products:      2.12641
  PW wave-func. products:      0.56968
  Matrix-vector products:      4.65855
  Transformations:             0.53023
  Exchange self-energy:        0.12404
  Frequency integration:       0.09486
  Tetrahedron weights:         0.00000
  MPI idle time:               0.00002      0.01875
  Other:                       0.37392
  ------------------------------------
  Total:                       8.47772

=========

K point (  10 ):   0.25000   0.25000   0.00000

Coulomb matrix read from spex.cor
Inverse dielectric matrices read from spex.cor
Hermiticity of transformed Coulomb matrix: 3.6E-11

Add contribution to self-energy... done
                               Timings
  MT wave-func. products:      3.10262
  PW wave-func. products:      0.69090
  Matrix-vector products:      6.79111
  Transformations:             0.80606
  Exchange self-energy:        0.19877
  Frequency integration:       0.16414
  Tetrahedron weights:         0.00000
  MPI idle time:               0.03231      0.03231
  Other:                       0.47343
  ------------------------------------
  Total:                      12.25933

=========

K point (  11 ):   0.25000   0.25000   0.25000

Coulomb matrix read from spex.cor
Inverse dielectric matrices read from spex.cor
Hermiticity of transformed Coulomb matrix: 5.4E-11

Add contribution to self-energy... done
                               Timings
  MT wave-func. products:      2.82542
  PW wave-func. products:      0.67015
  Matrix-vector products:      7.31016
  Transformations:             0.82597
  Exchange self-energy:        0.17133
  Frequency integration:       0.17329
  Tetrahedron weights:         0.00000
  MPI idle time:               0.00002      0.03497
  Other:                       0.51384
  ------------------------------------
  Total:                      12.49018

=========

K point (  12 ):   0.25000   0.25000   0.50000

Coulomb matrix read from spex.cor
Inverse dielectric matrices read from spex.cor
Hermiticity of transformed Coulomb matrix: 6.5E-11

Add contribution to self-energy... done
                               Timings
  MT wave-func. products:      2.71657
  PW wave-func. products:      0.69482
  Matrix-vector products:     10.50516
  Transformations:             0.87689
  Exchange self-energy:        0.33118
  Frequency integration:       0.20405
  Tetrahedron weights:         0.00000
  MPI idle time:               0.00003      0.01954
  Other:                       0.55312
  ------------------------------------
  Total:                      15.88182


### subroutine: exchange_core ###

        k point       band      exchange (core contribution)
  (0.558,0.000,0.000)   1     -7.0737338
  (0.558,0.000,0.000)   2     -9.4202046
  (0.558,0.000,0.000)   3    -17.7844223
  (0.558,0.000,0.000)   4    -17.9540466
  (0.558,0.000,0.000)   5    -18.1614389
  (0.558,0.000,0.000)   6    -18.1867546
  (0.558,0.000,0.000)   7    -18.4083178
  (0.558,0.000,0.000)   8    -18.4729051
  (0.558,0.000,0.000)   9    -18.6229589
  (0.558,0.000,0.000)  10    -18.7057527
  (0.558,0.000,0.000)  11    -12.9516006
  (0.558,0.000,0.000)  12    -10.9722085
  (0.558,0.000,0.000)  13     -1.8340870
  (0.558,0.000,0.000)  14     -1.9399927
  (0.558,0.000,0.000)  15     -1.4964474
  (0.558,0.000,0.000)  16     -1.3240493
  (0.558,0.000,0.000)  17     -1.7434937
  (0.558,0.000,0.000)  18     -1.8268673
  (0.558,0.000,0.000)  19     -2.0132790
  (0.558,0.000,0.000)  20     -2.1420035
  (0.558,0.000,0.000)  21     -1.5961391
  (0.558,0.000,0.000)  22     -1.7802153
  (0.558,0.000,0.000)  23     -1.6413885
  (0.558,0.000,0.000)  24     -1.9174543
  (0.558,0.000,0.000)  25     -1.1814660
  (0.558,0.000,0.000)  26     -2.2604669
  (0.558,0.000,0.000)  27     -1.8709031
  (0.558,0.000,0.000)  28     -1.6260789
  (0.558,0.000,0.000)  29     -2.0664135
  (0.558,0.000,0.000)  30     -1.7428834
Timing:   0.09




### subroutine: quasiparticle ###

Number of mesh points even: No constraint will be used.

List of k points
    0   0.55769   0.00000   0.00000  (additional)



#####################
### K POINT:    0 ###
#####################


--- DIAGONAL ELEMENTS [eV] ---

 Bd       vxc    sigmax    sigmac         Z        KS        HF          GW lin/dir
  1 -25.97977 -36.97553   8.66878   0.72854  -8.08585 -19.08160  -9.74853   0.63087
                          0.72151  -0.04522                      -9.70638   0.60021
  2 -29.79677 -41.38514   8.91905   0.72215  -7.89264 -19.48101  -9.80509   0.45897
                          0.52951  -0.02869                      -9.73550   0.44413
  3 -42.27218 -55.52784   9.44250   0.73824  -6.36892 -19.62458  -9.18297   0.10516
                          0.06593  -0.01481                      -9.08215   0.13045
  4 -42.58000 -55.89478   9.48974   0.73802  -6.34614 -19.66091  -9.16817   0.10134
                          0.06257  -0.01442                      -9.06645   0.12699
  5 -42.86402 -56.20020   9.47054   0.74025  -6.25166 -19.58785  -9.11261   0.08408
                          0.04937  -0.01230                      -9.00816   0.10944
  6 -42.89748 -56.19413   9.42139   0.74155  -6.20732 -19.50397  -9.08061   0.07120
                          0.04028  -0.01067                      -8.97478   0.09592
  7 -43.38374 -56.81174   9.57215   0.73931  -6.16980 -19.59780  -9.01960   0.10009
                          0.06151  -0.01416                      -8.91728   0.12570
  8 -43.45688 -56.89484   9.56039   0.74004  -6.15943 -19.59739  -9.02831   0.08884
                          0.05253  -0.01289                      -8.92415   0.11463
  9 -43.68196 -57.10446   9.51229   0.74212  -6.08663 -19.50913  -8.98813   0.06386
                          0.03436  -0.00981                      -8.88044   0.08900
 10 -43.80995 -57.22630   9.49345   0.74294  -6.04740 -19.46375  -8.96164   0.05363
                          0.02705  -0.00855                      -8.85227   0.07862
 11 -34.98308 -46.62612   8.76189   0.72735  -5.13349 -16.77653  -7.21009   0.40380
                          0.32016  -0.05933                      -7.17828   0.44871
 12 -32.41376 -43.36600   8.42496   0.73199  -4.32712 -15.27936  -6.15466   0.42285
                          0.36668  -0.06111                      -6.13536   0.42818
 13 -15.87242 -21.32506   4.21034   0.73734   0.68898  -4.76365  -0.22564   0.07438
                          0.06554  -0.02097                      -0.21385   0.07780
 14 -16.71738 -21.79670   3.90713   0.74661   1.89036  -3.18897   1.01557   0.03780
                          0.03129  -0.01232                       1.02574   0.04020
 15 -15.98181 -20.81779   3.64184   0.75265   2.74766  -2.08832   1.84902   0.02101
                          0.01604  -0.00748                       1.85996   0.02286
 16 -16.85356 -21.31397   3.38863   0.76296   4.35519  -0.10523   3.53747   0.00526
                          0.00337  -0.00251                       3.54557   0.00612
 17 -17.41123 -21.46707   3.06844   0.77045   5.02243   0.96659   4.26170   0.00213
                          0.00106  -0.00133                       4.26835   0.00277
 18 -18.91544 -22.88292   3.12379   0.77143   6.07456   2.10708   5.42371   0.00096
                          0.00058  -0.00060                       5.42807   0.00118
 19 -13.47244  -8.55564  -4.22350   0.81817  12.11703  17.03383  12.68427  -0.00105
                          0.00039  -0.00198                      12.68145  -0.00169
 20 -15.47467 -10.04242  -4.39577   0.80095  12.62850  18.06075  13.45867  -0.00560
                         -0.00122  -0.00446                      13.45275  -0.00770
 21 -14.11148  -9.08776  -4.23507   0.80229  13.20452  18.22823  13.83722  -0.00624
                         -0.00322  -0.00463                      13.83369  -0.00727
 22 -17.13699 -10.27749  -5.29572   0.76455  15.64854  22.50803  16.84375  -0.04202
                         -0.02761  -0.01337                      16.82819  -0.04799
 23 -15.68387  -9.04243  -5.45291   0.76792  17.44846  24.08990  18.36014  -0.06369
                         -0.05334  -0.01913                      18.35085  -0.06698
 24 -13.63421  -7.76452  -4.95919   0.80454  17.49881  23.36850  18.23077  -0.04464
                         -0.03867  -0.01486                      18.22584  -0.04620
 25 -13.27580  -6.89673  -5.52577   0.77935  19.39162  25.77069  20.05443  -0.08980
                         -0.08760  -0.02523                      20.04960  -0.09110
 26 -14.92029  -7.76949  -6.05761   0.76598  20.37798  27.52878  21.20947  -0.15979
                         -0.15420  -0.03812                      21.20065  -0.16230
 27 -15.80445  -8.03233  -6.55471   0.74192  21.05243  28.82455  21.94636  -0.20771
                         -0.20603  -0.04505                      21.93475  -0.21044
 28 -12.78151  -5.87197  -6.15120   0.77626  23.82016  30.72970  24.39171  -0.27936
                         -0.30505  -0.05613                      24.38704  -0.27888
 29 -14.26665  -6.99984  -6.44743   0.76814  24.74182  32.00863  25.34241  -0.37702
                         -0.41714  -0.06908                      25.33659  -0.37579
 30 -13.90104  -6.56268  -6.51675   0.76367  25.94571  33.28407  26.54337  -0.38606
                         -0.43127  -0.06903                      26.53733  -0.38436

Timing (quasiparticle equation):   0.43756

Timing:       125
