########################
######### SPEX #########
########################
Version 05.00  (Sep  5, 2019)
Execution time: Jan 18, 2020  00:05:30
Hostname: login18-1.hpc.itc.rwth-aachen.de
MPI: 1,1


### subroutine: getinput ###

Basic parameters:
  Number of spins            =  1
            centers          =  4
            types            =  2
            equivalent atoms =  2  2
  Lattice parameter =      1.00000
  Lattice vectors   =      3.01411  -5.22060   0.00000
                           3.01411   5.22060   0.00000
                           0.00000   0.00000   9.80579
  Unit-cell volume  =    308.59778
  Reciprocal cutoff =      4.60000

Unit-cell geometry:
  # Ty  El              Coord.
  1  1  Ga   0.33333  -0.33333   0.00000
  2  1  Ga  -0.33333   0.33333   0.50000
  3  2  N    0.33333  -0.33333  -0.37700
  4  2  N   -0.33333   0.33333   0.12300

Symmetry information:
  Number of symmetry operations = 24
   #  Det           Axis           Angle   Syp  Inv
   1    1     --     --     --      --     Yes   1
   2   -1    1.00  -0.58   0.00   180.00   No    2
   3   -1    1.00   0.58   0.00   180.00   No    3
   4    1    0.00   0.00   1.00   120.00   Yes   9
   5    1    0.00   0.00   1.00   180.00   No    5
   6   -1    0.58   1.00   0.00   180.00   Yes   6
   7   -1    1.00   0.00   0.00   180.00   Yes   7
   8    1    0.00   0.00   1.00    60.00   No   11
   9    1    0.00   0.00  -1.00   120.00   Yes   4
  10   -1    0.00   1.00   0.00   180.00   No   10
  11    1    0.00   0.00  -1.00    60.00   No    8
  12   -1   -0.58   1.00   0.00   180.00   Yes  12
  13 - 24  Time reversal symmetries

##################
### Input file ###
##################
BZ       4 4 4
JOB      GW +:(1-10)
NBAND    200
RESTART  
KPT      +=(.23333,.23333,0)
 

Info: Simpson and Lagrange integration is used.

Radial mesh and basis functions:
  Number of radial grid points:       759  429
  Number of radial basis functions:    19   18
  Angular momentum quantum number:      8    6
  Maximal index:                        3

Core states:
  Atom type  1  (Ga)
  nl      Energy
  1s  -375.34991
  2s   -45.88297
  3s    -4.96076
  2p   -39.88207
  3p    -3.15226
  Atom type  2  (N )
  nl      Energy
  1s   -13.54409
  Number of valence electrons:   36

Average Coulomb potential: -0.35487  ( -9.65657 eV )

Read wavefunctions from harddisc... done   ( Timing:    0.21 )

Maximal energy difference in deg. subspaces: 9.5E-13
Minimal energy difference between subspaces: 4.5E-06

Wave functions:
  Number of bands:             198 -  200  (  200 )
            k points (IBZ):     64  (  12 /  30 )
            G vectors:         777
  k points of IBZ:
    1  (0.00000,0.00000,0.00000)  [ 0.00000, 0.00000, 0.00000 ]
    2  (0.00000,0.00000,0.25000)  [ 0.00000, 0.00000, 0.02550 ]
    3  (0.00000,0.00000,0.50000)  [ 0.00000, 0.00000, 0.05099 ]
    4  (0.00000,0.25000,0.00000)  [ 0.04147, 0.02394, 0.00000 ]
    5  (0.00000,0.25000,0.25000)  [ 0.04147, 0.02394, 0.02550 ]
    6  (0.00000,0.25000,0.50000)  [ 0.04147, 0.02394, 0.05099 ]
    7  (0.00000,0.50000,0.00000)  [ 0.08294, 0.04789, 0.00000 ]
    8  (0.00000,0.50000,0.25000)  [ 0.08294, 0.04789, 0.02550 ]
    9  (0.00000,0.50000,0.50000)  [ 0.08294, 0.04789, 0.05099 ]
   10  (0.25000,0.25000,0.00000)  [ 0.08294, 0.00000, 0.00000 ]
   11  (0.25000,0.25000,0.25000)  [ 0.08294, 0.00000, 0.02550 ]
   12  (0.25000,0.25000,0.50000)  [ 0.08294, 0.00000, 0.05099 ]
  k points of EIBZ (shifted set):
   65  (0.23333,0.23333,0.00000)  [ 0.07741, 0.00000, 0.00000 ]
   66  (0.23333,0.23333,0.25000)  [ 0.07741, 0.00000, 0.02550 ]
   67  (0.23333,0.23333,0.50000)  [ 0.07741, 0.00000, 0.05099 ]
   68  (0.23333,0.48333,0.00000)  [ 0.11888, 0.02394, 0.00000 ]
   69  (0.23333,0.48333,0.25000)  [ 0.11888, 0.02394, 0.02550 ]
   70  (0.23333,0.48333,0.50000)  [ 0.11888, 0.02394, 0.05099 ]
   71  (0.23333,0.73333,0.00000)  [ 0.16036, 0.04789, 0.00000 ]
   72  (0.23333,0.73333,0.25000)  [ 0.16036, 0.04789, 0.02550 ]
   73  (0.23333,0.73333,0.50000)  [ 0.16036, 0.04789, 0.05099 ]
   74  (0.23333,0.98333,0.00000)  [ 0.20183, 0.07183, 0.00000 ]
   75  (0.23333,0.98333,0.25000)  [ 0.20183, 0.07183, 0.02550 ]
   76  (0.23333,0.98333,0.50000)  [ 0.20183, 0.07183, 0.05099 ]
   77  (0.48333,0.48333,0.00000)  [ 0.16036, 0.00000, 0.00000 ]
   78  (0.48333,0.48333,0.25000)  [ 0.16036, 0.00000, 0.02550 ]
   79  (0.48333,0.48333,0.50000)  [ 0.16036, 0.00000, 0.05099 ]
   80  (0.48333,0.73333,0.00000)  [ 0.20183, 0.02394, 0.00000 ]
   81  (0.48333,0.73333,0.25000)  [ 0.20183, 0.02394, 0.02550 ]
   82  (0.48333,0.73333,0.50000)  [ 0.20183, 0.02394, 0.05099 ]
   83  (0.48333,0.98333,0.00000)  [ 0.24330, 0.04789, 0.00000 ]
   84  (0.48333,0.98333,0.25000)  [ 0.24330, 0.04789, 0.02550 ]
   85  (0.48333,0.98333,0.50000)  [ 0.24330, 0.04789, 0.05099 ]
   86  (0.73333,0.73333,0.00000)  [ 0.24330, 0.00000, 0.00000 ]
   87  (0.73333,0.73333,0.25000)  [ 0.24330, 0.00000, 0.02550 ]
   88  (0.73333,0.73333,0.50000)  [ 0.24330, 0.00000, 0.05099 ]
   89  (0.73333,0.98333,0.00000)  [ 0.28477, 0.02394, 0.00000 ]
   90  (0.73333,0.98333,0.25000)  [ 0.28477, 0.02394, 0.02550 ]
   91  (0.73333,0.98333,0.50000)  [ 0.28477, 0.02394, 0.05099 ]
   92  (0.98333,0.98333,0.00000)  [ 0.32624, 0.00000, 0.00000 ]
   93  (0.98333,0.98333,0.25000)  [ 0.32624, 0.00000, 0.02550 ]
   94  (0.98333,0.98333,0.50000)  [ 0.32624, 0.00000, 0.05099 ]

Generate wavefunctions at equivalent k points... done   ( Timing:   0.42 )

Size of array cpw:   209.8 MB
Size of array cmt:   260.9 MB

The system is not a metal.
The Fermi energy is placed in the center of the band gap.
KS energy gap:    0.07059528 Ha   (  1.92099521 eV )
Fermi energy:     0.29316457 Ha   (  7.97741378 eV )
Maximal energy:   5.57248232 Ha
Electron count error of the shifted k-point set:  0.0000000000000000

Wave-function checksum:  5.251431895127E-02


### subroutine: checkinput ###

Overlap <core|core>
Atom type  1
1s  1.000000 
2s -0.000000  1.000000 
3s  0.000000 -0.000001  0.999961 
2p  0.999418 
3p -0.000329  0.999458 
Atom type  2
1s  0.999983 

Overlap <core|basis>
Atom type  1
         u(s)    udot(s)
1s  0.000000  0.000000 
2s  0.000001  0.000000 
3s  0.004767 -0.007551 
         u(p)    udot(p)
2p -0.000106 -0.000031 
3p  0.017150 -0.021254 
Atom type  2
         u(s)    udot(s)
1s  0.003209 -0.002046 

Average overlap <core|val>
Atom type  1
1s  0.000000
2s  0.000000
3s  0.000679
2p  0.000010  0.000010  0.000010
3p  0.002210  0.002206  0.002210
Atom type  2
1s  0.000234

Maximum overlap <core|val> at (band/kpoint)
Atom type  1
1s  0.000000 (033/ 001)
2s  0.000001 (033/ 001)
3s  0.003697 (156/ 003)
2p  0.000057 (025/ 094)  0.000064 (024/ 092)  0.000057 (023/ 003)
3p  0.012939 (124/ 094)  0.014817 (111/ 001)  0.012407 (122/ 094)
Atom type  2
1s  0.001665 (002/ 094)

Overlap <basis|basis>
Atom type  1
   u(s)  1.000000 
udot(s) -0.000000  0.129862 
   u(p)  1.000000 
udot(p) -0.000000  0.075237 
   u(d)  1.000000 
udot(d) -0.000000  0.733838 
 ulo(d)  0.410292 -0.767526  1.000000 
   u(f)  1.000000 
udot(f) -0.000000  0.020278 
   u(g)  1.000000 
udot(g) -0.000000  0.006703 
   u(h)  1.000000 
udot(h)  0.000000  0.003149 
   u(i)  1.000000 
udot(i) -0.000000  0.001726 
   u(j)  1.000000 
udot(j) -0.000000  0.001039 
   u(k)  1.000000 
udot(k)  0.000000  0.000667 
Atom type  2
   u(s)  1.000000 
udot(s)  0.000000  0.023146 
   u(p)  1.000000 
udot(p)  0.000000  0.036192 
   u(d)  1.000000 
udot(d)  0.000000  0.003612 
   u(f)  1.000000 
udot(f)  0.000000  0.001183 
   u(g)  1.000000 
udot(g) -0.000000  0.000520 
   u(h)  1.000000 
udot(h) -0.000000  0.000271 
   u(i)  1.000000 
udot(i)  0.000000  0.000157 


### subroutine: mixedbasis ( Mode: vv ) ###

Mixed basis
  Plane-wave basis:
    Number of unique G vectors:   375
    Maximal number of G vectors:  233

  MT basis read in from spex.mb (mode: vv).
    Total number of product-basis functions:  264



##### Job index:  1 #####


### subroutine: correlation ###

< GW self-energy >
Calculate periodic function...done   ( Timing:    0.09 )

=========

K point (   1 ):   0.00000   0.00000   0.00000

Coulomb matrix read from spex.cor
Inverse dielectric matrices read from spex.cor 
Invert dielectric tensor... done   ( Timing:    0.02 )
Hermiticity of transformed Coulomb matrix: 6.8E-11

Add contribution to self-energy... done
                               Timings
  MT wave-func. products:      0.11703
  PW wave-func. products:      0.25402
  Matrix-vector products:      0.34446
  Transformations:             0.08479
  Exchange self-energy:        0.06586
  Frequency integration:       0.01810
  Tetrahedron weights:         0.00000
  Gamma-point correction:      1.38555
  MPI idle time:               0.00006      0.00006
  Other:                       0.05270
  ------------------------------------
  Total:                       2.32258

=========

K point (   2 ):   0.00000   0.00000   0.25000

Coulomb matrix read from spex.cor
Inverse dielectric matrices read from spex.cor 
Hermiticity of transformed Coulomb matrix: 8.7E-10

Add contribution to self-energy... done
                               Timings
  MT wave-func. products:      0.11571
  PW wave-func. products:      0.23763
  Matrix-vector products:      0.32751
  Transformations:             0.08144
  Exchange self-energy:        0.05178
  Frequency integration:       0.01852
  Tetrahedron weights:         0.00000
  MPI idle time:               0.00002      0.00002
  Other:                       0.05034
  ------------------------------------
  Total:                       0.88295

=========

K point (   3 ):   0.00000   0.00000   0.50000

Coulomb matrix read from spex.cor
Inverse dielectric matrices read from spex.cor 
Hermiticity of transformed Coulomb matrix: 2.4E-10

Add contribution to self-energy... done
                               Timings
  MT wave-func. products:      0.11459
  PW wave-func. products:      0.23826
  Matrix-vector products:      0.52898
  Transformations:             0.07792
  Exchange self-energy:        0.04926
  Frequency integration:       0.01844
  Tetrahedron weights:         0.00000
  MPI idle time:               0.00004      0.00004
  Other:                       0.05082
  ------------------------------------
  Total:                       1.07831

=========

K point (   4 ):   0.00000   0.25000   0.00000

Coulomb matrix read from spex.cor
Inverse dielectric matrices read from spex.cor 
Hermiticity of transformed Coulomb matrix: 1.5E-10

Add contribution to self-energy... done
                               Timings
  MT wave-func. products:      0.27698
  PW wave-func. products:      0.61789
  Matrix-vector products:      1.65715
  Transformations:             0.24702
  Exchange self-energy:        0.08569
  Frequency integration:       0.05492
  Tetrahedron weights:         0.00000
  MPI idle time:               0.00004      0.00004
  Other:                       0.13640
  ------------------------------------
  Total:                       3.07608

=========

K point (   5 ):   0.00000   0.25000   0.25000

Coulomb matrix read from spex.cor
Inverse dielectric matrices read from spex.cor 
Hermiticity of transformed Coulomb matrix: 1.5E-10

Add contribution to self-energy... done
                               Timings
  MT wave-func. products:      0.28216
  PW wave-func. products:      0.63608
  Matrix-vector products:      1.68998
  Transformations:             0.25358
  Exchange self-energy:        0.08624
  Frequency integration:       0.05579
  Tetrahedron weights:         0.00000
  MPI idle time:               0.00002      0.00002
  Other:                       0.13752
  ------------------------------------
  Total:                       3.14136

=========

K point (   6 ):   0.00000   0.25000   0.50000

Coulomb matrix read from spex.cor
Inverse dielectric matrices read from spex.cor 
Hermiticity of transformed Coulomb matrix: 1.4E-10

Add contribution to self-energy... done
                               Timings
  MT wave-func. products:      0.27530
  PW wave-func. products:      0.63356
  Matrix-vector products:      1.66208
  Transformations:             0.25851
  Exchange self-energy:        0.08681
  Frequency integration:       0.05469
  Tetrahedron weights:         0.00000
  MPI idle time:               0.00003      0.00003
  Other:                       0.13568
  ------------------------------------
  Total:                       3.10665

=========

K point (   7 ):   0.00000   0.50000   0.00000

Coulomb matrix read from spex.cor
Inverse dielectric matrices read from spex.cor 
Hermiticity of transformed Coulomb matrix: 1.3E-10

Add contribution to self-energy... done
                               Timings
  MT wave-func. products:      0.19167
  PW wave-func. products:      0.44376
  Matrix-vector products:      0.68603
  Transformations:             0.16413
  Exchange self-energy:        0.07166
  Frequency integration:       0.03609
  Tetrahedron weights:         0.00000
  MPI idle time:               0.00002      0.00002
  Other:                       0.09199
  ------------------------------------
  Total:                       1.68536

=========

K point (   8 ):   0.00000   0.50000   0.25000

Coulomb matrix read from spex.cor
Inverse dielectric matrices read from spex.cor 
Hermiticity of transformed Coulomb matrix: 7.9E-11

Add contribution to self-energy... done
                               Timings
  MT wave-func. products:      0.19416
  PW wave-func. products:      0.44105
  Matrix-vector products:      0.68578
  Transformations:             0.17093
  Exchange self-energy:        0.06813
  Frequency integration:       0.03731
  Tetrahedron weights:         0.00000
  MPI idle time:               0.00002      0.00002
  Other:                       0.09276
  ------------------------------------
  Total:                       1.69014

=========

K point (   9 ):   0.00000   0.50000   0.50000

Coulomb matrix read from spex.cor
Inverse dielectric matrices read from spex.cor 
Hermiticity of transformed Coulomb matrix: 5.5E-11

Add contribution to self-energy... done
                               Timings
  MT wave-func. products:      0.19476
  PW wave-func. products:      0.42069
  Matrix-vector products:      1.07470
  Transformations:             0.16049
  Exchange self-energy:        0.06452
  Frequency integration:       0.03700
  Tetrahedron weights:         0.00000
  MPI idle time:               0.00003      0.00003
  Other:                       0.09362
  ------------------------------------
  Total:                       2.04581

=========

K point (  10 ):   0.25000   0.25000   0.00000

Coulomb matrix read from spex.cor
Inverse dielectric matrices read from spex.cor 
Hermiticity of transformed Coulomb matrix: 5.5E-11

Add contribution to self-energy... done
                               Timings
  MT wave-func. products:      0.35629
  PW wave-func. products:      0.78401
  Matrix-vector products:      2.00096
  Transformations:             0.32302
  Exchange self-energy:        0.09861
  Frequency integration:       0.07403
  Tetrahedron weights:         0.00000
  MPI idle time:               0.00002      0.00002
  Other:                       0.17946
  ------------------------------------
  Total:                       3.81639

=========

K point (  11 ):   0.25000   0.25000   0.25000

Coulomb matrix read from spex.cor
Inverse dielectric matrices read from spex.cor 
Hermiticity of transformed Coulomb matrix: 8.0E-11

Add contribution to self-energy... done
                               Timings
  MT wave-func. products:      0.36205
  PW wave-func. products:      0.81834
  Matrix-vector products:      2.10052
  Transformations:             0.33574
  Exchange self-energy:        0.10491
  Frequency integration:       0.07404
  Tetrahedron weights:         0.00000
  MPI idle time:               0.00002      0.00002
  Other:                       0.18009
  ------------------------------------
  Total:                       3.97571

=========

K point (  12 ):   0.25000   0.25000   0.50000

Coulomb matrix read from spex.cor
Inverse dielectric matrices read from spex.cor 
Hermiticity of transformed Coulomb matrix: 9.9E-11

Add contribution to self-energy... done
                               Timings
  MT wave-func. products:      0.36004
  PW wave-func. products:      0.83523
  Matrix-vector products:      3.87878
  Transformations:             0.33393
  Exchange self-energy:        0.10334
  Frequency integration:       0.07325
  Tetrahedron weights:         0.00000
  MPI idle time:               0.00003      0.00003
  Other:                       0.17256
  ------------------------------------
  Total:                       5.75716


### subroutine: exchange_core ###

        k point       band      exchange (core contribution)
  (0.233,0.233,0.000)   1     -6.6331679
  (0.233,0.233,0.000)   2     -9.3563646
  (0.233,0.233,0.000)   3    -17.7918539
  (0.233,0.233,0.000)   4    -18.0559968
  (0.233,0.233,0.000)   5    -18.2021282
  (0.233,0.233,0.000)   6    -18.3234412
  (0.233,0.233,0.000)   7    -18.2477055
  (0.233,0.233,0.000)   8    -18.4217869
  (0.233,0.233,0.000)   9    -18.5497576
  (0.233,0.233,0.000)  10    -18.5408318
Timing:   0.14




### subroutine: quasiparticle ###

Number of mesh points even: No constraint will be used.

List of k points
    0   0.23333   0.23333   0.00000  (additional) 



#####################
### K POINT:    0 ###
#####################


--- DIAGONAL ELEMENTS [eV] ---

 Bd       vxc    sigmax    sigmac         Z        KS        HF          GW lin/dir 
  1 -25.28410 -36.16740   8.61915   0.72920  -8.09290 -18.97620  -9.70826   0.65735 
                          0.75476  -0.04725                      -9.67001   0.62524 
  2 -29.69390 -41.27062   8.91564   0.72172  -7.89847 -19.47518  -9.80350   0.46231 
                          0.53314  -0.02913                      -9.73453   0.44762 
  3 -42.27514 -55.54620   9.45780   0.73775  -6.39470 -19.66576  -9.20697   0.10519 
                          0.06570  -0.01487                      -9.10584   0.13078 
  4 -42.79164 -56.14216   9.52838   0.73789  -6.29370 -19.64422  -9.11297   0.10851 
                          0.06807  -0.01525                      -9.01224   0.13423 
  5 -42.98630 -56.34701   9.50668   0.73940  -6.23639 -19.59709  -9.08530   0.09261 
                          0.05563  -0.01336                      -8.98211   0.11832 
  6 -43.13224 -56.49708   9.47297   0.74145  -6.21590 -19.58073  -9.10109   0.07113 
                          0.04009  -0.01064                      -8.99447   0.09589 
  7 -43.04063 -56.39663   9.49262   0.74016  -6.20624 -19.56224  -9.06512   0.08654 
                          0.05126  -0.01258                      -8.96113   0.11195 
  8 -43.29576 -56.66768   9.46952   0.74203  -6.16488 -19.53680  -9.06022   0.06532 
                          0.03561  -0.00997                      -8.95277   0.09022 
  9 -43.56406 -56.97827   9.51576   0.74159  -6.11168 -19.52589  -9.00229   0.07072 
                          0.03933  -0.01066                      -8.89578   0.09595 
 10 -43.53484 -56.91458   9.48127   0.74213  -6.08352 -19.46327  -8.97635   0.06458 
                          0.03505  -0.00989                      -8.86911   0.08968 

Timing (quasiparticle equation):   0.10729

Timing:        35
