########################
######### SPEX #########
########################
Version 05.00  (Sep  5, 2019)
Execution time: Jan 16, 2020  16:55:35
Hostname: login18-1.hpc.itc.rwth-aachen.de
MPI: 1,1


### subroutine: getinput ###

Basic parameters:
  Number of spins            =  1
            centers          =  4
            types            =  2
            equivalent atoms =  2  2
  Lattice parameter =      1.00000
  Lattice vectors   =      3.01411  -5.22060   0.00000
                           3.01411   5.22060   0.00000
                           0.00000   0.00000   9.80579
  Unit-cell volume  =    308.59778
  Reciprocal cutoff =      4.60000

Unit-cell geometry:
  # Ty  El              Coord.
  1  1  Ga   0.33333  -0.33333   0.00000
  2  1  Ga  -0.33333   0.33333   0.50000
  3  2  N    0.33333  -0.33333  -0.37700
  4  2  N   -0.33333   0.33333   0.12300

Symmetry information:
  Number of symmetry operations = 24
   #  Det           Axis           Angle   Syp  Inv
   1    1     --     --     --      --     Yes   1
   2   -1    1.00  -0.58   0.00   180.00   No    2
   3   -1    1.00   0.58   0.00   180.00   No    3
   4    1    0.00   0.00   1.00   120.00   Yes   9
   5    1    0.00   0.00   1.00   180.00   No    5
   6   -1    0.58   1.00   0.00   180.00   Yes   6
   7   -1    1.00   0.00   0.00   180.00   Yes   7
   8    1    0.00   0.00   1.00    60.00   No   11
   9    1    0.00   0.00  -1.00   120.00   Yes   4
  10   -1    0.00   1.00   0.00   180.00   No   10
  11    1    0.00   0.00  -1.00    60.00   No    8
  12   -1   -0.58   1.00   0.00   180.00   Yes  12
  13 - 24  Time reversal symmetries

##################
### Input file ###
##################
BZ       4 4 4
JOB      GW +:(1-10)
NBAND    200
RESTART  
KPT      +=(0,.55769,0)
 

Info: Simpson and Lagrange integration is used.

Radial mesh and basis functions:
  Number of radial grid points:       759  429
  Number of radial basis functions:    19   18
  Angular momentum quantum number:      8    6
  Maximal index:                        3

Core states:
  Atom type  1  (Ga)
  nl      Energy
  1s  -375.34991
  2s   -45.88297
  3s    -4.96076
  2p   -39.88207
  3p    -3.15226
  Atom type  2  (N )
  nl      Energy
  1s   -13.54409
  Number of valence electrons:   36

Average Coulomb potential: -0.35487  ( -9.65657 eV )

Read wavefunctions from harddisc... done   ( Timing:    0.25 )

Maximal energy difference in deg. subspaces: 2.5E-12
Minimal energy difference between subspaces: 4.7E-07

Wave functions:
  Number of bands:             198 -  200  (  200 )
            k points (IBZ):     64  (  12 /  30 )
            G vectors:         724
  k points of IBZ:
    1  (0.00000,0.00000,0.00000)  [ 0.00000, 0.00000, 0.00000 ]
    2  (0.00000,0.00000,0.25000)  [ 0.00000, 0.00000, 0.02550 ]
    3  (0.00000,0.00000,0.50000)  [ 0.00000, 0.00000, 0.05099 ]
    4  (0.00000,0.25000,0.00000)  [ 0.04147, 0.02394, 0.00000 ]
    5  (0.00000,0.25000,0.25000)  [ 0.04147, 0.02394, 0.02550 ]
    6  (0.00000,0.25000,0.50000)  [ 0.04147, 0.02394, 0.05099 ]
    7  (0.00000,0.50000,0.00000)  [ 0.08294, 0.04789, 0.00000 ]
    8  (0.00000,0.50000,0.25000)  [ 0.08294, 0.04789, 0.02550 ]
    9  (0.00000,0.50000,0.50000)  [ 0.08294, 0.04789, 0.05099 ]
   10  (0.25000,0.25000,0.00000)  [ 0.08294, 0.00000, 0.00000 ]
   11  (0.25000,0.25000,0.25000)  [ 0.08294, 0.00000, 0.02550 ]
   12  (0.25000,0.25000,0.50000)  [ 0.08294, 0.00000, 0.05099 ]
  k points of EIBZ (shifted set):
   65  (0.00000,0.55769,0.00000)  [ 0.09251, 0.05341, 0.00000 ]
   66  (0.00000,0.55769,0.25000)  [ 0.09251, 0.05341, 0.02550 ]
   67  (0.00000,0.55769,0.50000)  [ 0.09251, 0.05341, 0.05099 ]
   68  (0.00000,0.80769,0.00000)  [ 0.13398, 0.07736, 0.00000 ]
   69  (0.00000,0.80769,0.25000)  [ 0.13398, 0.07736, 0.02550 ]
   70  (0.00000,0.80769,0.50000)  [ 0.13398, 0.07736, 0.05099 ]
   71  (0.00000,0.05769,0.00000)  [ 0.00957, 0.00553, 0.00000 ]
   72  (0.00000,0.05769,0.25000)  [ 0.00957, 0.00553, 0.02550 ]
   73  (0.00000,0.05769,0.50000)  [ 0.00957, 0.00553, 0.05099 ]
   74  (0.00000,0.30769,0.00000)  [ 0.05104, 0.02947, 0.00000 ]
   75  (0.00000,0.30769,0.25000)  [ 0.05104, 0.02947, 0.02550 ]
   76  (0.00000,0.30769,0.50000)  [ 0.05104, 0.02947, 0.05099 ]
   77  (0.25000,0.55769,0.00000)  [ 0.13398, 0.02947, 0.00000 ]
   78  (0.25000,0.55769,0.25000)  [ 0.13398, 0.02947, 0.02550 ]
   79  (0.25000,0.55769,0.50000)  [ 0.13398, 0.02947, 0.05099 ]
   80  (0.25000,0.80769,0.00000)  [ 0.17546, 0.05341, 0.00000 ]
   81  (0.25000,0.80769,0.25000)  [ 0.17546, 0.05341, 0.02550 ]
   82  (0.25000,0.80769,0.50000)  [ 0.17546, 0.05341, 0.05099 ]
   83  (0.25000,0.05769,0.00000)  [ 0.05104,-0.01842, 0.00000 ]
   84  (0.25000,0.05769,0.25000)  [ 0.05104,-0.01842, 0.02550 ]
   85  (0.25000,0.05769,0.50000)  [ 0.05104,-0.01842, 0.05099 ]
   86  (0.25000,0.30769,0.00000)  [ 0.09251, 0.00553, 0.00000 ]
   87  (0.25000,0.30769,0.25000)  [ 0.09251, 0.00553, 0.02550 ]
   88  (0.25000,0.30769,0.50000)  [ 0.09251, 0.00553, 0.05099 ]
   89  (0.50000,0.55769,0.00000)  [ 0.17546, 0.00553, 0.00000 ]
   90  (0.50000,0.55769,0.25000)  [ 0.17546, 0.00553, 0.02550 ]
   91  (0.50000,0.55769,0.50000)  [ 0.17546, 0.00553, 0.05099 ]
   92  (0.50000,0.80769,0.00000)  [ 0.21693, 0.02947, 0.00000 ]
   93  (0.50000,0.80769,0.25000)  [ 0.21693, 0.02947, 0.02550 ]
   94  (0.50000,0.80769,0.50000)  [ 0.21693, 0.02947, 0.05099 ]

Generate wavefunctions at equivalent k points... done   ( Timing:   0.45 )

Size of array cpw:   209.8 MB
Size of array cmt:   260.9 MB

The system is not a metal.
The Fermi energy is placed in the center of the band gap.
KS energy gap:    0.07059528 Ha   (  1.92099521 eV )
Fermi energy:     0.29316457 Ha   (  7.97741378 eV )
Maximal energy:   5.57248232 Ha
Electron count error of the shifted k-point set:  0.0000000000000000

Wave-function checksum: -7.568695250100E-02


### subroutine: checkinput ###

Overlap <core|core>
Atom type  1
1s  1.000000 
2s -0.000000  1.000000 
3s  0.000000 -0.000001  0.999961 
2p  0.999418 
3p -0.000329  0.999458 
Atom type  2
1s  0.999983 

Overlap <core|basis>
Atom type  1
         u(s)    udot(s)
1s  0.000000  0.000000 
2s  0.000001  0.000000 
3s  0.004767 -0.007551 
         u(p)    udot(p)
2p -0.000106 -0.000031 
3p  0.017150 -0.021254 
Atom type  2
         u(s)    udot(s)
1s  0.003209 -0.002046 

Average overlap <core|val>
Atom type  1
1s  0.000000
2s  0.000000
3s  0.000679
2p  0.000010  0.000010  0.000010
3p  0.002209  0.002205  0.002209
Atom type  2
1s  0.000234

Maximum overlap <core|val> at (band/kpoint)
Atom type  1
1s  0.000000 (033/ 001)
2s  0.000001 (033/ 001)
3s  0.003723 (097/ 067)
2p  0.000055 (026/ 103)  0.000064 (024/ 001)  0.000057 (023/ 003)
3p  0.011526 (121/ 003)  0.014817 (111/ 001)  0.011787 (124/ 003)
Atom type  2
1s  0.001652 (002/ 073)

Overlap <basis|basis>
Atom type  1
   u(s)  1.000000 
udot(s) -0.000000  0.129862 
   u(p)  1.000000 
udot(p) -0.000000  0.075237 
   u(d)  1.000000 
udot(d) -0.000000  0.733838 
 ulo(d)  0.410292 -0.767526  1.000000 
   u(f)  1.000000 
udot(f) -0.000000  0.020278 
   u(g)  1.000000 
udot(g) -0.000000  0.006703 
   u(h)  1.000000 
udot(h)  0.000000  0.003149 
   u(i)  1.000000 
udot(i) -0.000000  0.001726 
   u(j)  1.000000 
udot(j) -0.000000  0.001039 
   u(k)  1.000000 
udot(k)  0.000000  0.000667 
Atom type  2
   u(s)  1.000000 
udot(s)  0.000000  0.023146 
   u(p)  1.000000 
udot(p)  0.000000  0.036192 
   u(d)  1.000000 
udot(d)  0.000000  0.003612 
   u(f)  1.000000 
udot(f)  0.000000  0.001183 
   u(g)  1.000000 
udot(g) -0.000000  0.000520 
   u(h)  1.000000 
udot(h) -0.000000  0.000271 
   u(i)  1.000000 
udot(i)  0.000000  0.000157 


### subroutine: mixedbasis ( Mode: vv ) ###

Mixed basis
  Plane-wave basis:
    Number of unique G vectors:   342
    Maximal number of G vectors:  233

  MT basis read in from spex.mb (mode: vv).
    Total number of product-basis functions:  264



##### Job index:  1 #####


### subroutine: correlation ###

< GW self-energy >
Calculate periodic function...done   ( Timing:    0.09 )

=========

K point (   1 ):   0.00000   0.00000   0.00000

Coulomb matrix read from spex.cor
Inverse dielectric matrices read from spex.cor 
Invert dielectric tensor... done   ( Timing:    0.02 )
Hermiticity of transformed Coulomb matrix: 6.8E-11

Add contribution to self-energy... done
                               Timings
  MT wave-func. products:      0.13081
  PW wave-func. products:      0.27560
  Matrix-vector products:      0.39135
  Transformations:             0.09478
  Exchange self-energy:        0.07358
  Frequency integration:       0.02009
  Tetrahedron weights:         0.00000
  Gamma-point correction:      1.52491
  MPI idle time:               0.00007      0.00007
  Other:                       0.05813
  ------------------------------------
  Total:                       2.56932

=========

K point (   2 ):   0.00000   0.00000   0.25000

Coulomb matrix read from spex.cor
Inverse dielectric matrices read from spex.cor 
Hermiticity of transformed Coulomb matrix: 8.7E-10

Add contribution to self-energy... done
                               Timings
  MT wave-func. products:      0.13103
  PW wave-func. products:      0.27001
  Matrix-vector products:      0.35484
  Transformations:             0.09200
  Exchange self-energy:        0.05912
  Frequency integration:       0.01986
  Tetrahedron weights:         0.00000
  MPI idle time:               0.00002      0.00002
  Other:                       0.05395
  ------------------------------------
  Total:                       0.98083

=========

K point (   3 ):   0.00000   0.00000   0.50000

Coulomb matrix read from spex.cor
Inverse dielectric matrices read from spex.cor 
Hermiticity of transformed Coulomb matrix: 2.4E-10

Add contribution to self-energy... done
                               Timings
  MT wave-func. products:      0.12969
  PW wave-func. products:      0.25935
  Matrix-vector products:      0.57403
  Transformations:             0.08610
  Exchange self-energy:        0.05298
  Frequency integration:       0.02000
  Tetrahedron weights:         0.00000
  MPI idle time:               0.00002      0.00002
  Other:                       0.05492
  ------------------------------------
  Total:                       1.17708

=========

K point (   4 ):   0.00000   0.25000   0.00000

Coulomb matrix read from spex.cor
Inverse dielectric matrices read from spex.cor 
Hermiticity of transformed Coulomb matrix: 1.5E-10

Add contribution to self-energy... done
                               Timings
  MT wave-func. products:      0.38713
  PW wave-func. products:      0.85824
  Matrix-vector products:      2.34630
  Transformations:             0.35001
  Exchange self-energy:        0.11109
  Frequency integration:       0.07936
  Tetrahedron weights:         0.00000
  MPI idle time:               0.00004      0.00004
  Other:                       0.19555
  ------------------------------------
  Total:                       4.32772

=========

K point (   5 ):   0.00000   0.25000   0.25000

Coulomb matrix read from spex.cor
Inverse dielectric matrices read from spex.cor 
Hermiticity of transformed Coulomb matrix: 1.5E-10

Add contribution to self-energy... done
                               Timings
  MT wave-func. products:      0.38815
  PW wave-func. products:      0.87471
  Matrix-vector products:      2.36010
  Transformations:             0.36172
  Exchange self-energy:        0.11221
  Frequency integration:       0.07900
  Tetrahedron weights:         0.00000
  MPI idle time:               0.00004      0.00004
  Other:                       0.19360
  ------------------------------------
  Total:                       4.36954

=========

K point (   6 ):   0.00000   0.25000   0.50000

Coulomb matrix read from spex.cor
Inverse dielectric matrices read from spex.cor 
Hermiticity of transformed Coulomb matrix: 1.4E-10

Add contribution to self-energy... done
                               Timings
  MT wave-func. products:      0.38700
  PW wave-func. products:      0.91036
  Matrix-vector products:      2.46052
  Transformations:             0.36524
  Exchange self-energy:        0.11348
  Frequency integration:       0.07959
  Tetrahedron weights:         0.00000
  MPI idle time:               0.00004      0.00004
  Other:                       0.19540
  ------------------------------------
  Total:                       4.51163

=========

K point (   7 ):   0.00000   0.50000   0.00000

Coulomb matrix read from spex.cor
Inverse dielectric matrices read from spex.cor 
Hermiticity of transformed Coulomb matrix: 1.3E-10

Add contribution to self-energy... done
                               Timings
  MT wave-func. products:      0.21492
  PW wave-func. products:      0.48766
  Matrix-vector products:      0.72469
  Transformations:             0.18333
  Exchange self-energy:        0.07813
  Frequency integration:       0.03940
  Tetrahedron weights:         0.00000
  MPI idle time:               0.00002      0.00002
  Other:                       0.10009
  ------------------------------------
  Total:                       1.82824

=========

K point (   8 ):   0.00000   0.50000   0.25000

Coulomb matrix read from spex.cor
Inverse dielectric matrices read from spex.cor 
Hermiticity of transformed Coulomb matrix: 7.9E-11

Add contribution to self-energy... done
                               Timings
  MT wave-func. products:      0.21298
  PW wave-func. products:      0.46544
  Matrix-vector products:      0.71109
  Transformations:             0.18411
  Exchange self-energy:        0.07338
  Frequency integration:       0.03961
  Tetrahedron weights:         0.00000
  MPI idle time:               0.00002      0.00002
  Other:                       0.09964
  ------------------------------------
  Total:                       1.78628

=========

K point (   9 ):   0.00000   0.50000   0.50000

Coulomb matrix read from spex.cor
Inverse dielectric matrices read from spex.cor 
Hermiticity of transformed Coulomb matrix: 5.5E-11

Add contribution to self-energy... done
                               Timings
  MT wave-func. products:      0.21243
  PW wave-func. products:      0.45065
  Matrix-vector products:      1.14448
  Transformations:             0.17772
  Exchange self-energy:        0.06959
  Frequency integration:       0.03946
  Tetrahedron weights:         0.00000
  MPI idle time:               0.00002      0.00002
  Other:                       0.10020
  ------------------------------------
  Total:                       2.19455

=========

K point (  10 ):   0.25000   0.25000   0.00000

Coulomb matrix read from spex.cor
Inverse dielectric matrices read from spex.cor 
Hermiticity of transformed Coulomb matrix: 5.5E-11

Add contribution to self-energy... done
                               Timings
  MT wave-func. products:      0.29754
  PW wave-func. products:      0.64710
  Matrix-vector products:      1.60724
  Transformations:             0.27285
  Exchange self-energy:        0.08838
  Frequency integration:       0.05935
  Tetrahedron weights:         0.00000
  MPI idle time:               0.00004      0.00004
  Other:                       0.14647
  ------------------------------------
  Total:                       3.11898

=========

K point (  11 ):   0.25000   0.25000   0.25000

Coulomb matrix read from spex.cor
Inverse dielectric matrices read from spex.cor 
Hermiticity of transformed Coulomb matrix: 8.0E-11

Add contribution to self-energy... done
                               Timings
  MT wave-func. products:      0.30219
  PW wave-func. products:      0.68014
  Matrix-vector products:      1.74125
  Transformations:             0.28003
  Exchange self-energy:        0.09388
  Frequency integration:       0.05942
  Tetrahedron weights:         0.00000
  MPI idle time:               0.00002      0.00002
  Other:                       0.14799
  ------------------------------------
  Total:                       3.30491

=========

K point (  12 ):   0.25000   0.25000   0.50000

Coulomb matrix read from spex.cor
Inverse dielectric matrices read from spex.cor 
Hermiticity of transformed Coulomb matrix: 9.9E-11

Add contribution to self-energy... done
                               Timings
  MT wave-func. products:      0.29803
  PW wave-func. products:      0.68426
  Matrix-vector products:      3.17836
  Transformations:             0.28076
  Exchange self-energy:        0.09259
  Frequency integration:       0.05936
  Tetrahedron weights:         0.00000
  MPI idle time:               0.00002      0.00002
  Other:                       0.14141
  ------------------------------------
  Total:                       4.73479


### subroutine: exchange_core ###

        k point       band      exchange (core contribution)
  (0.000,0.558,0.000)   1     -7.0737338
  (0.000,0.558,0.000)   2     -9.4202046
  (0.000,0.558,0.000)   3    -17.7844223
  (0.000,0.558,0.000)   4    -17.9540466
  (0.000,0.558,0.000)   5    -18.1614389
  (0.000,0.558,0.000)   6    -18.1867546
  (0.000,0.558,0.000)   7    -18.4083178
  (0.000,0.558,0.000)   8    -18.4729051
  (0.000,0.558,0.000)   9    -18.6229589
  (0.000,0.558,0.000)  10    -18.7057527
Timing:   0.15




### subroutine: quasiparticle ###

Number of mesh points even: No constraint will be used.

List of k points
    0   0.00000   0.55769   0.00000  (additional) 



#####################
### K POINT:    0 ###
#####################


--- DIAGONAL ELEMENTS [eV] ---

 Bd       vxc    sigmax    sigmac         Z        KS        HF          GW lin/dir 
  1 -25.97977 -36.97553   8.66878   0.72854  -8.08585 -19.08160  -9.74853   0.63087 
                          0.72151  -0.04522                      -9.70638   0.60021 
  2 -29.79677 -41.38514   8.91905   0.72215  -7.89264 -19.48101  -9.80509   0.45897 
                          0.52951  -0.02869                      -9.73550   0.44413 
  3 -42.27218 -55.52784   9.44250   0.73824  -6.36892 -19.62458  -9.18297   0.10516 
                          0.06593  -0.01481                      -9.08215   0.13045 
  4 -42.58000 -55.89478   9.48974   0.73802  -6.34614 -19.66091  -9.16817   0.10134 
                          0.06257  -0.01442                      -9.06645   0.12699 
  5 -42.86402 -56.20020   9.47054   0.74025  -6.25166 -19.58785  -9.11261   0.08408 
                          0.04937  -0.01230                      -9.00816   0.10944 
  6 -42.89748 -56.19413   9.42139   0.74155  -6.20732 -19.50397  -9.08061   0.07120 
                          0.04028  -0.01067                      -8.97478   0.09592 
  7 -43.38374 -56.81174   9.57215   0.73931  -6.16980 -19.59780  -9.01960   0.10009 
                          0.06151  -0.01416                      -8.91728   0.12570 
  8 -43.45688 -56.89484   9.56039   0.74004  -6.15943 -19.59739  -9.02831   0.08884 
                          0.05253  -0.01289                      -8.92415   0.11463 
  9 -43.68196 -57.10446   9.51229   0.74212  -6.08663 -19.50913  -8.98813   0.06386 
                          0.03436  -0.00981                      -8.88044   0.08900 
 10 -43.80995 -57.22630   9.49345   0.74294  -6.04740 -19.46375  -8.96164   0.05363 
                          0.02705  -0.00855                      -8.85227   0.07862 

Timing (quasiparticle equation):   0.12079

Timing:        37
