########################
######### SPEX #########
########################
Version 05.00  (Sep  5, 2019)
Execution time: Jan 17, 2020  22:00:15
Hostname: login18-1.hpc.itc.rwth-aachen.de
MPI: 1,1


### subroutine: getinput ###

Basic parameters:
  Number of spins            =  1
            centers          =  4
            types            =  2
            equivalent atoms =  2  2
  Lattice parameter =      1.00000
  Lattice vectors   =      3.01411  -5.22060   0.00000
                           3.01411   5.22060   0.00000
                           0.00000   0.00000   9.80579
  Unit-cell volume  =    308.59778
  Reciprocal cutoff =      4.60000

Unit-cell geometry:
  # Ty  El              Coord.
  1  1  Ga   0.33333  -0.33333   0.00000
  2  1  Ga  -0.33333   0.33333   0.50000
  3  2  N    0.33333  -0.33333  -0.37700
  4  2  N   -0.33333   0.33333   0.12300

Symmetry information:
  Number of symmetry operations = 24
   #  Det           Axis           Angle   Syp  Inv
   1    1     --     --     --      --     Yes   1
   2   -1    1.00  -0.58   0.00   180.00   No    2
   3   -1    1.00   0.58   0.00   180.00   No    3
   4    1    0.00   0.00   1.00   120.00   Yes   9
   5    1    0.00   0.00   1.00   180.00   No    5
   6   -1    0.58   1.00   0.00   180.00   Yes   6
   7   -1    1.00   0.00   0.00   180.00   Yes   7
   8    1    0.00   0.00   1.00    60.00   No   11
   9    1    0.00   0.00  -1.00   120.00   Yes   4
  10   -1    0.00   1.00   0.00   180.00   No   10
  11    1    0.00   0.00  -1.00    60.00   No    8
  12   -1   -0.58   1.00   0.00   180.00   Yes  12
  13 - 24  Time reversal symmetries

##################
### Input file ###
##################
BZ       4 4 4
JOB      GW +:(1-10)
NBAND    200
RESTART  
KPT      +=(.71153,1.00000,0)
 
#  k point is converted from (0.71153,1.00000,0.00000) to (0.71153,0.00000,0.00000)

Info: Simpson and Lagrange integration is used.

Radial mesh and basis functions:
  Number of radial grid points:       759  429
  Number of radial basis functions:    19   18
  Angular momentum quantum number:      8    6
  Maximal index:                        3

Core states:
  Atom type  1  (Ga)
  nl      Energy
  1s  -375.34991
  2s   -45.88297
  3s    -4.96076
  2p   -39.88207
  3p    -3.15226
  Atom type  2  (N )
  nl      Energy
  1s   -13.54409
  Number of valence electrons:   36

Average Coulomb potential: -0.35487  ( -9.65657 eV )

Read wavefunctions from harddisc... done   ( Timing:    0.22 )

Maximal energy difference in deg. subspaces: 5.9E-12
Minimal energy difference between subspaces: 4.5E-06

Wave functions:
  Number of bands:             198 -  200  (  200 )
            k points (IBZ):     64  (  12 /  30 )
            G vectors:         746
  k points of IBZ:
    1  (0.00000,0.00000,0.00000)  [ 0.00000, 0.00000, 0.00000 ]
    2  (0.00000,0.00000,0.25000)  [ 0.00000, 0.00000, 0.02550 ]
    3  (0.00000,0.00000,0.50000)  [ 0.00000, 0.00000, 0.05099 ]
    4  (0.00000,0.25000,0.00000)  [ 0.04147, 0.02394, 0.00000 ]
    5  (0.00000,0.25000,0.25000)  [ 0.04147, 0.02394, 0.02550 ]
    6  (0.00000,0.25000,0.50000)  [ 0.04147, 0.02394, 0.05099 ]
    7  (0.00000,0.50000,0.00000)  [ 0.08294, 0.04789, 0.00000 ]
    8  (0.00000,0.50000,0.25000)  [ 0.08294, 0.04789, 0.02550 ]
    9  (0.00000,0.50000,0.50000)  [ 0.08294, 0.04789, 0.05099 ]
   10  (0.25000,0.25000,0.00000)  [ 0.08294, 0.00000, 0.00000 ]
   11  (0.25000,0.25000,0.25000)  [ 0.08294, 0.00000, 0.02550 ]
   12  (0.25000,0.25000,0.50000)  [ 0.08294, 0.00000, 0.05099 ]
  k points of EIBZ (shifted set):
   65  (0.71153,0.00000,0.00000)  [ 0.11803,-0.06815, 0.00000 ]
   66  (0.71153,0.00000,0.25000)  [ 0.11803,-0.06815, 0.02550 ]
   67  (0.71153,0.00000,0.50000)  [ 0.11803,-0.06815, 0.05099 ]
   68  (0.71153,0.25000,0.00000)  [ 0.15950,-0.04420, 0.00000 ]
   69  (0.71153,0.25000,0.25000)  [ 0.15950,-0.04420, 0.02550 ]
   70  (0.71153,0.25000,0.50000)  [ 0.15950,-0.04420, 0.05099 ]
   71  (0.71153,0.50000,0.00000)  [ 0.20098,-0.02026, 0.00000 ]
   72  (0.71153,0.50000,0.25000)  [ 0.20098,-0.02026, 0.02550 ]
   73  (0.71153,0.50000,0.50000)  [ 0.20098,-0.02026, 0.05099 ]
   74  (0.71153,0.75000,0.00000)  [ 0.24245, 0.00368, 0.00000 ]
   75  (0.71153,0.75000,0.25000)  [ 0.24245, 0.00368, 0.02550 ]
   76  (0.71153,0.75000,0.50000)  [ 0.24245, 0.00368, 0.05099 ]
   77  (0.96153,0.00000,0.00000)  [ 0.15950,-0.09209, 0.00000 ]
   78  (0.96153,0.00000,0.25000)  [ 0.15950,-0.09209, 0.02550 ]
   79  (0.96153,0.00000,0.50000)  [ 0.15950,-0.09209, 0.05099 ]
   80  (0.96153,0.25000,0.00000)  [ 0.20098,-0.06815, 0.00000 ]
   81  (0.96153,0.25000,0.25000)  [ 0.20098,-0.06815, 0.02550 ]
   82  (0.96153,0.25000,0.50000)  [ 0.20098,-0.06815, 0.05099 ]
   83  (0.96153,0.50000,0.00000)  [ 0.24245,-0.04420, 0.00000 ]
   84  (0.96153,0.50000,0.25000)  [ 0.24245,-0.04420, 0.02550 ]
   85  (0.96153,0.50000,0.50000)  [ 0.24245,-0.04420, 0.05099 ]
   86  (0.21153,0.00000,0.00000)  [ 0.03509,-0.02026, 0.00000 ]
   87  (0.21153,0.00000,0.25000)  [ 0.03509,-0.02026, 0.02550 ]
   88  (0.21153,0.00000,0.50000)  [ 0.03509,-0.02026, 0.05099 ]
   89  (0.21153,0.25000,0.00000)  [ 0.07656, 0.00368, 0.00000 ]
   90  (0.21153,0.25000,0.25000)  [ 0.07656, 0.00368, 0.02550 ]
   91  (0.21153,0.25000,0.50000)  [ 0.07656, 0.00368, 0.05099 ]
   92  (0.46153,0.00000,0.00000)  [ 0.07656,-0.04420, 0.00000 ]
   93  (0.46153,0.00000,0.25000)  [ 0.07656,-0.04420, 0.02550 ]
   94  (0.46153,0.00000,0.50000)  [ 0.07656,-0.04420, 0.05099 ]

Generate wavefunctions at equivalent k points... done   ( Timing:   0.42 )

Size of array cpw:   209.8 MB
Size of array cmt:   260.9 MB

The system is not a metal.
The Fermi energy is placed in the center of the band gap.
KS energy gap:    0.07059528 Ha   (  1.92099521 eV )
Fermi energy:     0.29316457 Ha   (  7.97741378 eV )
Maximal energy:   5.57793645 Ha
Electron count error of the shifted k-point set:  0.0000000000000000

Wave-function checksum: -1.184561305069E-01


### subroutine: checkinput ###

Overlap <core|core>
Atom type  1
1s  1.000000 
2s -0.000000  1.000000 
3s  0.000000 -0.000001  0.999961 
2p  0.999418 
3p -0.000329  0.999458 
Atom type  2
1s  0.999983 

Overlap <core|basis>
Atom type  1
         u(s)    udot(s)
1s  0.000000  0.000000 
2s  0.000001  0.000000 
3s  0.004767 -0.007551 
         u(p)    udot(p)
2p -0.000106 -0.000031 
3p  0.017150 -0.021254 
Atom type  2
         u(s)    udot(s)
1s  0.003209 -0.002046 

Average overlap <core|val>
Atom type  1
1s  0.000000
2s  0.000000
3s  0.000679
2p  0.000010  0.000010  0.000010
3p  0.002210  0.002205  0.002210
Atom type  2
1s  0.000234

Maximum overlap <core|val> at (band/kpoint)
Atom type  1
1s  0.000000 (033/ 001)
2s  0.000001 (033/ 001)
3s  0.003774 (097/ 094)
2p  0.000056 (026/ 127)  0.000064 (024/ 077)  0.000057 (023/ 003)
3p  0.011916 (124/ 079)  0.014817 (111/ 001)  0.011916 (124/ 079)
Atom type  2
1s  0.001673 (002/ 079)

Overlap <basis|basis>
Atom type  1
   u(s)  1.000000 
udot(s) -0.000000  0.129862 
   u(p)  1.000000 
udot(p) -0.000000  0.075237 
   u(d)  1.000000 
udot(d) -0.000000  0.733838 
 ulo(d)  0.410292 -0.767526  1.000000 
   u(f)  1.000000 
udot(f) -0.000000  0.020278 
   u(g)  1.000000 
udot(g) -0.000000  0.006703 
   u(h)  1.000000 
udot(h)  0.000000  0.003149 
   u(i)  1.000000 
udot(i) -0.000000  0.001726 
   u(j)  1.000000 
udot(j) -0.000000  0.001039 
   u(k)  1.000000 
udot(k)  0.000000  0.000667 
Atom type  2
   u(s)  1.000000 
udot(s)  0.000000  0.023146 
   u(p)  1.000000 
udot(p)  0.000000  0.036192 
   u(d)  1.000000 
udot(d)  0.000000  0.003612 
   u(f)  1.000000 
udot(f)  0.000000  0.001183 
   u(g)  1.000000 
udot(g) -0.000000  0.000520 
   u(h)  1.000000 
udot(h) -0.000000  0.000271 
   u(i)  1.000000 
udot(i)  0.000000  0.000157 


### subroutine: mixedbasis ( Mode: vv ) ###

Mixed basis
  Plane-wave basis:
    Number of unique G vectors:   353
    Maximal number of G vectors:  233

  MT basis read in from spex.mb (mode: vv).
    Total number of product-basis functions:  264



##### Job index:  1 #####


### subroutine: correlation ###

< GW self-energy >
Calculate periodic function...done   ( Timing:    0.09 )

=========

K point (   1 ):   0.00000   0.00000   0.00000

Coulomb matrix read from spex.cor
Inverse dielectric matrices read from spex.cor 
Invert dielectric tensor... done   ( Timing:    0.02 )
Hermiticity of transformed Coulomb matrix: 6.8E-11

Add contribution to self-energy... done
                               Timings
  MT wave-func. products:      0.12761
  PW wave-func. products:      0.27674
  Matrix-vector products:      0.37785
  Transformations:             0.09142
  Exchange self-energy:        0.07619
  Frequency integration:       0.01929
  Tetrahedron weights:         0.00000
  Gamma-point correction:      1.40416
  MPI idle time:               0.00010      0.00010
  Other:                       0.06906
  ------------------------------------
  Total:                       2.44243

=========

K point (   2 ):   0.00000   0.00000   0.25000

Coulomb matrix read from spex.cor
Inverse dielectric matrices read from spex.cor 
Hermiticity of transformed Coulomb matrix: 8.7E-10

Add contribution to self-energy... done
                               Timings
  MT wave-func. products:      0.11524
  PW wave-func. products:      0.24690
  Matrix-vector products:      0.33934
  Transformations:             0.07898
  Exchange self-energy:        0.05345
  Frequency integration:       0.01844
  Tetrahedron weights:         0.00000
  MPI idle time:               0.00004      0.00004
  Other:                       0.05019
  ------------------------------------
  Total:                       0.90259

=========

K point (   3 ):   0.00000   0.00000   0.50000

Coulomb matrix read from spex.cor
Inverse dielectric matrices read from spex.cor 
Hermiticity of transformed Coulomb matrix: 2.4E-10

Add contribution to self-energy... done
                               Timings
  MT wave-func. products:      0.11651
  PW wave-func. products:      0.23964
  Matrix-vector products:      0.52010
  Transformations:             0.07904
  Exchange self-energy:        0.04947
  Frequency integration:       0.01827
  Tetrahedron weights:         0.00000
  MPI idle time:               0.00004      0.00004
  Other:                       0.05042
  ------------------------------------
  Total:                       1.07349

=========

K point (   4 ):   0.00000   0.25000   0.00000

Coulomb matrix read from spex.cor
Inverse dielectric matrices read from spex.cor 
Hermiticity of transformed Coulomb matrix: 1.5E-10

Add contribution to self-energy... done
                               Timings
  MT wave-func. products:      0.36047
  PW wave-func. products:      0.78175
  Matrix-vector products:      2.16482
  Transformations:             0.32029
  Exchange self-energy:        0.10293
  Frequency integration:       0.07337
  Tetrahedron weights:         0.00000
  MPI idle time:               0.00004      0.00004
  Other:                       0.18035
  ------------------------------------
  Total:                       3.98400

=========

K point (   5 ):   0.00000   0.25000   0.25000

Coulomb matrix read from spex.cor
Inverse dielectric matrices read from spex.cor 
Hermiticity of transformed Coulomb matrix: 1.5E-10

Add contribution to self-energy... done
                               Timings
  MT wave-func. products:      0.35592
  PW wave-func. products:      0.79838
  Matrix-vector products:      2.22241
  Transformations:             0.32462
  Exchange self-energy:        0.10316
  Frequency integration:       0.07321
  Tetrahedron weights:         0.00000
  MPI idle time:               0.00004      0.00004
  Other:                       0.18154
  ------------------------------------
  Total:                       4.05928

=========

K point (   6 ):   0.00000   0.25000   0.50000

Coulomb matrix read from spex.cor
Inverse dielectric matrices read from spex.cor 
Hermiticity of transformed Coulomb matrix: 1.4E-10

Add contribution to self-energy... done
                               Timings
  MT wave-func. products:      0.34968
  PW wave-func. products:      0.79385
  Matrix-vector products:      2.21303
  Transformations:             0.32881
  Exchange self-energy:        0.10130
  Frequency integration:       0.07280
  Tetrahedron weights:         0.00000
  MPI idle time:               0.00004      0.00004
  Other:                       0.17779
  ------------------------------------
  Total:                       4.03731

=========

K point (   7 ):   0.00000   0.50000   0.00000

Coulomb matrix read from spex.cor
Inverse dielectric matrices read from spex.cor 
Hermiticity of transformed Coulomb matrix: 1.3E-10

Add contribution to self-energy... done
                               Timings
  MT wave-func. products:      0.19542
  PW wave-func. products:      0.44575
  Matrix-vector products:      0.71149
  Transformations:             0.15967
  Exchange self-energy:        0.07226
  Frequency integration:       0.03707
  Tetrahedron weights:         0.00000
  MPI idle time:               0.00002      0.00002
  Other:                       0.09371
  ------------------------------------
  Total:                       1.71539

=========

K point (   8 ):   0.00000   0.50000   0.25000

Coulomb matrix read from spex.cor
Inverse dielectric matrices read from spex.cor 
Hermiticity of transformed Coulomb matrix: 7.9E-11

Add contribution to self-energy... done
                               Timings
  MT wave-func. products:      0.18930
  PW wave-func. products:      0.42850
  Matrix-vector products:      0.65354
  Transformations:             0.15583
  Exchange self-energy:        0.06710
  Frequency integration:       0.03886
  Tetrahedron weights:         0.00000
  MPI idle time:               0.00004      0.00004
  Other:                       0.09172
  ------------------------------------
  Total:                       1.62489

=========

K point (   9 ):   0.00000   0.50000   0.50000

Coulomb matrix read from spex.cor
Inverse dielectric matrices read from spex.cor 
Hermiticity of transformed Coulomb matrix: 5.5E-11

Add contribution to self-energy... done
                               Timings
  MT wave-func. products:      0.19309
  PW wave-func. products:      0.41685
  Matrix-vector products:      1.07138
  Transformations:             0.14823
  Exchange self-energy:        0.06352
  Frequency integration:       0.03682
  Tetrahedron weights:         0.00000
  MPI idle time:               0.00002      0.00002
  Other:                       0.09406
  ------------------------------------
  Total:                       2.02396

=========

K point (  10 ):   0.25000   0.25000   0.00000

Coulomb matrix read from spex.cor
Inverse dielectric matrices read from spex.cor 
Hermiticity of transformed Coulomb matrix: 5.5E-11

Add contribution to self-energy... done
                               Timings
  MT wave-func. products:      0.27445
  PW wave-func. products:      0.60055
  Matrix-vector products:      1.55387
  Transformations:             0.24528
  Exchange self-energy:        0.08127
  Frequency integration:       0.05503
  Tetrahedron weights:         0.00000
  MPI idle time:               0.00002      0.00002
  Other:                       0.13556
  ------------------------------------
  Total:                       2.94603

=========

K point (  11 ):   0.25000   0.25000   0.25000

Coulomb matrix read from spex.cor
Inverse dielectric matrices read from spex.cor 
Hermiticity of transformed Coulomb matrix: 8.0E-11

Add contribution to self-energy... done
                               Timings
  MT wave-func. products:      0.27168
  PW wave-func. products:      0.62225
  Matrix-vector products:      1.59112
  Transformations:             0.25355
  Exchange self-energy:        0.08512
  Frequency integration:       0.05499
  Tetrahedron weights:         0.00000
  MPI idle time:               0.00002      0.00002
  Other:                       0.13618
  ------------------------------------
  Total:                       3.01491

=========

K point (  12 ):   0.25000   0.25000   0.50000

Coulomb matrix read from spex.cor
Inverse dielectric matrices read from spex.cor 
Hermiticity of transformed Coulomb matrix: 9.9E-11

Add contribution to self-energy... done
                               Timings
  MT wave-func. products:      0.26627
  PW wave-func. products:      0.60369
  Matrix-vector products:      2.94823
  Transformations:             0.24827
  Exchange self-energy:        0.08175
  Frequency integration:       0.05717
  Tetrahedron weights:         0.00000
  MPI idle time:               0.00005      0.00005
  Other:                       0.13123
  ------------------------------------
  Total:                       4.33666


### subroutine: exchange_core ###

        k point       band      exchange (core contribution)
  (0.712,0.000,0.000)   1     -4.1288431
  (0.712,0.000,0.000)   2     -8.9784018
  (0.712,0.000,0.000)   3    -17.8375911
  (0.712,0.000,0.000)   4    -17.9236042
  (0.712,0.000,0.000)   5    -17.9610141
  (0.712,0.000,0.000)   6    -18.2343549
  (0.712,0.000,0.000)   7    -18.3303410
  (0.712,0.000,0.000)   8    -18.1251600
  (0.712,0.000,0.000)   9    -18.5019868
  (0.712,0.000,0.000)  10    -18.6853085
Timing:   0.14




### subroutine: quasiparticle ###

Number of mesh points even: No constraint will be used.

List of k points
    0   0.71153   0.00000   0.00000  (additional) 



#####################
### K POINT:    0 ###
#####################


--- DIAGONAL ELEMENTS [eV] ---

 Bd       vxc    sigmax    sigmac         Z        KS        HF          GW lin/dir 
  1 -21.11170 -31.36492   8.35514   0.73379  -8.35457 -18.60780  -9.68058   0.84427 
                          0.97301  -0.06864                      -9.67084   0.81362 
  2 -29.08133 -40.56151   8.87863   0.72315  -7.92889 -19.40908  -9.79150   0.49536 
                          0.56617  -0.03303                      -9.72843   0.47689 
  3 -42.40197 -55.70105   9.49218   0.73735  -6.37183 -19.67090  -9.17776   0.11167 
                          0.07079  -0.01562                      -9.07757   0.13724 
  4 -42.55467 -55.87805   9.51048   0.73725  -6.35374 -19.67712  -9.16376   0.10838 
                          0.06794  -0.01529                      -9.06301   0.13419 
  5 -42.57089 -55.86572   9.46906   0.73869  -6.27964 -19.57447  -9.10479   0.10145 
                          0.06263  -0.01442                      -9.00333   0.12707 
  6 -43.08560 -56.47596   9.54909   0.73866  -6.23380 -19.62415  -9.07024   0.10332 
                          0.06403  -0.01458                      -8.96852   0.12898 
  7 -43.14230 -56.49667   9.46077   0.74168  -6.20969 -19.56406  -9.09710   0.06750 
                          0.03733  -0.01023                      -8.99012   0.09229 
  8 -42.81889 -56.11337   9.44282   0.74081  -6.17406 -19.46854  -9.02678   0.08606 
                          0.05168  -0.01240                      -8.92337   0.11077 
  9 -43.44651 -56.82876   9.47096   0.74243  -6.14133 -19.52357  -9.04490   0.05824 
                          0.03056  -0.00909                      -8.93634   0.08295 
 10 -43.77555 -57.18870   9.49303   0.74290  -6.05862 -19.47177  -8.97064   0.05555 
                          0.02855  -0.00876                      -8.86164   0.08039 

Timing (quasiparticle equation):   0.10750

Timing:        34
