########################
######### SPEX #########
########################
Version 05.00  (Sep  5, 2019)
Execution time: Jan 17, 2020  21:44:07
Hostname: login18-1.hpc.itc.rwth-aachen.de
MPI: 1,1


### subroutine: getinput ###

Basic parameters:
  Number of spins            =  1
            centers          =  4
            types            =  2
            equivalent atoms =  2  2
  Lattice parameter =      1.00000
  Lattice vectors   =      3.01411  -5.22060   0.00000
                           3.01411   5.22060   0.00000
                           0.00000   0.00000   9.80579
  Unit-cell volume  =    308.59778
  Reciprocal cutoff =      4.60000

Unit-cell geometry:
  # Ty  El              Coord.
  1  1  Ga   0.33333  -0.33333   0.00000
  2  1  Ga  -0.33333   0.33333   0.50000
  3  2  N    0.33333  -0.33333  -0.37700
  4  2  N   -0.33333   0.33333   0.12300

Symmetry information:
  Number of symmetry operations = 24
   #  Det           Axis           Angle   Syp  Inv
   1    1     --     --     --      --     Yes   1
   2   -1    1.00  -0.58   0.00   180.00   No    2
   3   -1    1.00   0.58   0.00   180.00   No    3
   4    1    0.00   0.00   1.00   120.00   Yes   9
   5    1    0.00   0.00   1.00   180.00   No    5
   6   -1    0.58   1.00   0.00   180.00   Yes   6
   7   -1    1.00   0.00   0.00   180.00   Yes   7
   8    1    0.00   0.00   1.00    60.00   No   11
   9    1    0.00   0.00  -1.00   120.00   Yes   4
  10   -1    0.00   1.00   0.00   180.00   No   10
  11    1    0.00   0.00  -1.00    60.00   No    8
  12   -1   -0.58   1.00   0.00   180.00   Yes  12
  13 - 24  Time reversal symmetries

##################
### Input file ###
##################
BZ       4 4 4
JOB      GW +:(1-10)
NBAND    200
RESTART  
KPT      +=(.32692,1.00000,0)
 
#  k point is converted from (0.32692,1.00000,0.00000) to (0.32692,0.00000,0.00000)

Info: Simpson and Lagrange integration is used.

Radial mesh and basis functions:
  Number of radial grid points:       759  429
  Number of radial basis functions:    19   18
  Angular momentum quantum number:      8    6
  Maximal index:                        3

Core states:
  Atom type  1  (Ga)
  nl      Energy
  1s  -375.34991
  2s   -45.88297
  3s    -4.96076
  2p   -39.88207
  3p    -3.15226
  Atom type  2  (N )
  nl      Energy
  1s   -13.54409
  Number of valence electrons:   36

Average Coulomb potential: -0.35487  ( -9.65657 eV )

Read wavefunctions from harddisc... done   ( Timing:    0.22 )

Maximal energy difference in deg. subspaces: 2.9E-13
Minimal energy difference between subspaces: 1.4E-05

Wave functions:
  Number of bands:             198 -  200  (  200 )
            k points (IBZ):     64  (  12 /  30 )
            G vectors:         726
  k points of IBZ:
    1  (0.00000,0.00000,0.00000)  [ 0.00000, 0.00000, 0.00000 ]
    2  (0.00000,0.00000,0.25000)  [ 0.00000, 0.00000, 0.02550 ]
    3  (0.00000,0.00000,0.50000)  [ 0.00000, 0.00000, 0.05099 ]
    4  (0.00000,0.25000,0.00000)  [ 0.04147, 0.02394, 0.00000 ]
    5  (0.00000,0.25000,0.25000)  [ 0.04147, 0.02394, 0.02550 ]
    6  (0.00000,0.25000,0.50000)  [ 0.04147, 0.02394, 0.05099 ]
    7  (0.00000,0.50000,0.00000)  [ 0.08294, 0.04789, 0.00000 ]
    8  (0.00000,0.50000,0.25000)  [ 0.08294, 0.04789, 0.02550 ]
    9  (0.00000,0.50000,0.50000)  [ 0.08294, 0.04789, 0.05099 ]
   10  (0.25000,0.25000,0.00000)  [ 0.08294, 0.00000, 0.00000 ]
   11  (0.25000,0.25000,0.25000)  [ 0.08294, 0.00000, 0.02550 ]
   12  (0.25000,0.25000,0.50000)  [ 0.08294, 0.00000, 0.05099 ]
  k points of EIBZ (shifted set):
   65  (0.32692,0.00000,0.00000)  [ 0.05423,-0.03131, 0.00000 ]
   66  (0.32692,0.00000,0.25000)  [ 0.05423,-0.03131, 0.02550 ]
   67  (0.32692,0.00000,0.50000)  [ 0.05423,-0.03131, 0.05099 ]
   68  (0.32692,0.25000,0.00000)  [ 0.09570,-0.00737, 0.00000 ]
   69  (0.32692,0.25000,0.25000)  [ 0.09570,-0.00737, 0.02550 ]
   70  (0.32692,0.25000,0.50000)  [ 0.09570,-0.00737, 0.05099 ]
   71  (0.32692,0.50000,0.00000)  [ 0.13717, 0.01658, 0.00000 ]
   72  (0.32692,0.50000,0.25000)  [ 0.13717, 0.01658, 0.02550 ]
   73  (0.32692,0.50000,0.50000)  [ 0.13717, 0.01658, 0.05099 ]
   74  (0.32692,0.75000,0.00000)  [ 0.17865, 0.04052, 0.00000 ]
   75  (0.32692,0.75000,0.25000)  [ 0.17865, 0.04052, 0.02550 ]
   76  (0.32692,0.75000,0.50000)  [ 0.17865, 0.04052, 0.05099 ]
   77  (0.57692,0.00000,0.00000)  [ 0.09570,-0.05525, 0.00000 ]
   78  (0.57692,0.00000,0.25000)  [ 0.09570,-0.05525, 0.02550 ]
   79  (0.57692,0.00000,0.50000)  [ 0.09570,-0.05525, 0.05099 ]
   80  (0.57692,0.25000,0.00000)  [ 0.13717,-0.03131, 0.00000 ]
   81  (0.57692,0.25000,0.25000)  [ 0.13717,-0.03131, 0.02550 ]
   82  (0.57692,0.25000,0.50000)  [ 0.13717,-0.03131, 0.05099 ]
   83  (0.57692,0.50000,0.00000)  [ 0.17865,-0.00737, 0.00000 ]
   84  (0.57692,0.50000,0.25000)  [ 0.17865,-0.00737, 0.02550 ]
   85  (0.57692,0.50000,0.50000)  [ 0.17865,-0.00737, 0.05099 ]
   86  (0.82692,0.00000,0.00000)  [ 0.13717,-0.07920, 0.00000 ]
   87  (0.82692,0.00000,0.25000)  [ 0.13717,-0.07920, 0.02550 ]
   88  (0.82692,0.00000,0.50000)  [ 0.13717,-0.07920, 0.05099 ]
   89  (0.82692,0.25000,0.00000)  [ 0.17865,-0.05525, 0.00000 ]
   90  (0.82692,0.25000,0.25000)  [ 0.17865,-0.05525, 0.02550 ]
   91  (0.82692,0.25000,0.50000)  [ 0.17865,-0.05525, 0.05099 ]
   92  (0.07692,0.00000,0.00000)  [ 0.01276,-0.00737, 0.00000 ]
   93  (0.07692,0.00000,0.25000)  [ 0.01276,-0.00737, 0.02550 ]
   94  (0.07692,0.00000,0.50000)  [ 0.01276,-0.00737, 0.05099 ]

Generate wavefunctions at equivalent k points... done   ( Timing:   0.35 )

Size of array cpw:   209.8 MB
Size of array cmt:   260.9 MB

The system is not a metal.
The Fermi energy is placed in the center of the band gap.
KS energy gap:    0.07059528 Ha   (  1.92099521 eV )
Fermi energy:     0.29316457 Ha   (  7.97741378 eV )
Maximal energy:   5.57248232 Ha
Electron count error of the shifted k-point set:  0.0000000000000000

Wave-function checksum: -1.234720125865E-01


### subroutine: checkinput ###

Overlap <core|core>
Atom type  1
1s  1.000000 
2s -0.000000  1.000000 
3s  0.000000 -0.000001  0.999961 
2p  0.999418 
3p -0.000329  0.999458 
Atom type  2
1s  0.999983 

Overlap <core|basis>
Atom type  1
         u(s)    udot(s)
1s  0.000000  0.000000 
2s  0.000001  0.000000 
3s  0.004767 -0.007551 
         u(p)    udot(p)
2p -0.000106 -0.000031 
3p  0.017150 -0.021254 
Atom type  2
         u(s)    udot(s)
1s  0.003209 -0.002046 

Average overlap <core|val>
Atom type  1
1s  0.000000
2s  0.000000
3s  0.000679
2p  0.000010  0.000010  0.000010
3p  0.002208  0.002205  0.002208
Atom type  2
1s  0.000234

Maximum overlap <core|val> at (band/kpoint)
Atom type  1
1s  0.000000 (022/ 009)
2s  0.000001 (022/ 009)
3s  0.003767 (156/ 003)
2p  0.000060 (025/ 003)  0.000064 (024/ 001)  0.000067 (026/ 003)
3p  0.012494 (122/ 003)  0.014817 (111/ 001)  0.013262 (124/ 003)
Atom type  2
1s  0.001610 (001/ 091)

Overlap <basis|basis>
Atom type  1
   u(s)  1.000000 
udot(s)  0.000000  0.129862 
   u(p)  1.000000 
udot(p) -0.000000  0.075237 
   u(d)  1.000000 
udot(d) -0.000000  0.733838 
 ulo(d)  0.410292 -0.767526  1.000000 
   u(f)  1.000000 
udot(f) -0.000000  0.020278 
   u(g)  1.000000 
udot(g) -0.000000  0.006703 
   u(h)  1.000000 
udot(h)  0.000000  0.003149 
   u(i)  1.000000 
udot(i) -0.000000  0.001726 
   u(j)  1.000000 
udot(j)  0.000000  0.001039 
   u(k)  1.000000 
udot(k) -0.000000  0.000667 
Atom type  2
   u(s)  1.000000 
udot(s)  0.000000  0.023146 
   u(p)  1.000000 
udot(p)  0.000000  0.036192 
   u(d)  1.000000 
udot(d)  0.000000  0.003612 
   u(f)  1.000000 
udot(f)  0.000000  0.001183 
   u(g)  1.000000 
udot(g)  0.000000  0.000520 
   u(h)  1.000000 
udot(h) -0.000000  0.000271 
   u(i)  1.000000 
udot(i)  0.000000  0.000157 


### subroutine: mixedbasis ( Mode: vv ) ###

Mixed basis
  Plane-wave basis:
    Number of unique G vectors:   344
    Maximal number of G vectors:  233

  MT basis read in from spex.mb (mode: vv).
    Total number of product-basis functions:  264



##### Job index:  1 #####


### subroutine: correlation ###

< GW self-energy >
Calculate periodic function...done   ( Timing:    0.08 )

=========

K point (   1 ):   0.00000   0.00000   0.00000

Coulomb matrix read from spex.cor
Inverse dielectric matrices read from spex.cor 
Invert dielectric tensor... done   ( Timing:    0.02 )
Hermiticity of transformed Coulomb matrix: 6.8E-11

Add contribution to self-energy... done
                               Timings
  MT wave-func. products:      0.10947
  PW wave-func. products:      0.24106
  Matrix-vector products:      0.32321
  Transformations:             0.08132
  Exchange self-energy:        0.06359
  Frequency integration:       0.01721
  Tetrahedron weights:         0.00000
  Gamma-point correction:      1.31217
  MPI idle time:               0.00003      0.00003
  Other:                       0.05009
  ------------------------------------
  Total:                       2.19815

=========

K point (   2 ):   0.00000   0.00000   0.25000

Coulomb matrix read from spex.cor
Inverse dielectric matrices read from spex.cor 
Hermiticity of transformed Coulomb matrix: 8.7E-10

Add contribution to self-energy... done
                               Timings
  MT wave-func. products:      0.10623
  PW wave-func. products:      0.22918
  Matrix-vector products:      0.30839
  Transformations:             0.07723
  Exchange self-energy:        0.04958
  Frequency integration:       0.01714
  Tetrahedron weights:         0.00000
  MPI idle time:               0.00003      0.00003
  Other:                       0.04730
  ------------------------------------
  Total:                       0.83508

=========

K point (   3 ):   0.00000   0.00000   0.50000

Coulomb matrix read from spex.cor
Inverse dielectric matrices read from spex.cor 
Hermiticity of transformed Coulomb matrix: 2.4E-10

Add contribution to self-energy... done
                               Timings
  MT wave-func. products:      0.10766
  PW wave-func. products:      0.23243
  Matrix-vector products:      0.50336
  Transformations:             0.07489
  Exchange self-energy:        0.04802
  Frequency integration:       0.01720
  Tetrahedron weights:         0.00000
  MPI idle time:               0.00002      0.00002
  Other:                       0.04813
  ------------------------------------
  Total:                       1.03169

=========

K point (   4 ):   0.00000   0.25000   0.00000

Coulomb matrix read from spex.cor
Inverse dielectric matrices read from spex.cor 
Hermiticity of transformed Coulomb matrix: 1.5E-10

Add contribution to self-energy... done
                               Timings
  MT wave-func. products:      0.32267
  PW wave-func. products:      0.78144
  Matrix-vector products:      2.13470
  Transformations:             0.30087
  Exchange self-energy:        0.09947
  Frequency integration:       0.06903
  Tetrahedron weights:         0.00000
  MPI idle time:               0.00004      0.00004
  Other:                       0.16939
  ------------------------------------
  Total:                       3.87761

=========

K point (   5 ):   0.00000   0.25000   0.25000

Coulomb matrix read from spex.cor
Inverse dielectric matrices read from spex.cor 
Hermiticity of transformed Coulomb matrix: 1.5E-10

Add contribution to self-energy... done
                               Timings
  MT wave-func. products:      0.33051
  PW wave-func. products:      0.81429
  Matrix-vector products:      2.19826
  Transformations:             0.31555
  Exchange self-energy:        0.09917
  Frequency integration:       0.07068
  Tetrahedron weights:         0.00000
  MPI idle time:               0.00004      0.00004
  Other:                       0.17419
  ------------------------------------
  Total:                       4.00270

=========

K point (   6 ):   0.00000   0.25000   0.50000

Coulomb matrix read from spex.cor
Inverse dielectric matrices read from spex.cor 
Hermiticity of transformed Coulomb matrix: 1.4E-10

Add contribution to self-energy... done
                               Timings
  MT wave-func. products:      0.31856
  PW wave-func. products:      0.79198
  Matrix-vector products:      2.12031
  Transformations:             0.32638
  Exchange self-energy:        0.10274
  Frequency integration:       0.06945
  Tetrahedron weights:         0.00000
  MPI idle time:               0.00003      0.00003
  Other:                       0.17201
  ------------------------------------
  Total:                       3.90147

=========

K point (   7 ):   0.00000   0.50000   0.00000

Coulomb matrix read from spex.cor
Inverse dielectric matrices read from spex.cor 
Hermiticity of transformed Coulomb matrix: 1.3E-10

Add contribution to self-energy... done
                               Timings
  MT wave-func. products:      0.17780
  PW wave-func. products:      0.43178
  Matrix-vector products:      0.63388
  Transformations:             0.14779
  Exchange self-energy:        0.06897
  Frequency integration:       0.03384
  Tetrahedron weights:         0.00000
  MPI idle time:               0.00002      0.00002
  Other:                       0.08680
  ------------------------------------
  Total:                       1.58087

=========

K point (   8 ):   0.00000   0.50000   0.25000

Coulomb matrix read from spex.cor
Inverse dielectric matrices read from spex.cor 
Hermiticity of transformed Coulomb matrix: 7.9E-11

Add contribution to self-energy... done
                               Timings
  MT wave-func. products:      0.18253
  PW wave-func. products:      0.43787
  Matrix-vector products:      0.67829
  Transformations:             0.15254
  Exchange self-energy:        0.06755
  Frequency integration:       0.03543
  Tetrahedron weights:         0.00000
  MPI idle time:               0.00002      0.00002
  Other:                       0.08863
  ------------------------------------
  Total:                       1.64287

=========

K point (   9 ):   0.00000   0.50000   0.50000

Coulomb matrix read from spex.cor
Inverse dielectric matrices read from spex.cor 
Hermiticity of transformed Coulomb matrix: 5.5E-11

Add contribution to self-energy... done
                               Timings
  MT wave-func. products:      0.19799
  PW wave-func. products:      0.43647
  Matrix-vector products:      1.11525
  Transformations:             0.15528
  Exchange self-energy:        0.06470
  Frequency integration:       0.03723
  Tetrahedron weights:         0.00000
  MPI idle time:               0.00005      0.00005
  Other:                       0.09644
  ------------------------------------
  Total:                       2.10341

=========

K point (  10 ):   0.25000   0.25000   0.00000

Coulomb matrix read from spex.cor
Inverse dielectric matrices read from spex.cor 
Hermiticity of transformed Coulomb matrix: 5.5E-11

Add contribution to self-energy... done
                               Timings
  MT wave-func. products:      0.26072
  PW wave-func. products:      0.59602
  Matrix-vector products:      1.49460
  Transformations:             0.24977
  Exchange self-energy:        0.08199
  Frequency integration:       0.05500
  Tetrahedron weights:         0.00000
  MPI idle time:               0.00011      0.00011
  Other:                       0.13671
  ------------------------------------
  Total:                       2.87490

=========

K point (  11 ):   0.25000   0.25000   0.25000

Coulomb matrix read from spex.cor
Inverse dielectric matrices read from spex.cor 
Hermiticity of transformed Coulomb matrix: 8.0E-11

Add contribution to self-energy... done
                               Timings
  MT wave-func. products:      0.26396
  PW wave-func. products:      0.62369
  Matrix-vector products:      1.58678
  Transformations:             0.25761
  Exchange self-energy:        0.08753
  Frequency integration:       0.05563
  Tetrahedron weights:         0.00000
  MPI idle time:               0.00005      0.00005
  Other:                       0.13783
  ------------------------------------
  Total:                       3.01306

=========

K point (  12 ):   0.25000   0.25000   0.50000

Coulomb matrix read from spex.cor
Inverse dielectric matrices read from spex.cor 
Hermiticity of transformed Coulomb matrix: 9.9E-11

Add contribution to self-energy... done
                               Timings
  MT wave-func. products:      0.26395
  PW wave-func. products:      0.63390
  Matrix-vector products:      3.29226
  Transformations:             0.25900
  Exchange self-energy:        0.08642
  Frequency integration:       0.05905
  Tetrahedron weights:         0.00000
  MPI idle time:               0.00004      0.00004
  Other:                       0.13629
  ------------------------------------
  Total:                       4.73091


### subroutine: exchange_core ###

        k point       band      exchange (core contribution)
  (0.327,0.000,0.000)   1     -4.9663526
  (0.327,0.000,0.000)   2     -9.1664398
  (0.327,0.000,0.000)   3    -17.8295037
  (0.327,0.000,0.000)   4    -17.9385366
  (0.327,0.000,0.000)   5    -18.0158254
  (0.327,0.000,0.000)   6    -18.2925398
  (0.327,0.000,0.000)   7    -18.2937916
  (0.327,0.000,0.000)   8    -18.3052025
  (0.327,0.000,0.000)   9    -18.5325958
  (0.327,0.000,0.000)  10    -18.6905439
Timing:   0.14




### subroutine: quasiparticle ###

Number of mesh points even: No constraint will be used.

List of k points
    0   0.32692   0.00000   0.00000  (additional) 



#####################
### K POINT:    0 ###
#####################


--- DIAGONAL ELEMENTS [eV] ---

 Bd       vxc    sigmax    sigmac         Z        KS        HF          GW lin/dir 
  1 -22.51776 -32.97490   8.44722   0.73236  -8.25912 -18.71625  -9.67459   0.78615 
                          0.90137  -0.06270                      -9.65714   0.75430 
  2 -29.38517 -40.90925   8.90126   0.72276  -7.91449 -19.43857  -9.79217   0.48517 
                          0.55320  -0.03254                      -9.72804   0.46813 
  3 -42.37894 -55.66762   9.47966   0.73760  -6.36751 -19.65619  -9.17595   0.10988 
                          0.06941  -0.01541                      -9.07558   0.13541 
  4 -42.57171 -55.89309   9.50394   0.73752  -6.34923 -19.67061  -9.16367   0.10589 
                          0.06602  -0.01498                      -9.06257   0.13166 
  5 -42.64298 -55.94283   9.46048   0.73934  -6.26803 -19.56788  -9.10584   0.09472 
                          0.05748  -0.01360                      -9.00332   0.12024 
  6 -43.18576 -56.58892   9.55701   0.73886  -6.21207 -19.61523  -9.05291   0.10230 
                          0.06321  -0.01446                      -8.95098   0.12796 
  7 -43.09312 -56.44033   9.46336   0.74130  -6.20734 -19.55455  -9.08600   0.07239 
                          0.04089  -0.01084                      -8.97993   0.09733 
  8 -43.12178 -56.47556   9.47743   0.74108  -6.17491 -19.52869  -9.04706   0.07883 
                          0.04571  -0.01160                      -8.94200   0.10388 
  9 -43.50786 -56.90275   9.48390   0.74228  -6.12648 -19.52137  -9.02924   0.06035 
                          0.03198  -0.00936                      -8.92095   0.08523 
 10 -43.78409 -57.19901   9.49322   0.74291  -6.05570 -19.47061  -8.96892   0.05499 
                          0.02811  -0.00870                      -8.85977   0.07989 

Timing (quasiparticle equation):   0.10856

Timing:        33
