########################
######### SPEX #########
########################
Version 05.00  (Sep  5, 2019)
Execution time: Jan 17, 2020  21:33:39
Hostname: login18-1.hpc.itc.rwth-aachen.de
MPI: 1,1


### subroutine: getinput ###

Basic parameters:
  Number of spins            =  1
            centers          =  4
            types            =  2
            equivalent atoms =  2  2
  Lattice parameter =      1.00000
  Lattice vectors   =      3.01411  -5.22060   0.00000
                           3.01411   5.22060   0.00000
                           0.00000   0.00000   9.80579
  Unit-cell volume  =    308.59778
  Reciprocal cutoff =      4.60000

Unit-cell geometry:
  # Ty  El              Coord.
  1  1  Ga   0.33333  -0.33333   0.00000
  2  1  Ga  -0.33333   0.33333   0.50000
  3  2  N    0.33333  -0.33333  -0.37700
  4  2  N   -0.33333   0.33333   0.12300

Symmetry information:
  Number of symmetry operations = 24
   #  Det           Axis           Angle   Syp  Inv
   1    1     --     --     --      --     Yes   1
   2   -1    1.00  -0.58   0.00   180.00   No    2
   3   -1    1.00   0.58   0.00   180.00   No    3
   4    1    0.00   0.00   1.00   120.00   Yes   9
   5    1    0.00   0.00   1.00   180.00   No    5
   6   -1    0.58   1.00   0.00   180.00   Yes   6
   7   -1    1.00   0.00   0.00   180.00   Yes   7
   8    1    0.00   0.00   1.00    60.00   No   11
   9    1    0.00   0.00  -1.00   120.00   Yes   4
  10   -1    0.00   1.00   0.00   180.00   No   10
  11    1    0.00   0.00  -1.00    60.00   No    8
  12   -1   -0.58   1.00   0.00   180.00   Yes  12
  13 - 24  Time reversal symmetries

##################
### Input file ###
##################
BZ       4 4 4
JOB      GW +:(1-10)
NBAND    200
RESTART  
KPT      +=(.07692,1.00000,0)
 
#  k point is converted from (0.07692,1.00000,0.00000) to (0.07692,0.00000,0.00000)

Info: Simpson and Lagrange integration is used.

Radial mesh and basis functions:
  Number of radial grid points:       759  429
  Number of radial basis functions:    19   18
  Angular momentum quantum number:      8    6
  Maximal index:                        3

Core states:
  Atom type  1  (Ga)
  nl      Energy
  1s  -375.34991
  2s   -45.88297
  3s    -4.96076
  2p   -39.88207
  3p    -3.15226
  Atom type  2  (N )
  nl      Energy
  1s   -13.54409
  Number of valence electrons:   36

Average Coulomb potential: -0.35487  ( -9.65657 eV )

Read wavefunctions from harddisc... done   ( Timing:    0.21 )

Maximal energy difference in deg. subspaces: 6.1E-13
Minimal energy difference between subspaces: 1.4E-05

Wave functions:
  Number of bands:             198 -  200  (  200 )
            k points (IBZ):     64  (  12 /  30 )
            G vectors:         726
  k points of IBZ:
    1  (0.00000,0.00000,0.00000)  [ 0.00000, 0.00000, 0.00000 ]
    2  (0.00000,0.00000,0.25000)  [ 0.00000, 0.00000, 0.02550 ]
    3  (0.00000,0.00000,0.50000)  [ 0.00000, 0.00000, 0.05099 ]
    4  (0.00000,0.25000,0.00000)  [ 0.04147, 0.02394, 0.00000 ]
    5  (0.00000,0.25000,0.25000)  [ 0.04147, 0.02394, 0.02550 ]
    6  (0.00000,0.25000,0.50000)  [ 0.04147, 0.02394, 0.05099 ]
    7  (0.00000,0.50000,0.00000)  [ 0.08294, 0.04789, 0.00000 ]
    8  (0.00000,0.50000,0.25000)  [ 0.08294, 0.04789, 0.02550 ]
    9  (0.00000,0.50000,0.50000)  [ 0.08294, 0.04789, 0.05099 ]
   10  (0.25000,0.25000,0.00000)  [ 0.08294, 0.00000, 0.00000 ]
   11  (0.25000,0.25000,0.25000)  [ 0.08294, 0.00000, 0.02550 ]
   12  (0.25000,0.25000,0.50000)  [ 0.08294, 0.00000, 0.05099 ]
  k points of EIBZ (shifted set):
   65  (0.07692,0.00000,0.00000)  [ 0.01276,-0.00737, 0.00000 ]
   66  (0.07692,0.00000,0.25000)  [ 0.01276,-0.00737, 0.02550 ]
   67  (0.07692,0.00000,0.50000)  [ 0.01276,-0.00737, 0.05099 ]
   68  (0.07692,0.25000,0.00000)  [ 0.05423, 0.01658, 0.00000 ]
   69  (0.07692,0.25000,0.25000)  [ 0.05423, 0.01658, 0.02550 ]
   70  (0.07692,0.25000,0.50000)  [ 0.05423, 0.01658, 0.05099 ]
   71  (0.07692,0.50000,0.00000)  [ 0.09570, 0.04052, 0.00000 ]
   72  (0.07692,0.50000,0.25000)  [ 0.09570, 0.04052, 0.02550 ]
   73  (0.07692,0.50000,0.50000)  [ 0.09570, 0.04052, 0.05099 ]
   74  (0.07692,0.75000,0.00000)  [ 0.13717, 0.06446, 0.00000 ]
   75  (0.07692,0.75000,0.25000)  [ 0.13717, 0.06446, 0.02550 ]
   76  (0.07692,0.75000,0.50000)  [ 0.13717, 0.06446, 0.05099 ]
   77  (0.32692,0.00000,0.00000)  [ 0.05423,-0.03131, 0.00000 ]
   78  (0.32692,0.00000,0.25000)  [ 0.05423,-0.03131, 0.02550 ]
   79  (0.32692,0.00000,0.50000)  [ 0.05423,-0.03131, 0.05099 ]
   80  (0.32692,0.25000,0.00000)  [ 0.09570,-0.00737, 0.00000 ]
   81  (0.32692,0.25000,0.25000)  [ 0.09570,-0.00737, 0.02550 ]
   82  (0.32692,0.25000,0.50000)  [ 0.09570,-0.00737, 0.05099 ]
   83  (0.32692,0.50000,0.00000)  [ 0.13717, 0.01658, 0.00000 ]
   84  (0.32692,0.50000,0.25000)  [ 0.13717, 0.01658, 0.02550 ]
   85  (0.32692,0.50000,0.50000)  [ 0.13717, 0.01658, 0.05099 ]
   86  (0.57692,0.00000,0.00000)  [ 0.09570,-0.05525, 0.00000 ]
   87  (0.57692,0.00000,0.25000)  [ 0.09570,-0.05525, 0.02550 ]
   88  (0.57692,0.00000,0.50000)  [ 0.09570,-0.05525, 0.05099 ]
   89  (0.57692,0.25000,0.00000)  [ 0.13717,-0.03131, 0.00000 ]
   90  (0.57692,0.25000,0.25000)  [ 0.13717,-0.03131, 0.02550 ]
   91  (0.57692,0.25000,0.50000)  [ 0.13717,-0.03131, 0.05099 ]
   92  (0.82692,0.00000,0.00000)  [ 0.13717,-0.07920, 0.00000 ]
   93  (0.82692,0.00000,0.25000)  [ 0.13717,-0.07920, 0.02550 ]
   94  (0.82692,0.00000,0.50000)  [ 0.13717,-0.07920, 0.05099 ]

Generate wavefunctions at equivalent k points... done   ( Timing:   0.31 )

Size of array cpw:   209.8 MB
Size of array cmt:   260.9 MB

The system is not a metal.
The Fermi energy is placed in the center of the band gap.
KS energy gap:    0.07059528 Ha   (  1.92099521 eV )
Fermi energy:     0.29316457 Ha   (  7.97741378 eV )
Maximal energy:   5.57248232 Ha
Electron count error of the shifted k-point set:  0.0000000000000000

Wave-function checksum:  7.683315426126E-02


### subroutine: checkinput ###

Overlap <core|core>
Atom type  1
1s  1.000000 
2s -0.000000  1.000000 
3s  0.000000 -0.000001  0.999961 
2p  0.999418 
3p -0.000329  0.999458 
Atom type  2
1s  0.999983 

Overlap <core|basis>
Atom type  1
         u(s)    udot(s)
1s  0.000000  0.000000 
2s  0.000001  0.000000 
3s  0.004767 -0.007551 
         u(p)    udot(p)
2p -0.000106 -0.000031 
3p  0.017150 -0.021254 
Atom type  2
         u(s)    udot(s)
1s  0.003209 -0.002046 

Average overlap <core|val>
Atom type  1
1s  0.000000
2s  0.000000
3s  0.000679
2p  0.000010  0.000010  0.000010
3p  0.002208  0.002205  0.002208
Atom type  2
1s  0.000234

Maximum overlap <core|val> at (band/kpoint)
Atom type  1
1s  0.000000 (033/ 001)
2s  0.000001 (033/ 001)
3s  0.003697 (156/ 003)
2p  0.000055 (024/ 003)  0.000064 (024/ 001)  0.000057 (023/ 003)
3p  0.011526 (121/ 003)  0.014817 (111/ 001)  0.011787 (124/ 003)
Atom type  2
1s  0.001674 (001/ 067)

Overlap <basis|basis>
Atom type  1
   u(s)  1.000000 
udot(s) -0.000000  0.129862 
   u(p)  1.000000 
udot(p) -0.000000  0.075237 
   u(d)  1.000000 
udot(d) -0.000000  0.733838 
 ulo(d)  0.410292 -0.767526  1.000000 
   u(f)  1.000000 
udot(f) -0.000000  0.020278 
   u(g)  1.000000 
udot(g) -0.000000  0.006703 
   u(h)  1.000000 
udot(h)  0.000000  0.003149 
   u(i)  1.000000 
udot(i) -0.000000  0.001726 
   u(j)  1.000000 
udot(j) -0.000000  0.001039 
   u(k)  1.000000 
udot(k)  0.000000  0.000667 
Atom type  2
   u(s)  1.000000 
udot(s)  0.000000  0.023146 
   u(p)  1.000000 
udot(p)  0.000000  0.036192 
   u(d)  1.000000 
udot(d)  0.000000  0.003612 
   u(f)  1.000000 
udot(f)  0.000000  0.001183 
   u(g)  1.000000 
udot(g) -0.000000  0.000520 
   u(h)  1.000000 
udot(h) -0.000000  0.000271 
   u(i)  1.000000 
udot(i)  0.000000  0.000157 


### subroutine: mixedbasis ( Mode: vv ) ###

Mixed basis
  Plane-wave basis:
    Number of unique G vectors:   344
    Maximal number of G vectors:  233

  MT basis read in from spex.mb (mode: vv).
    Total number of product-basis functions:  264



##### Job index:  1 #####


### subroutine: correlation ###

< GW self-energy >
Calculate periodic function...done   ( Timing:    0.09 )

=========

K point (   1 ):   0.00000   0.00000   0.00000

Coulomb matrix read from spex.cor
Inverse dielectric matrices read from spex.cor 
Invert dielectric tensor... done   ( Timing:    0.02 )
Hermiticity of transformed Coulomb matrix: 6.8E-11

Add contribution to self-energy... done
                               Timings
  MT wave-func. products:      0.11337
  PW wave-func. products:      0.27461
  Matrix-vector products:      0.33326
  Transformations:             0.08581
  Exchange self-energy:        0.06714
  Frequency integration:       0.01774
  Tetrahedron weights:         0.00000
  Gamma-point correction:      1.40068
  MPI idle time:               0.00006      0.00006
  Other:                       0.05188
  ------------------------------------
  Total:                       2.34455

=========

K point (   2 ):   0.00000   0.00000   0.25000

Coulomb matrix read from spex.cor
Inverse dielectric matrices read from spex.cor 
Hermiticity of transformed Coulomb matrix: 8.7E-10

Add contribution to self-energy... done
                               Timings
  MT wave-func. products:      0.11136
  PW wave-func. products:      0.25169
  Matrix-vector products:      0.32557
  Transformations:             0.08093
  Exchange self-energy:        0.05142
  Frequency integration:       0.01837
  Tetrahedron weights:         0.00000
  MPI idle time:               0.00002      0.00002
  Other:                       0.05005
  ------------------------------------
  Total:                       0.88940

=========

K point (   3 ):   0.00000   0.00000   0.50000

Coulomb matrix read from spex.cor
Inverse dielectric matrices read from spex.cor 
Hermiticity of transformed Coulomb matrix: 2.4E-10

Add contribution to self-energy... done
                               Timings
  MT wave-func. products:      0.11336
  PW wave-func. products:      0.24157
  Matrix-vector products:      0.53631
  Transformations:             0.07859
  Exchange self-energy:        0.04966
  Frequency integration:       0.01874
  Tetrahedron weights:         0.00000
  MPI idle time:               0.00002      0.00002
  Other:                       0.05211
  ------------------------------------
  Total:                       1.09035

=========

K point (   4 ):   0.00000   0.25000   0.00000

Coulomb matrix read from spex.cor
Inverse dielectric matrices read from spex.cor 
Hermiticity of transformed Coulomb matrix: 1.5E-10

Add contribution to self-energy... done
                               Timings
  MT wave-func. products:      0.34095
  PW wave-func. products:      0.80743
  Matrix-vector products:      2.18234
  Transformations:             0.32106
  Exchange self-energy:        0.10248
  Frequency integration:       0.07240
  Tetrahedron weights:         0.00000
  MPI idle time:               0.00004      0.00004
  Other:                       0.17826
  ------------------------------------
  Total:                       4.00496

=========

K point (   5 ):   0.00000   0.25000   0.25000

Coulomb matrix read from spex.cor
Inverse dielectric matrices read from spex.cor 
Hermiticity of transformed Coulomb matrix: 1.5E-10

Add contribution to self-energy... done
                               Timings
  MT wave-func. products:      0.33324
  PW wave-func. products:      0.82296
  Matrix-vector products:      2.21412
  Transformations:             0.33081
  Exchange self-energy:        0.10492
  Frequency integration:       0.07175
  Tetrahedron weights:         0.00000
  MPI idle time:               0.00005      0.00005
  Other:                       0.17718
  ------------------------------------
  Total:                       4.05503

=========

K point (   6 ):   0.00000   0.25000   0.50000

Coulomb matrix read from spex.cor
Inverse dielectric matrices read from spex.cor 
Hermiticity of transformed Coulomb matrix: 1.4E-10

Add contribution to self-energy... done
                               Timings
  MT wave-func. products:      0.33164
  PW wave-func. products:      0.84047
  Matrix-vector products:      2.25999
  Transformations:             0.33289
  Exchange self-energy:        0.10692
  Frequency integration:       0.07119
  Tetrahedron weights:         0.00000
  MPI idle time:               0.00004      0.00004
  Other:                       0.17719
  ------------------------------------
  Total:                       4.12033

=========

K point (   7 ):   0.00000   0.50000   0.00000

Coulomb matrix read from spex.cor
Inverse dielectric matrices read from spex.cor 
Hermiticity of transformed Coulomb matrix: 1.3E-10

Add contribution to self-energy... done
                               Timings
  MT wave-func. products:      0.19331
  PW wave-func. products:      0.44375
  Matrix-vector products:      0.68120
  Transformations:             0.16259
  Exchange self-energy:        0.07121
  Frequency integration:       0.03723
  Tetrahedron weights:         0.00000
  MPI idle time:               0.00003      0.00003
  Other:                       0.09798
  ------------------------------------
  Total:                       1.68729

=========

K point (   8 ):   0.00000   0.50000   0.25000

Coulomb matrix read from spex.cor
Inverse dielectric matrices read from spex.cor 
Hermiticity of transformed Coulomb matrix: 7.9E-11

Add contribution to self-energy... done
                               Timings
  MT wave-func. products:      0.18261
  PW wave-func. products:      0.43454
  Matrix-vector products:      0.65547
  Transformations:             0.15519
  Exchange self-energy:        0.06762
  Frequency integration:       0.03613
  Tetrahedron weights:         0.00000
  MPI idle time:               0.00003      0.00003
  Other:                       0.09105
  ------------------------------------
  Total:                       1.62264

=========

K point (   9 ):   0.00000   0.50000   0.50000

Coulomb matrix read from spex.cor
Inverse dielectric matrices read from spex.cor 
Hermiticity of transformed Coulomb matrix: 5.5E-11

Add contribution to self-energy... done
                               Timings
  MT wave-func. products:      0.18566
  PW wave-func. products:      0.42002
  Matrix-vector products:      1.06787
  Transformations:             0.15284
  Exchange self-energy:        0.06455
  Frequency integration:       0.03633
  Tetrahedron weights:         0.00000
  MPI idle time:               0.00005      0.00005
  Other:                       0.09268
  ------------------------------------
  Total:                       2.01999

=========

K point (  10 ):   0.25000   0.25000   0.00000

Coulomb matrix read from spex.cor
Inverse dielectric matrices read from spex.cor 
Hermiticity of transformed Coulomb matrix: 5.5E-11

Add contribution to self-energy... done
                               Timings
  MT wave-func. products:      0.26300
  PW wave-func. products:      0.60207
  Matrix-vector products:      1.51287
  Transformations:             0.25058
  Exchange self-energy:        0.08238
  Frequency integration:       0.05516
  Tetrahedron weights:         0.00000
  MPI idle time:               0.00002      0.00002
  Other:                       0.13710
  ------------------------------------
  Total:                       2.90317

=========

K point (  11 ):   0.25000   0.25000   0.25000

Coulomb matrix read from spex.cor
Inverse dielectric matrices read from spex.cor 
Hermiticity of transformed Coulomb matrix: 8.0E-11

Add contribution to self-energy... done
                               Timings
  MT wave-func. products:      0.25754
  PW wave-func. products:      0.61109
  Matrix-vector products:      1.55280
  Transformations:             0.25078
  Exchange self-energy:        0.08317
  Frequency integration:       0.05493
  Tetrahedron weights:         0.00000
  MPI idle time:               0.00002      0.00002
  Other:                       0.13666
  ------------------------------------
  Total:                       2.94699

=========

K point (  12 ):   0.25000   0.25000   0.50000

Coulomb matrix read from spex.cor
Inverse dielectric matrices read from spex.cor 
Hermiticity of transformed Coulomb matrix: 9.9E-11

Add contribution to self-energy... done
                               Timings
  MT wave-func. products:      0.26383
  PW wave-func. products:      0.63249
  Matrix-vector products:      2.88570
  Transformations:             0.25457
  Exchange self-energy:        0.08561
  Frequency integration:       0.05406
  Tetrahedron weights:         0.00000
  MPI idle time:               0.00004      0.00004
  Other:                       0.12827
  ------------------------------------
  Total:                       4.30456


### subroutine: exchange_core ###

        k point       band      exchange (core contribution)
  (0.077,0.000,0.000)   1     -1.7137487
  (0.077,0.000,0.000)   2     -7.8059186
  (0.077,0.000,0.000)   3    -17.7448288
  (0.077,0.000,0.000)   4    -17.7809718
  (0.077,0.000,0.000)   5    -17.6605975
  (0.077,0.000,0.000)   6    -17.9297184
  (0.077,0.000,0.000)   7    -17.9514637
  (0.077,0.000,0.000)   8    -18.4427061
  (0.077,0.000,0.000)   9    -18.4541626
  (0.077,0.000,0.000)  10    -18.6180534
Timing:   0.14




### subroutine: quasiparticle ###

Number of mesh points even: No constraint will be used.

List of k points
    0   0.07692   0.00000   0.00000  (additional) 



#####################
### K POINT:    0 ###
#####################


--- DIAGONAL ELEMENTS [eV] ---

 Bd       vxc    sigmax    sigmac         Z        KS        HF          GW lin/dir 
  1 -16.84795 -26.56429   8.15287   0.73603  -8.89820 -18.61454  -9.92953   1.06087 
                          1.23610  -0.09662                      -9.93569   1.04745 
  2 -27.16001 -38.34444   8.75653   0.72773  -8.03962 -19.22405  -9.77780   0.59135 
                          0.66964  -0.04285                      -9.73038   0.56362 
  3 -42.25579 -55.55616   9.50451   0.73642  -6.42926 -19.72963  -9.22339   0.11636 
                          0.07446  -0.01621                      -9.12366   0.14204 
  4 -42.32825 -55.63779   9.51397   0.73615  -6.41101 -19.72055  -9.20393   0.11514 
                          0.07320  -0.01614                      -9.10407   0.14109 
  5 -42.11865 -55.38451   9.48878   0.73597  -6.39956 -19.66541  -9.17805   0.12072 
                          0.07777  -0.01681                      -9.07941   0.14657 
  6 -42.55520 -55.87471   9.50119   0.73771  -6.35226 -19.67178  -9.16808   0.10694 
                          0.06700  -0.01506                      -9.06715   0.13255 
  7 -42.59728 -55.92732   9.50970   0.73772  -6.34725 -19.67729  -9.16456   0.10786 
                          0.06776  -0.01515                      -9.06363   0.13343 
  8 -43.32750 -56.68255   9.44043   0.74289  -6.17439 -19.52944  -9.08230   0.05316 
                          0.02711  -0.00844                      -8.97306   0.07745 
  9 -43.34792 -56.70752   9.44289   0.74292  -6.17021 -19.52981  -9.07979   0.05297 
                          0.02700  -0.00840                      -8.97042   0.07725 
 10 -43.65632 -57.05735   9.48723   0.74274  -6.08203 -19.48306  -8.98867   0.05954 
                          0.03149  -0.00924                      -8.88044   0.08430 

Timing (quasiparticle equation):   0.11122

Timing:        34
