
24 25 26 27 28 29 30 31 32 33 34 35 36 37 38 39 40 41 42 43 44 45 46 47 48 49 50 51 52 53 54 55 56 57 58 59 60 61 62 63 64 65 66 67 68 69 70 71 72 73 74 75 76 77 78 79 80 81 82 83 84 85 86 87 88 89 90 91 92 93 94 95 96 97 98 99 100 101 102 103 104 105 106 107 108 109 110 111 112 113 114 115 116 117 118 119 120 121 122 123 124 125 126 127 128 129 130 131 132 133 134 135 136 137 138 139 140 141 142 143 144 145 146 147 148 149 150 151 152 153 154 155 156 157 158 159 160 161 162 163 164 165 166 167 168 169 170 171 172 173 174 175 176 177 178 179 180 181 182 183 184 185 186 187 188 189 190 191 192 193 194 195 196 197 198 199 200 201 202 204 205 
17 18 19 20 21 22 23 
0 1 2 3 4 5 6 7 8 9 10 11 12 13 14 15 16 


















24 25 26 27 28 29 30 31 32 33 34 35 36 37 38 39 40 41 42 43 44 45 46 47 48 49 50 51 52 53 54 55 56 57 58 59 60 61 62 63 64 65 66 67 68 69 70 71 72 73 74 75 76 77 78 79 80 81 82 83 84 85 86 87 88 89 90 91 92 93 94 95 96 97 98 99 100 101 102 103 104 105 106 107 108 109 110 111 112 113 114 115 116 117 118 119 120 121 122 123 124 125 126 127 128 129 130 131 132 133 134 135 138 139 140 141 142 146 148 150 
17 18 19 20 21 22 23 136 137 143 144 145 147 149 151 152 153 154 155 156 157 158 159 160 161 162 163 164 165 166 167 
0 1 2 3 4 5 6 7 8 9 10 11 12 13 14 15 16 168 169 170 172 173 174 175 176 177 178 179 181 182 185 186 188 190 193 194 198 
171 180 183 184 187 189 191 192 196 
195 197 200 
199 202 206 
204 
201 



205 









24 25 26 27 28 29 30 31 32 33 34 35 36 37 38 39 40 41 42 43 44 45 46 47 48 49 50 51 52 53 54 55 56 57 58 59 60 61 62 63 64 65 66 67 68 69 70 71 72 73 74 75 76 77 78 79 80 81 82 83 84 85 86 87 88 89 90 91 92 93 94 95 96 97 98 99 100 101 102 103 104 105 106 107 108 109 110 111 112 113 114 115 116 117 118 119 120 121 122 123 124 125 126 127 128 129 130 131 132 133 134 135 138 139 140 141 142 146 148 150 
17 18 19 20 21 22 23 136 137 143 144 145 147 149 151 152 154 156 158 162 166 
0 1 2 3 4 5 6 7 8 9 10 11 12 13 14 15 16 153 155 157 159 160 161 163 164 165 167 168 170 
169 172 173 174 175 176 177 178 179 181 182 186 190 194 198 
180 183 184 185 188 193 
171 187 189 191 192 196 
197 200 202 
195 199 

204 

201 
206 








24 25 26 27 28 29 30 31 32 33 34 35 36 37 38 39 40 41 42 43 44 45 46 47 48 49 50 51 52 53 54 55 56 57 58 59 60 61 62 63 64 65 66 67 68 69 70 71 72 73 74 75 76 77 78 79 80 81 82 83 84 85 86 87 88 89 90 91 92 93 94 95 96 97 98 99 100 101 102 103 104 105 106 107 108 109 110 111 112 113 114 115 116 117 118 119 120 121 122 123 124 125 126 127 128 129 130 131 132 133 134 135 138 139 140 141 142 146 148 150 205 
17 18 19 20 21 22 23 136 137 143 144 145 147 149 151 152 154 156 162 166 
0 1 2 3 4 5 6 7 8 9 10 11 12 13 14 15 16 153 155 157 158 159 163 168 170 
160 161 164 165 167 174 175 203 
169 172 173 176 177 178 179 181 182 183 190 194 198 
180 184 185 186 188 193 
171 187 189 192 196 
191 200 
195 197 
199 
202 
204 



201 206 





24 25 26 27 28 29 30 31 32 33 34 35 36 37 38 39 40 41 42 43 44 45 46 47 48 49 50 51 52 53 54 55 56 57 58 59 60 61 62 63 64 65 66 67 68 69 70 71 72 73 74 75 76 77 78 79 80 81 82 83 84 85 86 87 88 89 90 91 92 93 94 95 96 97 98 99 100 101 102 103 104 105 106 107 108 109 110 111 112 113 114 115 116 117 118 119 120 121 122 123 124 125 126 127 128 129 130 131 132 133 134 135 138 139 140 141 142 146 148 150 
17 18 19 20 21 22 23 136 137 143 144 145 147 149 151 152 154 156 166 
0 1 2 3 4 5 6 7 8 9 10 11 12 13 14 15 16 153 155 157 159 162 168 
158 160 161 163 165 170 174 
164 167 172 175 
169 173 176 177 178 179 181 182 183 190 194 198 
180 184 185 186 188 193 
171 187 189 192 196 
191 200 
195 203 
197 199 205 



204 
202 




201 
24 25 26 27 28 29 30 31 32 33 34 35 36 37 38 39 40 41 42 43 44 45 46 47 48 49 50 51 52 53 54 55 56 57 58 59 60 61 62 63 64 65 66 67 68 69 70 71 72 73 74 75 76 77 78 79 80 81 82 83 84 85 86 87 88 89 90 91 92 93 94 95 96 97 98 99 100 101 102 103 104 105 106 107 108 109 110 111 112 113 114 115 116 117 118 119 120 121 122 123 124 125 126 127 128 129 130 131 132 133 134 135 138 139 140 141 142 146 148 150 
17 18 19 20 21 22 23 136 137 143 144 145 147 149 151 152 154 156 166 
0 1 2 3 4 5 6 7 8 9 10 11 12 13 14 15 16 153 157 168 
155 158 159 160 161 162 163 165 174 206 
164 170 175 
167 169 172 173 176 181 
177 178 179 182 183 188 190 193 194 
171 180 184 185 186 189 196 198 
187 192 207 
191 200 
195 203 
197 199 

205 




204 
202 

24 25 26 27 28 29 30 31 32 33 34 35 36 37 38 39 40 41 42 43 44 45 46 47 48 49 50 51 52 53 54 55 56 57 58 59 60 61 62 63 64 65 66 67 68 69 70 71 72 73 74 75 76 77 78 79 80 81 82 83 84 85 86 87 88 89 90 91 92 93 94 95 96 97 98 99 100 101 102 103 104 105 106 107 108 109 110 111 112 113 114 115 116 117 118 119 120 121 122 123 124 125 126 127 128 129 130 131 132 133 134 135 138 139 140 141 142 146 148 150 
17 18 19 20 21 22 23 136 137 143 144 145 147 149 151 152 154 156 166 
0 1 2 3 4 5 6 7 8 9 10 11 12 13 14 15 16 153 157 168 201 
155 158 159 160 161 162 163 165 174 
164 170 175 
167 173 176 181 
169 172 179 
177 178 182 183 188 190 193 194 
171 180 184 185 186 189 196 198 
187 192 
191 200 
195 
197 
199 

203 

205 



24 25 26 27 28 29 30 31 32 33 34 35 36 37 38 39 40 41 42 43 44 45 46 47 48 49 50 51 52 53 54 55 56 57 58 59 60 61 62 63 64 65 66 67 68 69 70 71 72 73 74 75 76 77 78 79 80 81 82 83 84 85 86 87 88 89 90 91 92 93 94 95 96 97 98 99 100 101 102 103 104 105 106 107 108 109 110 111 112 113 114 115 116 117 118 119 120 121 122 123 124 125 126 127 128 129 130 131 132 133 134 135 138 139 140 141 142 146 148 150 
17 18 19 20 21 22 23 136 137 143 144 145 147 149 151 152 154 156 204 
0 1 2 3 4 5 6 7 8 9 10 11 12 13 14 15 16 153 157 166 168 
155 158 160 161 162 163 165 174 
159 164 170 
167 173 175 181 201 207 
169 176 179 
172 
177 178 182 183 188 190 193 194 202 
171 180 184 185 186 187 189 196 198 
191 192 
195 
200 

197 199 






24 25 26 27 28 29 30 31 32 33 34 35 36 37 38 39 40 41 42 43 44 45 46 47 48 49 50 51 52 53 54 55 56 57 58 59 60 61 62 63 64 65 66 67 68 69 70 71 72 73 74 75 76 77 78 79 80 81 82 83 84 85 86 87 88 89 90 91 92 93 94 95 96 97 98 99 100 101 102 103 104 105 106 107 108 109 110 111 112 113 114 115 116 117 118 119 120 121 122 123 124 125 126 127 128 129 130 131 132 133 134 135 138 139 140 141 142 146 148 150 
17 18 19 20 21 22 23 136 137 143 144 145 147 149 151 152 154 156 
0 1 2 3 4 5 6 7 8 9 10 11 12 13 14 15 16 153 157 166 168 
155 158 160 161 162 163 165 174 
159 164 170 205 
167 173 181 204 
169 175 176 179 203 
172 
177 183 188 190 194 201 
178 182 186 187 193 198 
171 180 184 185 189 196 
191 192 
195 
206 
200 
199 
197 
202 



24 25 26 27 28 29 30 31 32 33 34 35 36 37 38 39 40 41 42 43 44 45 46 47 48 49 50 51 52 53 54 55 56 57 58 59 60 61 62 63 64 65 66 67 68 69 70 71 72 73 74 75 76 77 78 79 80 81 82 83 84 85 86 87 88 89 90 91 92 93 94 95 96 97 98 99 100 101 102 103 104 105 106 107 108 109 110 111 112 113 114 115 116 117 118 119 120 121 122 123 124 125 126 127 128 129 130 131 132 133 134 135 138 139 140 141 142 146 148 150 
17 18 19 20 21 22 23 136 137 143 144 145 147 149 151 152 154 156 
0 1 2 3 4 5 6 7 8 9 10 11 12 13 14 15 16 153 157 166 168 
155 158 160 161 162 163 165 174 
159 164 170 
167 173 181 
169 176 179 
172 175 204 
188 194 
177 178 183 186 190 
180 182 184 187 193 196 198 
171 185 189 201 
191 192 205 

195 203 

200 
199 
197 
202 

24 25 26 27 28 29 30 31 32 33 34 35 36 37 38 39 40 41 42 43 44 45 46 47 48 49 50 51 52 53 54 55 56 57 58 59 60 61 62 63 64 65 66 67 68 69 70 71 72 73 74 75 76 77 78 79 80 81 82 83 84 85 86 87 88 89 90 91 92 93 94 95 96 97 98 99 100 101 102 103 104 105 106 107 108 109 110 111 112 113 114 115 116 117 118 119 120 121 122 123 124 125 126 127 128 129 130 131 132 133 134 135 138 139 140 141 142 146 148 150 
17 18 19 20 21 22 23 136 137 143 144 145 147 149 151 152 156 
0 1 2 3 4 5 6 7 8 9 10 11 12 13 14 15 16 153 154 157 168 206 
155 158 160 161 162 163 165 166 174 
159 164 170 
173 181 
167 169 176 179 
172 175 
188 194 
183 204 207 
177 178 180 186 190 
182 184 187 193 196 198 
171 185 189 191 
192 

201 
195 
200 
199 

197 
24 25 26 27 28 29 30 31 32 33 34 35 36 37 38 39 40 41 42 43 44 45 46 47 48 49 50 51 52 53 54 55 56 57 58 59 60 61 62 63 64 65 66 67 68 69 70 71 72 73 74 75 76 77 78 79 80 81 82 83 84 85 86 87 88 89 90 91 92 93 94 95 96 97 98 99 100 101 102 103 104 105 106 107 108 109 110 111 112 113 114 115 116 117 118 119 120 121 122 123 124 125 126 127 128 129 130 131 132 133 134 135 138 139 140 141 142 146 148 150 
17 18 19 20 21 22 23 136 137 143 144 145 147 149 151 152 156 205 
0 1 2 3 4 5 6 7 8 9 10 11 12 13 14 15 16 153 154 157 168 
155 158 160 161 163 165 166 174 202 
159 162 164 170 
173 206 
167 169 176 179 181 
172 175 
188 
183 194 
178 
177 180 186 187 190 204 
182 184 191 193 196 198 
171 185 189 
192 207 

195 


199 200 
201 
24 25 26 27 28 29 30 31 32 33 34 35 36 37 38 39 40 41 42 43 44 45 46 47 48 49 50 51 52 53 54 55 56 57 58 59 60 61 62 63 64 65 66 67 68 69 70 71 72 73 74 75 76 77 78 79 80 81 82 83 84 85 86 87 88 89 90 91 92 93 94 95 96 97 98 99 100 101 102 103 104 105 106 107 108 109 110 111 112 113 114 115 116 117 118 119 120 121 122 123 124 125 126 127 128 129 130 131 132 133 134 135 138 139 140 141 142 146 148 150 
17 18 19 20 21 22 23 136 137 143 144 145 147 149 151 152 156 197 
0 1 2 3 4 5 6 7 8 9 10 11 12 13 14 15 16 153 154 157 168 
155 160 161 163 165 166 174 
158 159 162 164 170 202 203 
173 
167 169 176 179 181 205 
172 175 206 

183 188 194 
178 
177 186 187 
180 190 191 
182 184 193 196 198 
171 185 189 204 
192 

195 



24 25 26 27 28 29 30 31 32 33 34 35 36 37 38 39 40 41 42 43 44 45 46 47 48 49 50 51 52 53 54 55 56 57 58 59 60 61 62 63 64 65 66 67 68 69 70 71 72 73 74 75 76 77 78 79 80 81 82 83 84 85 86 87 88 89 90 91 92 93 94 95 96 97 98 99 100 101 102 103 104 105 106 107 108 109 110 111 112 113 114 115 116 117 118 119 120 121 122 123 124 125 126 127 128 129 130 131 132 133 134 135 138 139 140 141 142 146 148 150 199 200 201 
17 18 19 20 21 22 23 136 137 143 144 145 147 149 151 152 156 
0 1 2 3 4 5 6 7 8 9 10 11 12 13 14 15 16 153 154 157 168 197 
155 160 161 163 165 166 174 
158 159 162 164 170 
173 202 
167 169 176 179 
172 175 181 

183 203 206 
178 188 194 207 
205 
177 186 187 
180 190 191 
182 184 193 196 198 
171 185 189 
192 
204 

195 

24 25 26 27 28 29 30 31 32 33 34 35 36 37 38 39 40 41 42 43 44 45 46 47 48 49 50 51 52 53 54 55 56 57 58 59 60 61 62 63 64 65 66 67 68 69 70 71 72 73 74 75 76 77 78 79 80 81 82 83 84 85 86 87 88 89 90 91 92 93 94 95 96 97 98 99 100 101 102 103 104 105 106 107 108 109 110 111 112 113 114 115 116 117 118 119 120 121 122 123 124 125 126 127 128 129 130 131 132 133 134 135 138 139 140 141 142 146 148 150 
17 18 19 20 21 22 23 136 137 143 144 145 147 149 151 152 156 
0 1 2 3 4 5 6 7 8 9 10 11 12 13 14 15 16 153 154 157 168 199 201 
155 160 161 163 165 200 
158 159 162 164 166 170 174 197 
173 
167 169 176 179 202 
172 175 
181 

178 183 188 
194 

177 180 186 187 
191 196 
182 184 190 193 198 
185 189 
171 192 
204 
205 206 

24 25 26 27 28 29 30 31 32 33 34 35 36 37 38 39 40 41 42 43 44 45 46 47 48 49 50 51 52 53 54 55 56 57 58 59 60 61 62 63 64 65 66 67 68 69 70 71 72 73 74 75 76 77 78 79 80 81 82 83 84 85 86 87 88 89 90 91 92 93 94 95 96 97 98 99 100 101 102 103 104 105 106 107 108 109 110 111 112 113 114 115 116 117 118 119 120 121 122 123 124 125 126 127 128 129 130 131 132 133 134 135 138 139 140 141 142 146 148 150 
17 18 19 20 21 22 23 136 137 143 144 145 147 149 151 152 156 195 
0 1 2 3 4 5 6 7 8 9 10 11 12 13 14 15 16 153 154 157 168 
155 160 161 163 165 
158 159 162 164 166 170 174 199 200 
173 201 
167 169 176 179 197 
172 175 
181 

188 202 
178 183 
194 

177 180 186 187 
191 196 
182 184 193 
185 189 190 198 203 
192 
171 
204 
24 25 26 27 28 29 30 31 32 33 34 35 36 37 38 39 41 42 43 44 45 46 47 48 49 50 51 52 53 54 55 56 57 58 59 60 61 62 63 64 65 66 67 68 69 70 71 72 73 74 75 76 77 78 79 80 81 82 83 84 85 86 87 88 89 90 91 92 93 94 95 96 97 98 99 100 101 102 103 104 105 106 107 108 109 110 111 112 113 114 115 116 117 118 119 120 121 123 124 125 127 128 129 131 132 133 135 139 140 141 148 
17 19 20 21 23 136 137 143 144 145 147 149 151 152 156 
1 3 5 7 9 13 153 
