0: 0xc28c0000 0x437a0000 0x41200000 0x40000000 0x40000000 0x41700000 0x0 0x40000000 0x41400000 0x44fa0000
1: 0xc28c0000 0x437a0000 0x41200000 0x40000000 0x40000000 0x41700000 0x0 0x40000000 0x4141999a 0x44fa0000
2: 0xc28c0000 0x437a0000 0x41200000 0x40000000 0x40000000 0x41700000 0x0 0x40000000 0x41433333 0x44fa0000
3: 0xc28c0000 0x437a0000 0x41200000 0x40000000 0x40000000 0x41700000 0x0 0x40000000 0x4144cccd 0x44fa0000
4: 0xc28c0000 0x437a0000 0x41200000 0x40000000 0x40000000 0x41700000 0x0 0x40000000 0x41466666 0x44fa0000
5: 0xc28c0000 0x437a0000 0x41200000 0x40000000 0x40000000 0x41700000 0x0 0x40000000 0x41480000 0x44fa0000
6: 0xc28c0000 0x437a0000 0x41200000 0x40000000 0x40000000 0x41700000 0x0 0x40000000 0x4149999a 0x44fa0000
7: 0xc28c0000 0x437a0000 0x41200000 0x40000000 0x40000000 0x41700000 0x0 0x40000000 0x414b3333 0x44fa0000
8: 0xc28c0000 0x437a0000 0x41200000 0x40000000 0x40000000 0x41700000 0x0 0x40000000 0x414ccccd 0x44fa0000
9: 0xc28c0000 0x437a0000 0x41200000 0x40000000 0x40000000 0x41700000 0x0 0x40000000 0x414e6666 0x44fa0000
10: 0xc28c0000 0x437a0000 0x41200000 0x40000000 0x40000000 0x41700000 0x0 0x40000000 0x41500000 0x44fa0000
11: 0xc28c0000 0x437a0000 0x41200000 0x40000000 0x40000000 0x41700000 0x0 0x40000000 0x4151999a 0x44fa0000
12: 0xc28c0000 0x437a0000 0x41200000 0x40000000 0x40000000 0x41700000 0x0 0x40000000 0x41533333 0x44fa0000
13: 0xc28c0000 0x437a0000 0x41200000 0x40000000 0x40000000 0x41700000 0x0 0x40000000 0x4154cccd 0x44fa0000
14: 0xc28c0000 0x437a0000 0x41200000 0x40000000 0x40000000 0x41700000 0x0 0x40000000 0x41566666 0x44fa0000
15: 0xc28c0000 0x437a0000 0x41200000 0x40000000 0x40000000 0x41700000 0x0 0x40000000 0x41580000 0x44fa0000
16: 0xc28c0000 0x437a0000 0x41200000 0x40000000 0x40000000 0x41700000 0x0 0x40000000 0x4159999a 0x44fa0000
17: 0xc28c0000 0x437a0000 0x41200000 0x40000000 0x40000000 0x41700000 0x0 0x40000000 0x415b3333 0x44fa0000
18: 0xc28c0000 0x437a0000 0x41200000 0x40000000 0x40000000 0x41700000 0x0 0x40000000 0x415ccccd 0x44fa0000
19: 0xc28c0000 0x437a0000 0x41200000 0x40000000 0x40000000 0x41700000 0x0 0x40000000 0x415e6666 0x44fa0000
20: 0xc28c0000 0x437a0000 0x41200000 0x40000000 0x40000000 0x41700000 0x0 0x40000000 0x41600000 0x44fa0000
21: 0xc28c0000 0x437a0000 0x41200000 0x40000000 0x40000000 0x41700000 0x0 0x40000000 0x4161999a 0x44fa0000
22: 0xc28c0000 0x437a0000 0x41200000 0x40000000 0x40000000 0x41700000 0x0 0x40000000 0x41633333 0x44fa0000
23: 0xc28c0000 0x437a0000 0x41200000 0x40000000 0x40000000 0x41700000 0x0 0x40000000 0x4164cccd 0x44fa0000
24: 0xc28c0000 0x437a0000 0x41200000 0x40000000 0x40000000 0x41700000 0x0 0x40000000 0x41666666 0x44fa0000
25: 0xc28c0000 0x437a0000 0x41200000 0x40000000 0x40000000 0x41700000 0x0 0x40000000 0x41680000 0x44fa0000
26: 0xc28c0000 0x437a0000 0x41200000 0x40000000 0x40000000 0x41700000 0x0 0x40000000 0x4169999a 0x44fa0000
27: 0xc28c0000 0x437a0000 0x41200000 0x40000000 0x40000000 0x41700000 0x0 0x40000000 0x416b3333 0x44fa0000
28: 0xc28c0000 0x437a0000 0x41200000 0x40000000 0x40000000 0x41700000 0x0 0x40000000 0x416ccccd 0x44fa0000
29: 0xc28c0000 0x437a0000 0x41200000 0x40000000 0x40000000 0x41700000 0x0 0x40000000 0x416e6666 0x44fa0000
30: 0xc28c0000 0x437a0000 0x41200000 0x40000000 0x40000000 0x41700000 0x0 0x40000000 0x41700000 0x44fa0000
31: 0xc28c0000 0x437a0000 0x41200000 0x40000000 0x40000000 0x41700000 0x0 0x40000000 0x4171999a 0x44fa0000
32: 0xc28c0000 0x437a0000 0x41200000 0x40000000 0x40000000 0x41700000 0x0 0x40000000 0x41733333 0x44fa0000
33: 0xc28c0000 0x437a0000 0x41200000 0x40000000 0x40000000 0x41700000 0x0 0x40000000 0x4174cccd 0x44fa0000
34: 0xc28c0000 0x437a0000 0x41200000 0x40000000 0x40000000 0x41700000 0x0 0x40000000 0x41766666 0x44fa0000
35: 0xc28c0000 0x437a0000 0x41200000 0x40000000 0x40000000 0x41700000 0x0 0x40000000 0x41780000 0x44fa0000
36: 0xc28c0000 0x437a0000 0x41200000 0x40000000 0x40000000 0x41700000 0x0 0x40000000 0x4179999a 0x44fa0000
37: 0xc28c0000 0x437a0000 0x41200000 0x40000000 0x40000000 0x41700000 0x0 0x40000000 0x417b3333 0x44fa0000
38: 0xc28c0000 0x437a0000 0x41200000 0x40000000 0x40000000 0x41700000 0x0 0x40000000 0x417ccccd 0x44fa0000
39: 0xc28c0000 0x437a0000 0x41200000 0x40000000 0x40000000 0x41700000 0x0 0x40000000 0x417e6666 0x44fa0000
40: 0xc28c0000 0x437a0000 0x41200000 0x40000000 0x40000000 0x41700000 0x0 0x40000000 0x41800000 0x44fa0000
41: 0xc28c0000 0x437a0000 0x41200000 0x40000000 0x40000000 0x41700000 0x0 0x40000000 0x4180cccd 0x44fa0000
42: 0xc28c0000 0x437a0000 0x41200000 0x40000000 0x40000000 0x41700000 0x0 0x40000000 0x4181999a 0x44fa0000
43: 0xc28c0000 0x437a0000 0x41200000 0x40000000 0x40000000 0x41700000 0x0 0x40000000 0x41826666 0x44fa0000
44: 0xc28c0000 0x437a0000 0x41200000 0x40000000 0x40000000 0x41700000 0x0 0x40000000 0x41833333 0x44fa0000
45: 0xc28c0000 0x437a0000 0x41200000 0x40000000 0x40000000 0x41700000 0x0 0x40000000 0x41840000 0x44fa0000
46: 0xc28c0000 0x437a0000 0x41200000 0x40000000 0x40000000 0x41700000 0x0 0x40000000 0x4184cccd 0x44fa0000
47: 0xc28c0000 0x437a0000 0x41200000 0x40000000 0x40000000 0x41700000 0x0 0x40000000 0x4185999a 0x44fa0000
48: 0xc28c0000 0x437a0000 0x41200000 0x40000000 0x40000000 0x41700000 0x0 0x40000000 0x41866666 0x44fa0000
49: 0xc28c0000 0x437a0000 0x41200000 0x40000000 0x40000000 0x41700000 0x0 0x40000000 0x41873333 0x44fa0000
50: 0xc28c0000 0x437a0000 0x41200000 0x40000000 0x40000000 0x41700000 0x0 0x40000000 0x41880000 0x44fa0000
51: 0xc28c0000 0x437a0000 0x41200000 0x40000000 0x40000000 0x41700000 0x0 0x40000000 0x4188cccd 0x44fa0000
52: 0xc28c0000 0x437a0000 0x41200000 0x40000000 0x40000000 0x41700000 0x0 0x40000000 0x4189999a 0x44fa0000
53: 0xc28c0000 0x437a0000 0x41200000 0x40000000 0x40000000 0x41700000 0x0 0x40000000 0x418a6666 0x44fa0000
54: 0xc28c0000 0x437a0000 0x41200000 0x40000000 0x40000000 0x41700000 0x0 0x40000000 0x418b3333 0x44fa0000
55: 0xc28c0000 0x437a0000 0x41200000 0x40000000 0x40000000 0x41700000 0x0 0x40000000 0x418c0000 0x44fa0000
56: 0xc28c0000 0x437a0000 0x41200000 0x40000000 0x40000000 0x41700000 0x0 0x40000000 0x418ccccd 0x44fa0000
57: 0xc28c0000 0x437a0000 0x41200000 0x40000000 0x40000000 0x41700000 0x0 0x40000000 0x418d999a 0x44fa0000
58: 0xc28c0000 0x437a0000 0x41200000 0x40000000 0x40000000 0x41700000 0x0 0x40000000 0x418e6666 0x44fa0000
59: 0xc28c0000 0x437a0000 0x41200000 0x40000000 0x40000000 0x41700000 0x0 0x40000000 0x418f3333 0x44fa0000
60: 0xc28c0000 0x437a0000 0x41200000 0x40000000 0x40000000 0x41700000 0x0 0x40000000 0x41900000 0x44fa0000
61: 0xc28c0000 0x437a0000 0x41200000 0x40000000 0x40000000 0x41700000 0x0 0x40000000 0x4190cccd 0x44fa0000
62: 0xc28c0000 0x437a0000 0x41200000 0x40000000 0x40000000 0x41700000 0x0 0x40000000 0x4191999a 0x44fa0000
63: 0xc28c0000 0x437a0000 0x41200000 0x40000000 0x40000000 0x41700000 0x0 0x40000000 0x41926666 0x44fa0000
64: 0xc28c0000 0x437a0000 0x41200000 0x40000000 0x40000000 0x41700000 0x0 0x40000000 0x41933333 0x44fa0000
65: 0xc28c0000 0x437a0000 0x41200000 0x40000000 0x40000000 0x41700000 0x0 0x40000000 0x41940000 0x44fa0000
66: 0xc28c0000 0x437a0000 0x41200000 0x40000000 0x40000000 0x41700000 0x0 0x40000000 0x4194cccd 0x44fa0000
67: 0xc28c0000 0x437a0000 0x41200000 0x40000000 0x40000000 0x41700000 0x0 0x40000000 0x4195999a 0x44fa0000
68: 0xc28c0000 0x437a0000 0x41200000 0x40000000 0x40000000 0x41700000 0x0 0x40000000 0x41966666 0x44fa0000
69: 0xc28c0000 0x437a0000 0x41200000 0x40000000 0x40000000 0x41700000 0x0 0x40000000 0x41973333 0x44fa0000
70: 0xc28c0000 0x437a0000 0x41200000 0x40000000 0x40000000 0x41700000 0x0 0x40000000 0x41980000 0x44fa0000
71: 0xc28c0000 0x437a0000 0x41200000 0x40000000 0x40000000 0x41700000 0x0 0x40000000 0x4198cccd 0x44fa0000
72: 0xc28c0000 0x437a0000 0x41200000 0x40000000 0x40000000 0x41700000 0x0 0x40000000 0x4199999a 0x44fa0000
73: 0xc28c0000 0x437a0000 0x41200000 0x40000000 0x40000000 0x41700000 0x0 0x40000000 0x419a6666 0x44fa0000
74: 0xc28c0000 0x437a0000 0x41200000 0x40000000 0x40000000 0x41700000 0x0 0x40000000 0x419b3333 0x44fa0000
75: 0xc28c0000 0x437a0000 0x41200000 0x40000000 0x40000000 0x41700000 0x0 0x40000000 0x419c0000 0x44fa0000
76: 0xc28c0000 0x437a0000 0x41200000 0x40000000 0x40000000 0x41700000 0x0 0x40000000 0x419ccccd 0x44fa0000
77: 0xc28c0000 0x437a0000 0x41200000 0x40000000 0x40000000 0x41700000 0x0 0x40000000 0x419d999a 0x44fa0000
78: 0xc28c0000 0x437a0000 0x41200000 0x40000000 0x40000000 0x41700000 0x0 0x40000000 0x419e6666 0x44fa0000
79: 0xc28c0000 0x437a0000 0x41200000 0x40000000 0x40000000 0x41700000 0x0 0x40000000 0x419f3333 0x44fa0000
80: 0xc28c0000 0x437a0000 0x41200000 0x40000000 0x40000000 0x41700000 0x0 0x40000000 0x41a00000 0x44fa0000
81: 0xc28c0000 0x437a0000 0x41200000 0x40000000 0x40000000 0x41700000 0x0 0x40000000 0x41a0cccd 0x44fa0000
82: 0xc28c0000 0x437a0000 0x41200000 0x40000000 0x40000000 0x41700000 0x0 0x40000000 0x41a1999a 0x44fa0000
83: 0xc28c0000 0x437a0000 0x41200000 0x40000000 0x40000000 0x41700000 0x0 0x40000000 0x41a26666 0x44fa0000
84: 0xc28c0000 0x437a0000 0x41200000 0x40000000 0x40000000 0x41700000 0x0 0x40000000 0x41a33333 0x44fa0000
85: 0xc28c0000 0x437a0000 0x41200000 0x40000000 0x40000000 0x41700000 0x0 0x40000000 0x41a40000 0x44fa0000
86: 0xc28c0000 0x437a0000 0x41200000 0x40000000 0x40000000 0x41700000 0x0 0x40000000 0x41a4cccd 0x44fa0000
87: 0xc28c0000 0x437a0000 0x41200000 0x40000000 0x40000000 0x41700000 0x0 0x40000000 0x41a5999a 0x44fa0000
88: 0xc28c0000 0x437a0000 0x41200000 0x40000000 0x40000000 0x41700000 0x0 0x40000000 0x41a66666 0x44fa0000
89: 0xc28c0000 0x437a0000 0x41200000 0x40000000 0x40000000 0x41700000 0x0 0x40000000 0x41a73333 0x44fa0000
90: 0xc28c0000 0x437a0000 0x41200000 0x40000000 0x40000000 0x41700000 0x0 0x40000000 0x41a80000 0x44fa0000
91: 0xc28c0000 0x437a0000 0x41200000 0x40000000 0x40000000 0x41700000 0x0 0x40000000 0x41a8cccd 0x44fa0000
92: 0xc28c0000 0x437a0000 0x41200000 0x40000000 0x40000000 0x41700000 0x0 0x40000000 0x41a9999a 0x44fa0000
93: 0xc28c0000 0x437a0000 0x41200000 0x40000000 0x40000000 0x41700000 0x0 0x40000000 0x41aa6666 0x44fa0000
94: 0xc28c0000 0x437a0000 0x41200000 0x40000000 0x40000000 0x41700000 0x0 0x40000000 0x41ab3333 0x44fa0000
95: 0xc28c0000 0x437a0000 0x41200000 0x40000000 0x40000000 0x41700000 0x0 0x40000000 0x41ac0000 0x44fa0000
96: 0xc28c0000 0x437a0000 0x41200000 0x40000000 0x40000000 0x41700000 0x0 0x40000000 0x41accccd 0x44fa0000
97: 0xc28c0000 0x437a0000 0x41200000 0x40000000 0x40000000 0x41700000 0x0 0x40000000 0x41ad999a 0x44fa0000
98: 0xc28c0000 0x437a0000 0x41200000 0x40000000 0x40000000 0x41700000 0x0 0x40000000 0x41ae6666 0x44fa0000
99: 0xc28c0000 0x437a0000 0x41200000 0x40000000 0x40000000 0x41700000 0x0 0x40000000 0x41af3333 0x44fa0000
100: 0xc28c0000 0x437a0000 0x41200000 0x40000000 0x40000000 0x41700000 0x0 0x40000000 0x41b00000 0x44fa0000
101: 0xc28c0000 0x437a0000 0x41200000 0x40000000 0x40000000 0x41700000 0x0 0x40000000 0x41b0cccd 0x44fa0000
102: 0xc28c0000 0x437a0000 0x41200000 0x40000000 0x40000000 0x41700000 0x0 0x40000000 0x41b1999a 0x44fa0000
103: 0xc28c0000 0x437a0000 0x41200000 0x40000000 0x40000000 0x41700000 0x0 0x40000000 0x41b26666 0x44fa0000
104: 0xc28c0000 0x437a0000 0x41200000 0x40000000 0x40000000 0x41700000 0x0 0x40000000 0x41b33333 0x44fa0000
105: 0xc28c0000 0x437a0000 0x41200000 0x40000000 0x40000000 0x41700000 0x0 0x40000000 0x41b40000 0x44fa0000
106: 0xc28c0000 0x437a0000 0x41200000 0x40000000 0x40000000 0x41700000 0x0 0x40000000 0x41b4cccd 0x44fa0000
107: 0xc28c0000 0x437a0000 0x41200000 0x40000000 0x40000000 0x41700000 0x0 0x40000000 0x41b5999a 0x44fa0000
108: 0xc28c0000 0x437a0000 0x41200000 0x40000000 0x40000000 0x41700000 0x0 0x40000000 0x41b66666 0x44fa0000
109: 0xc28c0000 0x437a0000 0x41200000 0x40000000 0x40000000 0x41700000 0x0 0x40000000 0x41b73333 0x44fa0000
110: 0xc28c0000 0x437a0000 0x41200000 0x40000000 0x40000000 0x41700000 0x0 0x40000000 0x41b80000 0x44fa0000
111: 0xc28c0000 0x437a0000 0x41200000 0x40000000 0x40000000 0x41700000 0x0 0x40000000 0x41b8cccd 0x44fa0000
112: 0xc28c0000 0x437a0000 0x41200000 0x40000000 0x40000000 0x41700000 0x0 0x40000000 0x41b9999a 0x44fa0000
113: 0xc28c0000 0x437a0000 0x41200000 0x40000000 0x40000000 0x41700000 0x0 0x40000000 0x41ba6666 0x44fa0000
114: 0xc28c0000 0x437a0000 0x41200000 0x40000000 0x40000000 0x41700000 0x0 0x40000000 0x41bb3333 0x44fa0000
115: 0xc28c0000 0x437a0000 0x41200000 0x40000000 0x40000000 0x41700000 0x0 0x40000000 0x41bc0000 0x44fa0000
116: 0xc28c0000 0x437a0000 0x41200000 0x40000000 0x40000000 0x41700000 0x0 0x40000000 0x41bccccd 0x44fa0000
117: 0xc28c0000 0x437a0000 0x41200000 0x40000000 0x40000000 0x41700000 0x0 0x40000000 0x41bd999a 0x44fa0000
118: 0xc28c0000 0x437a0000 0x41200000 0x40000000 0x40000000 0x41700000 0x0 0x40000000 0x41be6666 0x44fa0000
119: 0xc28c0000 0x437a0000 0x41200000 0x40000000 0x40000000 0x41700000 0x0 0x40000000 0x41bf3333 0x44fa0000
120: 0xc28c0000 0x437a0000 0x41200000 0x40000000 0x40000000 0x41700000 0x0 0x40000000 0x41c00000 0x44fa0000
121: 0xc28c0000 0x437a0000 0x41200000 0x40000000 0x40000000 0x41700000 0x0 0x40000000 0x41c0cccd 0x44fa0000
122: 0xc28c0000 0x437a0000 0x41200000 0x40000000 0x40000000 0x41700000 0x0 0x40000000 0x41c1999a 0x44fa0000
123: 0xc28c0000 0x437a0000 0x41200000 0x40000000 0x40000000 0x41700000 0x0 0x40000000 0x41c26666 0x44fa0000
124: 0xc28c0000 0x437a0000 0x41200000 0x40000000 0x40000000 0x41700000 0x0 0x40000000 0x41c33333 0x44fa0000
125: 0xc28c0000 0x437a0000 0x41200000 0x40000000 0x40000000 0x41700000 0x0 0x40000000 0x41c40000 0x44fa0000
126: 0xc28c0000 0x437a0000 0x41200000 0x40000000 0x40000000 0x41700000 0x0 0x40000000 0x41c4cccd 0x44fa0000
127: 0xc28c0000 0x437a0000 0x41200000 0x40000000 0x40000000 0x41700000 0x0 0x40000000 0x41c5999a 0x44fa0000
128: 0xc28c0000 0x437a0000 0x41200000 0x40000000 0x40000000 0x41700000 0x0 0x40000000 0x41c66666 0x44fa0000
129: 0xc28c0000 0x437a0000 0x41200000 0x40000000 0x40000000 0x41700000 0x0 0x40000000 0x41c73333 0x44fa0000
130: 0xc28c0000 0x437a0000 0x41200000 0x40000000 0x40000000 0x41700000 0x0 0x40000000 0x41c80000 0x44fa0000
131: 0xc28c0000 0x437a0000 0x41200000 0x40000000 0x40000000 0x41700000 0x0 0x40000000 0x41c8cccd 0x44fa0000
132: 0xc28c0000 0x437a0000 0x41200000 0x40000000 0x40000000 0x41700000 0x0 0x40000000 0x41c9999a 0x44fa0000
133: 0xc28c0000 0x437a0000 0x41200000 0x40000000 0x40000000 0x41700000 0x0 0x40000000 0x41ca6666 0x44fa0000
134: 0xc28c0000 0x437a0000 0x41200000 0x40000000 0x40000000 0x41700000 0x0 0x40000000 0x41cb3333 0x44fa0000
135: 0xc28c0000 0x437a0000 0x41200000 0x40000000 0x40000000 0x41700000 0x0 0x40000000 0x41cc0000 0x44fa0000
136: 0xc28c0000 0x437a0000 0x41200000 0x40000000 0x40000000 0x41700000 0x0 0x40000000 0x41cccccd 0x44fa0000
137: 0xc28c0000 0x437a0000 0x41200000 0x40000000 0x40000000 0x41700000 0x0 0x40000000 0x41cd999a 0x44fa0000
138: 0xc28c0000 0x437a0000 0x41200000 0x40000000 0x40000000 0x41700000 0x0 0x40000000 0x41ce6666 0x44fa0000
139: 0xc28c0000 0x437a0000 0x41200000 0x40000000 0x40000000 0x41700000 0x0 0x40000000 0x41cf3333 0x44fa0000
140: 0xc28c0000 0x437a0000 0x41200000 0x40000000 0x40000000 0x41700000 0x0 0x40000000 0x41d00000 0x44fa0000
141: 0xc28c0000 0x437a0000 0x41200000 0x40000000 0x40000000 0x41700000 0x0 0x40000000 0x41d0cccd 0x44fa0000
142: 0xc28c0000 0x437a0000 0x41200000 0x40000000 0x40000000 0x41700000 0x0 0x40000000 0x41d1999a 0x44fa0000
143: 0xc28c0000 0x437a0000 0x41200000 0x40000000 0x40000000 0x41700000 0x0 0x40000000 0x41d26666 0x44fa0000
144: 0xc28c0000 0x437a0000 0x41200000 0x40000000 0x40000000 0x41700000 0x0 0x40000000 0x41d33333 0x44fa0000
145: 0xc28c0000 0x437a0000 0x41200000 0x40000000 0x40000000 0x41700000 0x0 0x40000000 0x41d40000 0x44fa0000
146: 0xc28c0000 0x437a0000 0x41200000 0x40000000 0x40000000 0x41700000 0x0 0x40000000 0x41d4cccd 0x44fa0000
147: 0xc28c0000 0x437a0000 0x41200000 0x40000000 0x40000000 0x41700000 0x0 0x40000000 0x41d5999a 0x44fa0000
148: 0xc28c0000 0x437a0000 0x41200000 0x40000000 0x40000000 0x41700000 0x0 0x40000000 0x41d66666 0x44fa0000
149: 0xc28c0000 0x437a0000 0x41200000 0x40000000 0x40000000 0x41700000 0x0 0x40000000 0x41d73333 0x44fa0000
150: 0xc28c0000 0x437a0000 0x41200000 0x40000000 0x40000000 0x41700000 0x0 0x40000000 0x41d80000 0x44fa0000
151: 0xc28c0000 0x437a0000 0x41200000 0x40000000 0x40000000 0x41700000 0x0 0x40000000 0x41d8cccd 0x44fa0000
152: 0xc28c0000 0x437a0000 0x41200000 0x40000000 0x40000000 0x41700000 0x0 0x40000000 0x41d9999a 0x44fa0000
153: 0xc28c0000 0x437a0000 0x41200000 0x40000000 0x40000000 0x41700000 0x0 0x40000000 0x41da6666 0x44fa0000
154: 0xc28c0000 0x437a0000 0x41200000 0x40000000 0x40000000 0x41700000 0x0 0x40000000 0x41db3333 0x44fa0000
155: 0xc28c0000 0x437a0000 0x41200000 0x40000000 0x40000000 0x41700000 0x0 0x40000000 0x41dc0000 0x44fa0000
156: 0xc28c0000 0x437a0000 0x41200000 0x40000000 0x40000000 0x41700000 0x0 0x40000000 0x41dccccd 0x44fa0000
157: 0xc28c0000 0x437a0000 0x41200000 0x40000000 0x40000000 0x41700000 0x0 0x40000000 0x41dd999a 0x44fa0000
158: 0xc28c0000 0x437a0000 0x41200000 0x40000000 0x40000000 0x41700000 0x0 0x40000000 0x41de6666 0x44fa0000
159: 0xc28c0000 0x437a0000 0x41200000 0x40000000 0x40000000 0x41700000 0x0 0x40000000 0x41df3333 0x44fa0000
160: 0xc28c0000 0x437a0000 0x41200000 0x40000000 0x40000000 0x41700000 0x0 0x40000000 0x41e00000 0x44fa0000
161: 0xc28c0000 0x437a0000 0x41200000 0x40000000 0x40000000 0x41700000 0x0 0x40000000 0x41e0cccd 0x44fa0000
162: 0xc28c0000 0x437a0000 0x41200000 0x40000000 0x40000000 0x41700000 0x0 0x40000000 0x41e1999a 0x44fa0000
163: 0xc28c0000 0x437a0000 0x41200000 0x40000000 0x40000000 0x41700000 0x0 0x40000000 0x41e26666 0x44fa0000
164: 0xc28c0000 0x437a0000 0x41200000 0x40000000 0x40000000 0x41700000 0x0 0x40000000 0x41e33333 0x44fa0000
165: 0xc28c0000 0x437a0000 0x41200000 0x40000000 0x40000000 0x41700000 0x0 0x40000000 0x41e40000 0x44fa0000
166: 0xc28c0000 0x437a0000 0x41200000 0x40000000 0x40000000 0x41700000 0x0 0x40000000 0x41e4cccd 0x44fa0000
167: 0xc28c0000 0x437a0000 0x41200000 0x40000000 0x40000000 0x41700000 0x0 0x40000000 0x41e5999a 0x44fa0000
168: 0xc28c0000 0x437a0000 0x41200000 0x40000000 0x40000000 0x41700000 0x0 0x40000000 0x41e66666 0x44fa0000
169: 0xc28c0000 0x437a0000 0x41200000 0x40000000 0x40000000 0x41700000 0x0 0x40000000 0x41e73333 0x44fa0000
170: 0xc28c0000 0x437a0000 0x41200000 0x40000000 0x40000000 0x41700000 0x0 0x40000000 0x41e80000 0x44fa0000
171: 0xc28c0000 0x437a0000 0x41200000 0x40000000 0x40000000 0x41700000 0x0 0x40000000 0x41e8cccd 0x44fa0000
172: 0xc28c0000 0x437a0000 0x41200000 0x40000000 0x40000000 0x41700000 0x0 0x40000000 0x41e9999a 0x44fa0000
173: 0xc28c0000 0x437a0000 0x41200000 0x40000000 0x40000000 0x41700000 0x0 0x40000000 0x41ea6666 0x44fa0000
174: 0xc28c0000 0x437a0000 0x41200000 0x40000000 0x40000000 0x41700000 0x0 0x40000000 0x41eb3333 0x44fa0000
175: 0xc28c0000 0x437a0000 0x41200000 0x40000000 0x40000000 0x41700000 0x0 0x40000000 0x41ec0000 0x44fa0000
176: 0xc28c0000 0x437a0000 0x41200000 0x40000000 0x40000000 0x41700000 0x0 0x40000000 0x41eccccd 0x44fa0000
177: 0xc28c0000 0x437a0000 0x41200000 0x40000000 0x40000000 0x41700000 0x0 0x40000000 0x41ed999a 0x44fa0000
178: 0xc28c0000 0x437a0000 0x41200000 0x40000000 0x40000000 0x41700000 0x0 0x40000000 0x41ee6666 0x44fa0000
179: 0xc28c0000 0x437a0000 0x41200000 0x40000000 0x40000000 0x41700000 0x0 0x40000000 0x41ef3333 0x44fa0000
180: 0xc28c0000 0x437a0000 0x41200000 0x40000000 0x40000000 0x41700000 0x0 0x40000000 0x41f00000 0x44fa0000
181: 0xc28c0000 0x437a0000 0x41200000 0x40000000 0x40000000 0x41700000 0x0 0x40000000 0x41f0cccd 0x44fa0000
182: 0xc28c0000 0x437a0000 0x41200000 0x40000000 0x40000000 0x41700000 0x0 0x40000000 0x41f1999a 0x44fa0000
183: 0xc28c0000 0x437a0000 0x41200000 0x40000000 0x40000000 0x41700000 0x0 0x40000000 0x41f26666 0x44fa0000
184: 0xc28c0000 0x437a0000 0x41200000 0x40000000 0x40000000 0x41700000 0x0 0x40000000 0x41f33333 0x44fa0000
185: 0xc28c0000 0x437a0000 0x41200000 0x40000000 0x40000000 0x41700000 0x0 0x40000000 0x41f40000 0x44fa0000
186: 0xc28c0000 0x437a0000 0x41200000 0x40000000 0x40000000 0x41700000 0x0 0x40000000 0x41f4cccd 0x44fa0000
187: 0xc28c0000 0x437a0000 0x41200000 0x40000000 0x40000000 0x41700000 0x0 0x40000000 0x41f5999a 0x44fa0000
188: 0xc28c0000 0x437a0000 0x41200000 0x40000000 0x40000000 0x41700000 0x0 0x40000000 0x41f66666 0x44fa0000
189: 0xc28c0000 0x437a0000 0x41200000 0x40000000 0x40000000 0x41700000 0x0 0x40000000 0x41f73333 0x44fa0000
190: 0xc28c0000 0x437a0000 0x41200000 0x40000000 0x40000000 0x41700000 0x0 0x40000000 0x41f80000 0x44fa0000
191: 0xc28c0000 0x437a0000 0x41200000 0x40000000 0x40000000 0x41700000 0x0 0x40000000 0x41f8cccd 0x44fa0000
192: 0xc28c0000 0x437a0000 0x41200000 0x40000000 0x40000000 0x41700000 0x0 0x40000000 0x41f9999a 0x44fa0000
193: 0xc28c0000 0x437a0000 0x41200000 0x40000000 0x40000000 0x41700000 0x0 0x40000000 0x41fa6666 0x44fa0000
194: 0xc28c0000 0x437a0000 0x41200000 0x40000000 0x40000000 0x41700000 0x0 0x40000000 0x41fb3333 0x44fa0000
195: 0xc28c0000 0x437a0000 0x41200000 0x40000000 0x40000000 0x41700000 0x0 0x40000000 0x41fc0000 0x44fa0000
196: 0xc28c0000 0x437a0000 0x41200000 0x40000000 0x40000000 0x41700000 0x0 0x40000000 0x41fccccd 0x44fa0000
197: 0xc28c0000 0x437a0000 0x41200000 0x40000000 0x40000000 0x41700000 0x0 0x40000000 0x41fd999a 0x44fa0000
198: 0xc28c0000 0x437a0000 0x41200000 0x40000000 0x40000000 0x41700000 0x0 0x40000000 0x41fe6666 0x44fa0000
199: 0xc28c0000 0x437a0000 0x41200000 0x40000000 0x40000000 0x41700000 0x0 0x40000000 0x41ff3333 0x44fa0000
200: 0xc28c0000 0x437a0000 0x41200000 0x40000000 0x40000000 0x41700000 0x0 0x40000000 0x42000000 0x44fa0000
201: 0xc28c0000 0x437a0000 0x41200000 0x40000000 0x40000000 0x41700000 0x0 0x40000000 0x42006666 0x44fa0000
202: 0xc28c0000 0x437a0000 0x41200000 0x40000000 0x40000000 0x41700000 0x0 0x40000000 0x4200cccd 0x44fa0000
203: 0xc28c0000 0x437a0000 0x41200000 0x40000000 0x40000000 0x41700000 0x0 0x40000000 0x42013333 0x44fa0000
204: 0xc28c0000 0x437a0000 0x41200000 0x40000000 0x40000000 0x41700000 0x0 0x40000000 0x4201999a 0x44fa0000
