{
    "assembly": {
        "uuid": "kpi-28dcede6-e9dd-43bd-9167-cb0db1eac3a5",
        "properties": {
            "label": "Fahrzeug 1",
            "assembly_method": "stick together like lego blocks",
            "mass [g]": 307.7499999999999,
            "price [Euro]": 28.03100000000002,
            "delivery [days]": 13
        },
        "layer": "kpi-SYSTEM",
        "components": [],
        "assemblies": [
            {
                "assembly": {
                    "uuid": "kpi-bc53ccd9-22e3-4c42-8c5c-91d5afca2239",
                    "properties": {
                        "label": "main chassis",
                        "assembly_method": "stick together like lego blocks"
                    },
                    "layer": "kpi-ASSEMBLY",
                    "components": [
                        {
                            "component": {
                                "uuid": "kpi-a5678271-7991-425b-9f96-e10b2ea2c84a",
                                "properties": {
                                    "label": "Brick long right",
                                    "item number": 3703,
                                    "item description": "Technic, Brick 1 x 16 with Holes",
                                    "category": "frame",
                                    "price [Euro]": 0.07,
                                    "mass [g]": 5.87,
                                    "delivery time [days]": 5,
                                    "data source": "https://www.bricklink.com/v2/catalog/catalogitem.page?P=3703#T=C",
                                    "dimension [studs]": "1 x 16 x 1",
                                    "color": "red"
                                },
                                "layer": "kpi-COMPONENT"
                            }
                        },
                        {
                            "component": {
                                "uuid": "kpi-d7dc9aa2-725c-427d-a310-758220da5629",
                                "properties": {
                                    "label": "Brick long left",
                                    "item number": 3703,
                                    "item description": "Technic, Brick 1 x 16 with Holes",
                                    "category": "frame",
                                    "price [Euro]": 0.07,
                                    "mass [g]": 5.87,
                                    "delivery time [days]": 5,
                                    "data source": "https://www.bricklink.com/v2/catalog/catalogitem.page?P=3703#T=C",
                                    "dimension [studs]": "1 x 16 x 1",
                                    "color": "red"
                                },
                                "layer": "kpi-COMPONENT"
                            }
                        },
                        {
                            "component": {
                                "uuid": "kpi-b8821b9a-9660-43e2-ae5e-48e87c84c709",
                                "properties": {
                                    "label": "Short Pin front right",
                                    "item number": 3673,
                                    "item description": "Technic, Pin without Friction Ridges",
                                    "category": "frame",
                                    "price [Euro]": 0.01,
                                    "mass [g]": 0.16,
                                    "delivery time [days]": 3,
                                    "data source": "https://www.bricklink.com/v2/catalog/catalogitem.page?P=3673&name=Technic,%20Pin%20without%20Friction%20Ridges&category=%5BTechnic,%20Pin%5D#T=S&O={%22iconly%22:0}",
                                    "dimension [studs]": 1,
                                    "color": "red"
                                },
                                "layer": "kpi-COMPONENT"
                            }
                        },
                        {
                            "component": {
                                "uuid": "kpi-1db0a213-878f-4b51-a2c1-d62006a7be71",
                                "properties": {
                                    "label": "Short Pin front left",
                                    "item number": 3673,
                                    "item description": "Technic, Pin without Friction Ridges",
                                    "category": "frame",
                                    "price [Euro]": 0.01,
                                    "mass [g]": 0.16,
                                    "delivery time [days]": 3,
                                    "data source": "https://www.bricklink.com/v2/catalog/catalogitem.page?P=3673&name=Technic,%20Pin%20without%20Friction%20Ridges&category=%5BTechnic,%20Pin%5D#T=S&O={%22iconly%22:0}",
                                    "dimension [studs]": 1,
                                    "color": "red"
                                },
                                "layer": "kpi-COMPONENT"
                            }
                        },
                        {
                            "component": {
                                "uuid": "kpi-4c2b7e65-6d58-4dde-9dd1-351101decc48",
                                "properties": {
                                    "label": "Short Pin back right",
                                    "item number": 3673,
                                    "item description": "Technic, Pin without Friction Ridges",
                                    "category": "frame",
                                    "price [Euro]": 0.01,
                                    "mass [g]": 0.16,
                                    "delivery time [days]": 3,
                                    "data source": "https://www.bricklink.com/v2/catalog/catalogitem.page?P=3673&name=Technic,%20Pin%20without%20Friction%20Ridges&category=%5BTechnic,%20Pin%5D#T=S&O={%22iconly%22:0}",
                                    "dimension [studs]": 1,
                                    "color": "red"
                                },
                                "layer": "kpi-COMPONENT"
                            }
                        },
                        {
                            "component": {
                                "uuid": "kpi-53bc28f9-b576-409c-9f2e-2a86fd064e16",
                                "properties": {
                                    "label": "Short Pin back left",
                                    "item number": 3673,
                                    "item description": "Technic, Pin without Friction Ridges",
                                    "category": "frame",
                                    "price [Euro]": 0.01,
                                    "mass [g]": 0.16,
                                    "delivery time [days]": 3,
                                    "data source": "https://www.bricklink.com/v2/catalog/catalogitem.page?P=3673&name=Technic,%20Pin%20without%20Friction%20Ridges&category=%5BTechnic,%20Pin%5D#T=S&O={%22iconly%22:0}",
                                    "dimension [studs]": 1,
                                    "color": "red"
                                },
                                "layer": "kpi-COMPONENT"
                            }
                        }
                    ],
                    "assemblies": [
                        {
                            "assembly": {
                                "uuid": "kpi-1f417bb6-9f72-4079-b727-0b3885d57214",
                                "properties": {
                                    "label": "chassis motor assembly",
                                    "assembly_method": "stick together like lego blocks"
                                },
                                "layer": "kpi-SUBASSEMBLY",
                                "components": [
                                    {
                                        "component": {
                                            "uuid": "kpi-4c796ac1-b632-45bd-806b-2fa8d49b362e",
                                            "properties": {
                                                "label": "Brick short right",
                                                "item number": 3702,
                                                "item description": "Technic, Brick 1 x 8 with Holes",
                                                "category": "frame",
                                                "price [Euro]": 0.01,
                                                "mass [g]": 2.85,
                                                "delivery time [days]": 5,
                                                "data source": "https://www.bricklink.com/v2/catalog/catalogitem.page?P=3702#T=C",
                                                "dimension [studs]": "1 x 8 x 1",
                                                "color": "red"
                                            },
                                            "layer": "kpi-COMPONENT"
                                        }
                                    },
                                    {
                                        "component": {
                                            "uuid": "kpi-c036debe-2783-44e4-94bd-e392c50bc5a9",
                                            "properties": {
                                                "label": "Brick short left",
                                                "item number": 3702,
                                                "item description": "Technic, Brick 1 x 8 with Holes",
                                                "category": "frame",
                                                "price [Euro]": 0.01,
                                                "mass [g]": 2.85,
                                                "delivery time [days]": 5,
                                                "data source": "https://www.bricklink.com/v2/catalog/catalogitem.page?P=3702#T=C",
                                                "dimension [studs]": "1 x 8 x 1",
                                                "color": "red"
                                            },
                                            "layer": "kpi-COMPONENT"
                                        }
                                    },
                                    {
                                        "component": {
                                            "uuid": "kpi-b83aa54c-714d-4884-8bb8-510ac784e33d",
                                            "properties": {
                                                "label": "Long Pin front right",
                                                "item number": 32054,
                                                "item description": "Technic, Pin 4L with Friction Ridges and Stop Bush",
                                                "category": "frame",
                                                "price [Euro]": 0.01,
                                                "mass [g]": 0.33,
                                                "delivery time [days]": 3,
                                                "data source": "https://www.bricklink.com/v2/catalog/catalogitem.page?P=32054&name=Technic,%20Pin%203L%20with%20Friction%20Ridges%20and%20Stop%20Bush&category=%5BTechnic,%20Pin%5D#T=S&O={%22iconly%22:0}",
                                                "dimension [studs]": 1,
                                                "color": "red"
                                            },
                                            "layer": "kpi-COMPONENT"
                                        }
                                    },
                                    {
                                        "component": {
                                            "uuid": "kpi-7f010b62-43ad-4af8-84a5-35d63f7e2f5c",
                                            "properties": {
                                                "label": "Long Pin front left",
                                                "item number": 32054,
                                                "item description": "Technic, Pin 4L with Friction Ridges and Stop Bush",
                                                "category": "frame",
                                                "price [Euro]": 0.01,
                                                "mass [g]": 0.33,
                                                "delivery time [days]": 3,
                                                "data source": "https://www.bricklink.com/v2/catalog/catalogitem.page?P=32054&name=Technic,%20Pin%203L%20with%20Friction%20Ridges%20and%20Stop%20Bush&category=%5BTechnic,%20Pin%5D#T=S&O={%22iconly%22:0}",
                                                "dimension [studs]": 1,
                                                "color": "red"
                                            },
                                            "layer": "kpi-COMPONENT"
                                        }
                                    },
                                    {
                                        "component": {
                                            "uuid": "kpi-ffb36c57-84bb-43a6-96b6-caef1071fa0e",
                                            "properties": {
                                                "label": "Long Pin back right",
                                                "item number": 32054,
                                                "item description": "Technic, Pin 4L with Friction Ridges and Stop Bush",
                                                "category": "frame",
                                                "price [Euro]": 0.01,
                                                "mass [g]": 0.33,
                                                "delivery time [days]": 3,
                                                "data source": "https://www.bricklink.com/v2/catalog/catalogitem.page?P=32054&name=Technic,%20Pin%203L%20with%20Friction%20Ridges%20and%20Stop%20Bush&category=%5BTechnic,%20Pin%5D#T=S&O={%22iconly%22:0}",
                                                "dimension [studs]": 1,
                                                "color": "red"
                                            },
                                            "layer": "kpi-COMPONENT"
                                        }
                                    },
                                    {
                                        "component": {
                                            "uuid": "kpi-27916a7a-40cc-454f-8816-61a11a23a5c0",
                                            "properties": {
                                                "label": "Long Pin back left",
                                                "item number": 32054,
                                                "item description": "Technic, Pin 4L with Friction Ridges and Stop Bush",
                                                "category": "frame",
                                                "price [Euro]": 0.01,
                                                "mass [g]": 0.33,
                                                "delivery time [days]": 3,
                                                "data source": "https://www.bricklink.com/v2/catalog/catalogitem.page?P=32054&name=Technic,%20Pin%203L%20with%20Friction%20Ridges%20and%20Stop%20Bush&category=%5BTechnic,%20Pin%5D#T=S&O={%22iconly%22:0}",
                                                "dimension [studs]": 1,
                                                "color": "red"
                                            },
                                            "layer": "kpi-COMPONENT"
                                        }
                                    }
                                ],
                                "assemblies": []
                            }
                        }
                    ]
                }
            },
            {
                "assembly": {
                    "uuid": "kpi-e8787a50-25ec-44ee-b128-1552055adc74",
                    "properties": {
                        "label": "power unit assembly",
                        "assembly_method": "stick together like lego blocks"
                    },
                    "layer": "kpi-ASSEMBLY",
                    "components": [
                        {
                            "component": {
                                "uuid": "kpi-6bf55212-7e5f-4ef7-9cb0-118f8114b033",
                                "properties": {
                                    "label": "large Motor",
                                    "item number": "88003-1",
                                    "item description": "Power Functions L-Motor",
                                    "category": "motor",
                                    "related items": "8881, 8878, 88000",
                                    "idle current [mA]": 120,
                                    "idle speed [rev per min]": 390,
                                    "locking torque [Ncm]": 18,
                                    "price [Euro]": 15,
                                    "mass [g]": 48.0,
                                    "delivery time [days]": 3,
                                    "data source": "https://www.bricklink.com/v2/catalog/catalogitem.page?S=88003-1&name=Power%20Functions%20L-Motor&category=%5BPower%20Functions%5D#T=S&O={%22iconly%22:0}",
                                    "compatible battery": "8881, 8878, 88000",
                                    "input voltage [V]": 9,
                                    "dimensions [cm]": "13 x 11 x 2.5"
                                },
                                "layer": "kpi-COMPONENT"
                            }
                        },
                        {
                            "component": {
                                "uuid": "kpi-2e45a86b-c43c-4af9-88c5-5d93802e1b35",
                                "properties": {
                                    "label": "Electric Power 9V",
                                    "item number": "8881-1",
                                    "item description": "Power Functions Battery Box",
                                    "category": "battery",
                                    "price [Euro]": 12,
                                    "mass [g]": 179.4,
                                    "delivery time [days]": 3,
                                    "data source": "https://www.bricklink.com/v2/catalog/catalogitem.page?S=8881-1#T=S&O={%22iconly%22:0}",
                                    "output voltage [V]": 9.0,
                                    "dimensions [cm]": "8,8 x 6,3 x 3,2"
                                },
                                "layer": "kpi-COMPONENT"
                            }
                        }
                    ],
                    "assemblies": [
                        {
                            "assembly": {
                                "uuid": "kpi-14b30e7e-a3af-470b-82b4-f54b03c214b8",
                                "properties": {
                                    "label": "gear assembly",
                                    "assembly_method": "stick together like lego blocks"
                                },
                                "layer": "kpi-SUBASSEMBLY",
                                "components": [
                                    {
                                        "component": {
                                            "uuid": "kpi-f00df8d8-bf96-4efd-ac83-66575cd3a146",
                                            "properties": {
                                                "label": "small gear",
                                                "item number": 3647,
                                                "item description": "Gear 8 Tooth",
                                                "category": "gear",
                                                "price [Euro]": 0.14,
                                                "mass [g]": 0.16,
                                                "delivery time [days]": 11,
                                                "data source": "https://www.bricklink.com/v2/catalog/catalogitem.page?P=3647#T=C",
                                                "color": "light grey"
                                            },
                                            "layer": "kpi-COMPONENT"
                                        }
                                    },
                                    {
                                        "component": {
                                            "uuid": "kpi-b9b61f2d-93b3-421e-acd2-e9656b7ab510",
                                            "properties": {
                                                "label": "big gear",
                                                "item number": 3650,
                                                "item description": "Gear 24 Tooth Crown",
                                                "category": "gear",
                                                "price [Euro]": 0.09,
                                                "mass [g]": 1.03,
                                                "delivery time [days]": 13,
                                                "data source": "https://www.bricklink.com/v2/catalog/catalogitem.page?P=3650#T=C",
                                                "color": "Very light orange"
                                            },
                                            "layer": "kpi-COMPONENT"
                                        }
                                    },
                                    {
                                        "component": {
                                            "uuid": "kpi-f1d60cf8-efe8-4a50-8124-b1cccca51515",
                                            "properties": {
                                                "label": "gear axle",
                                                "item number": 32073,
                                                "item description": "Axle 5 studs",
                                                "category": "axle",
                                                "price [Euro]": 0.001,
                                                "mass [g]": 0.66,
                                                "delivery time [days]": 3,
                                                "data source": "https://www.bricklink.com/v2/catalog/catalogitem.page?P=32073#T=S&O={%22iconly%22:0}",
                                                "dimension [studs]": 5,
                                                "color": "red"
                                            },
                                            "layer": "kpi-COMPONENT"
                                        }
                                    },
                                    {
                                        "component": {
                                            "uuid": "kpi-2ae7f80f-dd24-458b-934f-4272a6de5a82",
                                            "properties": {
                                                "label": "Technic Bush small",
                                                "item number": 3713,
                                                "item description": "Technic Bush",
                                                "category": "frame",
                                                "price [Euro]": 0.01,
                                                "mass [g]": 0.14,
                                                "delivery time [days]": 3,
                                                "data source": "https://www.bricklink.com/v2/catalog/catalogitem.page?P=3713&name=Technic%20Bush&category=%5BTechnic%5D#T=S&O={%22iconly%22:0}",
                                                "dimension [studs]": 1,
                                                "color": "red"
                                            },
                                            "layer": "kpi-COMPONENT"
                                        }
                                    },
                                    {
                                        "component": {
                                            "uuid": "kpi-9324ee01-6fbb-4ce4-9912-eff2d2a4e9b1",
                                            "properties": {
                                                "label": "Technic Bush big",
                                                "item number": 3713,
                                                "item description": "Technic Bush",
                                                "category": "frame",
                                                "price [Euro]": 0.01,
                                                "mass [g]": 0.14,
                                                "delivery time [days]": 3,
                                                "data source": "https://www.bricklink.com/v2/catalog/catalogitem.page?P=3713&name=Technic%20Bush&category=%5BTechnic%5D#T=S&O={%22iconly%22:0}",
                                                "dimension [studs]": 1,
                                                "color": "red"
                                            },
                                            "layer": "kpi-COMPONENT"
                                        }
                                    }
                                ],
                                "assemblies": []
                            }
                        }
                    ]
                }
            },
            {
                "assembly": {
                    "uuid": "kpi-e9698f23-dfbb-415e-8ee4-ef1425615798",
                    "properties": {
                        "label": "back wheel assembly"
                    },
                    "layer": "kpi-SUBASSEMBLY",
                    "components": [
                        {
                            "component": {
                                "uuid": "kpi-4ba25eac-abc0-4b94-87d8-5cbba8561985",
                                "properties": {
                                    "label": "back wheel right",
                                    "item number": "56904c02",
                                    "item description": "wheel 43,2",
                                    "category": "wheel",
                                    "related items": 30699,
                                    "price [Euro]": 0.11,
                                    "mass [g]": 13.0,
                                    "delivery time [days]": 5,
                                    "data source": "https://www.bricklink.com/v2/catalog/catalogitem.page?P=56904c02#T=C",
                                    "diameter [mm]": 43.2,
                                    "surface": "rough",
                                    "paint": "glossy"
                                },
                                "layer": "kpi-COMPONENT"
                            }
                        },
                        {
                            "component": {
                                "uuid": "kpi-2e9ef39d-e5dc-4859-9f62-bf24ba3d9c27",
                                "properties": {
                                    "label": "back wheel left",
                                    "item number": "56904c02",
                                    "item description": "wheel 43,2",
                                    "category": "wheel",
                                    "related items": 30699,
                                    "price [Euro]": 0.11,
                                    "mass [g]": 13.0,
                                    "delivery time [days]": 5,
                                    "data source": "https://www.bricklink.com/v2/catalog/catalogitem.page?P=56904c02#T=C",
                                    "diameter [mm]": 43.2,
                                    "surface": "rough",
                                    "paint": "glossy"
                                },
                                "layer": "kpi-COMPONENT"
                            }
                        },
                        {
                            "component": {
                                "uuid": "kpi-a59e86b7-e7e5-49de-9060-898e0557b3de",
                                "properties": {
                                    "label": "back axle",
                                    "item number": 3737,
                                    "item description": "Axle 10 studs",
                                    "category": "axle",
                                    "price [Euro]": 0.01,
                                    "mass [g]": 1.49,
                                    "delivery time [days]": 7,
                                    "data source": "https://www.bricklink.com/v2/catalog/catalogitem.page?P=3737#T=S&O={%22iconly%22:0}",
                                    "dimension [studs]": 10,
                                    "color": "red"
                                },
                                "layer": "kpi-COMPONENT"
                            }
                        },
                        {
                            "component": {
                                "uuid": "kpi-043bb13a-ec72-44f0-8e70-08e4d248222e",
                                "properties": {
                                    "label": "Technic Bush back right",
                                    "item number": 3713,
                                    "item description": "Technic Bush",
                                    "category": "frame",
                                    "price [Euro]": 0.01,
                                    "mass [g]": 0.14,
                                    "delivery time [days]": 3,
                                    "data source": "https://www.bricklink.com/v2/catalog/catalogitem.page?P=3713&name=Technic%20Bush&category=%5BTechnic%5D#T=S&O={%22iconly%22:0}",
                                    "dimension [studs]": 1,
                                    "color": "yellow"
                                },
                                "layer": "kpi-COMPONENT"
                            }
                        },
                        {
                            "component": {
                                "uuid": "kpi-7f584190-0c5e-46c9-89f6-816cfb6d4cc6",
                                "properties": {
                                    "label": "Technic Bush back left",
                                    "item number": 3713,
                                    "item description": "Technic Bush",
                                    "category": "frame",
                                    "price [Euro]": 0.01,
                                    "mass [g]": 0.14,
                                    "delivery time [days]": 3,
                                    "data source": "https://www.bricklink.com/v2/catalog/catalogitem.page?P=3713&name=Technic%20Bush&category=%5BTechnic%5D#T=S&O={%22iconly%22:0}",
                                    "dimension [studs]": 1,
                                    "color": "yellow"
                                },
                                "layer": "kpi-COMPONENT"
                            }
                        },
                        {
                            "component": {
                                "uuid": "kpi-e166d90c-af6d-4745-99a2-11255ca88df6",
                                "properties": {
                                    "label": "Brick one hole back right",
                                    "item number": 3700,
                                    "item description": "Technic, Brick 1 x 2 with Hole",
                                    "category": "frame",
                                    "price [Euro]": 0.01,
                                    "mass [g]": 0.82,
                                    "delivery time [days]": 3,
                                    "data source": "https://www.bricklink.com/v2/catalog/catalogitem.page?P=3700#T=C",
                                    "dimension [studs]": "1 x 2",
                                    "color": "red"
                                },
                                "layer": "kpi-COMPONENT"
                            }
                        },
                        {
                            "component": {
                                "uuid": "kpi-192a7822-3bfa-4a2d-83b7-d19070a2ded2",
                                "properties": {
                                    "label": "Brick one hole back left",
                                    "item number": 3700,
                                    "item description": "Technic, Brick 1 x 2 with Hole",
                                    "category": "frame",
                                    "price [Euro]": 0.01,
                                    "mass [g]": 0.82,
                                    "delivery time [days]": 3,
                                    "data source": "https://www.bricklink.com/v2/catalog/catalogitem.page?P=3700#T=C",
                                    "dimension [studs]": "1 x 2",
                                    "color": "red"
                                },
                                "layer": "kpi-COMPONENT"
                            }
                        }
                    ],
                    "assemblies": []
                }
            },
            {
                "assembly": {
                    "uuid": "kpi-e3b58702-32a0-48b7-872f-170fe41c3453",
                    "properties": {
                        "label": "front wheel assembly",
                        "assembly_method": "stick together like lego blocks"
                    },
                    "layer": "kpi-SUBASSEMBLY",
                    "components": [
                        {
                            "component": {
                                "uuid": "kpi-592b70dd-177e-43fb-94ef-6c1a318c0082",
                                "properties": {
                                    "label": "front wheel right",
                                    "item number": "56904c02",
                                    "item description": "wheel 43,2",
                                    "category": "wheel",
                                    "related items": 30699,
                                    "price [Euro]": 0.11,
                                    "mass [g]": 13.0,
                                    "delivery time [days]": 5,
                                    "data source": "https://www.bricklink.com/v2/catalog/catalogitem.page?P=56904c02#T=C",
                                    "diameter [mm]": 43.2,
                                    "surface": "rough",
                                    "paint": "glossy"
                                },
                                "layer": "kpi-COMPONENT"
                            }
                        },
                        {
                            "component": {
                                "uuid": "kpi-2d00f726-d2f9-4c3f-b895-a41755ff93f4",
                                "properties": {
                                    "label": "front wheel left",
                                    "item number": "56904c02",
                                    "item description": "wheel 43,2",
                                    "category": "wheel",
                                    "related items": 30699,
                                    "price [Euro]": 0.11,
                                    "mass [g]": 13.0,
                                    "delivery time [days]": 5,
                                    "data source": "https://www.bricklink.com/v2/catalog/catalogitem.page?P=56904c02#T=C",
                                    "diameter [mm]": 43.2,
                                    "surface": "rough",
                                    "paint": "glossy"
                                },
                                "layer": "kpi-COMPONENT"
                            }
                        },
                        {
                            "component": {
                                "uuid": "kpi-c7213c14-be1a-4acd-ac01-0b35e3a75c03",
                                "properties": {
                                    "label": "front axle",
                                    "item number": 3737,
                                    "item description": "Axle 10 studs",
                                    "category": "axle",
                                    "price [Euro]": 0.01,
                                    "mass [g]": 1.49,
                                    "delivery time [days]": 7,
                                    "data source": "https://www.bricklink.com/v2/catalog/catalogitem.page?P=3737#T=S&O={%22iconly%22:0}",
                                    "dimension [studs]": 10,
                                    "color": "red"
                                },
                                "layer": "kpi-COMPONENT"
                            }
                        },
                        {
                            "component": {
                                "uuid": "kpi-5dbece8f-f883-414c-b485-2a3f9d5b59fd",
                                "properties": {
                                    "label": "Technic Bush front right",
                                    "item number": 3713,
                                    "item description": "Technic Bush",
                                    "category": "frame",
                                    "price [Euro]": 0.01,
                                    "mass [g]": 0.14,
                                    "delivery time [days]": 3,
                                    "data source": "https://www.bricklink.com/v2/catalog/catalogitem.page?P=3713&name=Technic%20Bush&category=%5BTechnic%5D#T=S&O={%22iconly%22:0}",
                                    "dimension [studs]": 1,
                                    "color": "yellow"
                                },
                                "layer": "kpi-COMPONENT"
                            }
                        },
                        {
                            "component": {
                                "uuid": "kpi-8d0d5b4b-bf5b-4c0d-a2cb-2cc710f1f397",
                                "properties": {
                                    "label": "Technic Bush front left",
                                    "item number": 3713,
                                    "item description": "Technic Bush",
                                    "category": "frame",
                                    "price [Euro]": 0.01,
                                    "mass [g]": 0.14,
                                    "delivery time [days]": 3,
                                    "data source": "https://www.bricklink.com/v2/catalog/catalogitem.page?P=3713&name=Technic%20Bush&category=%5BTechnic%5D#T=S&O={%22iconly%22:0}",
                                    "dimension [studs]": 1,
                                    "color": "yellow"
                                },
                                "layer": "kpi-COMPONENT"
                            }
                        },
                        {
                            "component": {
                                "uuid": "kpi-7804f946-1107-41e0-8af8-45046bfa92d9",
                                "properties": {
                                    "label": "Brick one hole front right",
                                    "item number": 3700,
                                    "item description": "Technic, Brick 1 x 2 with Hole",
                                    "category": "frame",
                                    "price [Euro]": 0.01,
                                    "mass [g]": 0.82,
                                    "delivery time [days]": 3,
                                    "data source": "https://www.bricklink.com/v2/catalog/catalogitem.page?P=3700#T=C",
                                    "dimension [studs]": "1 x 2",
                                    "color": "red"
                                },
                                "layer": "kpi-COMPONENT"
                            }
                        },
                        {
                            "component": {
                                "uuid": "kpi-b754e110-3767-4ae3-8b30-281090db1f53",
                                "properties": {
                                    "label": "Brick one hole front left",
                                    "item number": 3700,
                                    "item description": "Technic, Brick 1 x 2 with Hole",
                                    "category": "frame",
                                    "price [Euro]": 0.01,
                                    "mass [g]": 0.82,
                                    "delivery time [days]": 3,
                                    "data source": "https://www.bricklink.com/v2/catalog/catalogitem.page?P=3700#T=C",
                                    "dimension [studs]": "1 x 2",
                                    "color": "red"
                                },
                                "layer": "kpi-COMPONENT"
                            }
                        }
                    ],
                    "assemblies": []
                }
            }
        ]
    }
}