{
	"JSON": {
		"ID": "1ee4d7f7-565f-6f82-8db2-2cf8a3c4cb18",
		"label": "",
		"comment": "UUID6 is used"
	},
	"group": {
		"number": "87",
		"author": "FST",
		"members": "Maximilian Groß, Jakob Maurer, Alexander Neubauer",
		"experiment": "lavalrotor",
		"testrig_number": "04"
	}
}