{
    "JSON": {
        "ID": "1eeaaf37-83b9-6c3b-8e2f-c74561fb7dba",
        "label": "setup_iphone",
        "comment": "auto generated with s_create_json_setup_from_template.py"
    },
    "setup": {
        "1ee846ef-4df0-632a-bfdb-ef2ea3181b39": {
            "type": "general",
            "name": "general_info",
            "comment": ""
        },
        "1ee846f1-b588-6d3c-9659-7c3266d530e8": {
            "type": "instrument",
            "name": "raspberry_pi",
            "comment": ""
        },
        "1ee847be-fddd-6ee4-892a-68c4555b0981": {
            "type": "sensor",
            "name": "accelerometer",
            "range": {
                "min": -2,
                "max": 2,
                "units": "standard_gravity"
            },
            "frequency": {
                "value": 800,
                "units": "Hertz"
            },
            "comment": ""
        },
        "1eeaaf2d-1ff6-6233-8370-c15dcc3a1070": {
            "type": "probe",
            "name": "iphone",
            "comment": ""
        }
    }
}