{
	"JSON": {
		"ID": "1ee57b3a-345d-6fa4-90e6-2a350e5fc61f",
		"label": "PDC014",
		"comment": "UUID6 is used"
	},
	"probe": {
		"material": "Messing",
		"mass": {
			"value": 677,
			"unit": "gramm",
			"uncertainty": {
				"value": 1,
				"type": "absolut",
				"unit": "gramm"
			}
		},
		"dimensions": {
			"height": {
				"value": 40,
				"unit": "millimeter"
			},
			"diameter": {
				"value": 60,
				"unit": "millimeter"
			},
			"volume": {
				"value": 80570,
				"unit": "cubic millimeter"
			}
		}
	}
}