{
	"JSON": {
		"ID": "1ee84a1c-5b1f-6d4f-8571-97739c4961be",
		"label": "",
		"comment": "UUID6 is used"
	},
	"group": {
		"number": "87",
		"author": "jakob maurer",
		"experiment": "calorimetry"
	}
}