{
    "3482":{
        "item number":3482,
        "item description":"Wheel with Split Axle Hole",
        "category":"rim",
        "related items":3483,
        "diameter [mm]":17.5,
        "price [Euro]":0.01,
        "mass [g]":0.88,
        "environmental impact [kg CO2e /kg]":32.06,
        "delivery time [days]":5,
        "data source":"https://www.bricklink.com/v2/catalog/catalogitem.page?P=3482"
    },
    "6014":{
        "item number":6014,
        "item description":"Wheel 11mm D. x 12mm, Hole Round for Wheels Holder Pin",
        "category":"rim",
        "related items":6015,
        "diameter [mm]":11.0,
        "price [Euro]":0.0045,
        "mass [g]":0.6,
        "environmental impact [kg CO2e /kg]":32.06,
        "delivery time [days]":5,
        "data source":"https://www.bricklink.com/v2/catalog/catalogitem.page?P=6014a"
    },
    "18976":{
        "item number":18976,
        "item description":"Wheel 18mm D. x 12mm with Axle Hole and Stud, Solid Brake Rotor Lines",
        "category":"rim",
        "related items":30391,
        "diameter [mm]":18.0,
        "price [Euro]":0.01,
        "mass [g]":1.4,
        "environmental impact [kg CO2e /kg]":32.06,
        "delivery time [days]":5,
        "data source":"https://www.bricklink.com/v2/catalog/catalogitem.page?P=18976"
    },
    "56904":{
        "item number":56904,
        "item description":"Wheel 30mm D. x 14mm",
        "category":"rim",
        "related items":30699,
        "diameter [mm]":30.0,
        "price [Euro]":0.01,
        "mass [g]":4.1,
        "environmental impact [kg CO2e /kg]":32.06,
        "delivery time [days]":5,
        "data source":"https://www.bricklink.com/v2/catalog/catalogitem.page?P=56904"
    },
    "56908":{
        "item number":56908,
        "item description":"Wheel 43.2mm D. x 26mm Technic Racing Small, 6 Pin Holes",
        "category":"rim",
        "related items":"41897, 61480",
        "diameter [mm]":43.2,
        "price [Euro]":0.05,
        "mass [g]":9.0,
        "environmental impact [kg CO2e /kg]":32.06,
        "delivery time [days]":5,
        "data source":"https://www.bricklink.com/v2/catalog/catalogitem.page?P=56908"
    }
}