{
    "3483":{
        "item number":3483,
        "item description":"Tire 24mm D. x 8mm Offset Tread - Interior Ridges",
        "category":"tire",
        "related items":3482,
        "inner diameter [mm]":17,
        "outer diameter [mm]":24.0,
        "price [Euro]":0.0025,
        "mass [g]":1.69,
        "environmental impact [kg CO2e /kg]":8.97,
        "delivery time [days]":5,
        "data source":"https://www.bricklink.com/v2/catalog/catalogitem.page?P=3483"
    },
    "6015":{
        "item number":6015,
        "item description":"Tire 21mm D. x 12mm - Offset Tread Small Wide",
        "category":"tire",
        "related items":6014,
        "inner diameter [mm]":11,
        "outer diameter [mm]":21.0,
        "price [Euro]":0.0004,
        "mass [g]":2.0,
        "environmental impact [kg CO2e /kg]":8.97,
        "delivery time [days]":5,
        "data source":"https://www.bricklink.com/v2/catalog/catalogitem.page?P=6015"
    },
    "30391":{
        "item number":30391,
        "item description":"Tire 30.4 x 14 Offset Tread",
        "category":"tire",
        "related items":18976,
        "inner diameter [mm]":17,
        "outer diameter [mm]":30.4,
        "price [Euro]":0.0027,
        "mass [g]":6.5,
        "environmental impact [kg CO2e /kg]":8.97,
        "delivery time [days]":5,
        "data source":"https://www.bricklink.com/v2/catalog/catalogitem.page?P=30391"
    },
    "30699":{
        "item number":30699,
        "item description":"Tire 43.2 x 14 Solid",
        "category":"tire",
        "related items":56904,
        "inner diameter [mm]":30,
        "outer diameter [mm]":43.2,
        "price [Euro]":0.06,
        "mass [g]":8.25,
        "environmental impact [kg CO2e /kg]":8.97,
        "delivery time [days]":5,
        "data source":"https://www.bricklink.com/v2/catalog/catalogitem.page?P=30699"
    },
    "41897":{
        "item number":41897,
        "item description":"Tire 56 x 28 ZR Street",
        "category":"tire",
        "related items":56908,
        "inner diameter [mm]":43,
        "outer diameter [mm]":56.0,
        "price [Euro]":0.29,
        "mass [g]":13.98,
        "environmental impact [kg CO2e /kg]":8.97,
        "delivery time [days]":5,
        "data source":"https://www.bricklink.com/v2/catalog/catalogitem.page?P=41897"
    },
    "61480":{
        "item number":61480,
        "item description":"Tire 68.7 x 34 R",
        "category":"tire",
        "related items":56908,
        "inner diameter [mm]":43,
        "outer diameter [mm]":68.7,
        "price [Euro]":0.02,
        "mass [g]":20.0,
        "environmental impact [kg CO2e /kg]":8.97,
        "delivery time [days]":5,
        "data source":"https://www.bricklink.com/v2/catalog/catalogitem.page?P=61480"
    }
}