{
    "39790":{
        "item number":39790,
        "item description":"Technic, Liftarm, Modified Frame Thick 11 x 15 Open Center",
        "category":"frame",
        "price [Euro]":2.19,
        "mass [g]":12.96,
        "environmental impact [kg CO2e /kg]":11.93,
        "delivery time [days]":3,
        "data source":"https://www.bricklink.com/v2/catalog/catalogitem.page?P=39790",
        "dimension [studs]":"11 x 15 x 1"
    },
    "32532":{
        "item number":32532,
        "item description":"Technic, Brick 6 x 8 Open Center",
        "category":"frame",
        "price [Euro]":0.18,
        "mass [g]":8.0,
        "environmental impact [kg CO2e /kg]":11.93,
        "delivery time [days]":3,
        "data source":"https://www.bricklink.com/v2/catalog/catalogitem.page?P=32532",
        "dimension [studs]":"6 x 8 x 1"
    },
    "32531":{
        "item number":32531,
        "item description":"Technic, Brick 4 x 6 Open Center",
        "category":"frame",
        "price [Euro]":0.1,
        "mass [g]":5.0,
        "environmental impact [kg CO2e /kg]":11.93,
        "delivery time [days]":3,
        "data source":"https://www.bricklink.com/v2/catalog/catalogitem.page?P=32531",
        "dimension [studs]":"4 x 6 x 1"
    },
    "3700":{
        "item number":3700,
        "item description":"Technic, Brick 1 x 2 with Hole",
        "category":"frame",
        "price [Euro]":0.01,
        "mass [g]":0.82,
        "environmental impact [kg CO2e /kg]":11.93,
        "delivery time [days]":3,
        "data source":"https://www.bricklink.com/v2/catalog/catalogitem.page?P=3700",
        "dimension [studs]":"1 x 2"
    },
    "3701":{
        "item number":3701,
        "item description":"Technic, Brick 1 x 4 with Holes",
        "category":"frame",
        "price [Euro]":0.01,
        "mass [g]":1.46,
        "environmental impact [kg CO2e /kg]":11.93,
        "delivery time [days]":3,
        "data source":"https://www.bricklink.com/v2/catalog/catalogitem.page?P=3701",
        "dimension [studs]":"1 x 4 x 1"
    },
    "3702":{
        "item number":3702,
        "item description":"Technic, Brick 1 x 8 with Holes",
        "category":"frame",
        "price [Euro]":0.01,
        "mass [g]":2.85,
        "environmental impact [kg CO2e /kg]":11.93,
        "delivery time [days]":5,
        "data source":"https://www.bricklink.com/v2/catalog/catalogitem.page?P=3702",
        "dimension [studs]":"1 x 8 x 1"
    },
    "2730":{
        "item number":2730,
        "item description":"Technic, Brick 1 x 10 with Holes",
        "category":"frame",
        "price [Euro]":0.01,
        "mass [g]":3.67,
        "environmental impact [kg CO2e /kg]":11.93,
        "delivery time [days]":5,
        "data source":"https://www.bricklink.com/v2/catalog/catalogitem.page?P=2730",
        "dimension [studs]":"1 x 10 x 1"
    },
    "3895":{
        "item number":3895,
        "item description":"Technic, Brick 1 x 12 with Holes",
        "category":"frame",
        "price [Euro]":0.03,
        "mass [g]":4.2,
        "environmental impact [kg CO2e /kg]":11.93,
        "delivery time [days]":5,
        "data source":"https://www.bricklink.com/v2/catalog/catalogitem.page?P=3895",
        "dimension [studs]":"1 x 12 x 1"
    },
    "32018":{
        "item number":32018,
        "item description":"Technic, Brick 1 x 14 with Holes",
        "category":"frame",
        "price [Euro]":0.03,
        "mass [g]":4.92,
        "environmental impact [kg CO2e /kg]":11.93,
        "delivery time [days]":5,
        "data source":"https://www.bricklink.com/v2/catalog/catalogitem.page?P=32018",
        "dimension [studs]":"1 x 14 x 1"
    },
    "3703":{
        "item number":3703,
        "item description":"Technic, Brick 1 x 16 with Holes",
        "category":"frame",
        "price [Euro]":0.07,
        "mass [g]":5.87,
        "environmental impact [kg CO2e /kg]":11.93,
        "delivery time [days]":5,
        "data source":"https://www.bricklink.com/v2/catalog/catalogitem.page?P=3703",
        "dimension [studs]":"1 x 16 x 1"
    },
    "32524":{
        "item number":32524,
        "item description":"Technic, Liftarm Thick 1 x 7",
        "category":"frame",
        "price [Euro]":0.01,
        "mass [g]":1.79,
        "environmental impact [kg CO2e /kg]":11.93,
        "delivery time [days]":3,
        "data source":"https://www.bricklink.com/v2/catalog/catalogitem.page?P=32524",
        "dimension [studs]":"1 x 7"
    },
    "40490":{
        "item number":40490,
        "item description":"Technic, Liftarm Thick 1 x 9",
        "category":"frame",
        "price [Euro]":0.02,
        "mass [g]":2.59,
        "environmental impact [kg CO2e /kg]":11.93,
        "delivery time [days]":3,
        "data source":"https://www.bricklink.com/v2/catalog/catalogitem.page?P=40490",
        "dimension [studs]":"1 x 9"
    },
    "64290":{
        "item number":64290,
        "item description":"Technic, Liftarm Thick 1 x 11",
        "category":"frame",
        "price [Euro]":0.02,
        "mass [g]":2.8,
        "environmental impact [kg CO2e /kg]":11.93,
        "delivery time [days]":3,
        "data source":"https://www.bricklink.com/v2/catalog/catalogitem.page?P=32525",
        "dimension [studs]":"1 x 11"
    },
    "41239":{
        "item number":41239,
        "item description":"Technic, Liftarm Thick 1 x 13",
        "category":"frame",
        "price [Euro]":0.05,
        "mass [g]":3.3,
        "environmental impact [kg CO2e /kg]":11.93,
        "delivery time [days]":5,
        "data source":"https://www.bricklink.com/v2/catalog/catalogitem.page?P=41239",
        "dimension [studs]":"1 x 13"
    },
    "32278":{
        "item number":32278,
        "item description":"Technic, Liftarm Thick 1 x 15",
        "category":"frame",
        "price [Euro]":0.05,
        "mass [g]":4.0,
        "environmental impact [kg CO2e /kg]":11.93,
        "delivery time [days]":3,
        "data source":"https://www.bricklink.com/v2/catalog/catalogitem.page?P=32278",
        "dimension [studs]":"1 x 15"
    },
    "3713":{
        "item number":3713,
        "item description":"Technic Bush",
        "category":"frame",
        "price [Euro]":0.01,
        "mass [g]":0.14,
        "environmental impact [kg CO2e /kg]":11.93,
        "delivery time [days]":3,
        "data source":"https://www.bricklink.com/v2/catalog/catalogitem.page?P=3713",
        "dimension [studs]":1
    },
    "32123":{
        "item number":32123,
        "item description":"Technic Bush 1/2 Smooth",
        "category":"frame",
        "price [Euro]":0.01,
        "mass [g]":0.01,
        "environmental impact [kg CO2e /kg]":11.93,
        "delivery time [days]":3,
        "data source":"https://www.bricklink.com/v2/catalog/catalogitem.page?P=4265c",
        "dimension [studs]":1
    },
    "3749":{
        "item number":3749,
        "item description":"Technic, Axle 1L with Pin without Friction Ridges",
        "category":"frame",
        "price [Euro]":0.01,
        "mass [g]":0.22,
        "environmental impact [kg CO2e /kg]":11.93,
        "delivery time [days]":5,
        "data source":"https://www.bricklink.com/v2/catalog/catalogitem.page?P=3749",
        "dimension [studs]":"0,75 x 2 x 0,55"
    },
    "6536":{
        "item number":6536,
        "item description":"Technic, Axle and Pin Connector Perpendicular",
        "category":"frame",
        "price [Euro]":0.01,
        "mass [g]":0.39,
        "environmental impact [kg CO2e /kg]":11.93,
        "delivery time [days]":7,
        "data source":"https://www.bricklink.com/v2/catalog/catalogitem.page?P=6536",
        "dimension [studs]":"1x 2 x 1"
    },
    "14720":{
        "item number":14720,
        "item description":"Technic, Liftarm, Modified H-Shape Thick 3 x 5 Perpendicular",
        "category":"frame",
        "price [Euro]":0.08,
        "mass [g]":2.29,
        "environmental impact [kg CO2e /kg]":11.93,
        "delivery time [days]":3,
        "data source":"https://www.bricklink.com/v2/catalog/catalogitem.page?P=14720",
        "dimension [studs]":"3 x 5 x 1"
    },
    "48989":{
        "item number":48989,
        "item description":"Technic, Pin Connector Perpendicular 3L with 4 Pins",
        "category":"frame",
        "price [Euro]":0.01,
        "mass [g]":1.22,
        "environmental impact [kg CO2e /kg]":11.93,
        "delivery time [days]":5,
        "data source":"https://www.bricklink.com/v2/catalog/catalogitem.page?P=48989",
        "dimension [studs]":"3 x 3 x 1"
    },
    "55615":{
        "item number":55615,
        "item description":"Technic, Pin Connector Perpendicular 3 x 3 Bent with 4 Pins",
        "category":"frame",
        "price [Euro]":0.1,
        "mass [g]":1.9,
        "environmental impact [kg CO2e /kg]":11.93,
        "delivery time [days]":5,
        "data source":"https://www.bricklink.com/v2/catalog/catalogitem.page?P=55615",
        "dimension [studs]":"4 x 4 x 1"
    },
    "32556":{
        "item number":32556,
        "item description":"Technic, Pin 3L without Friction Ridges",
        "category":"frame",
        "price [Euro]":0.1,
        "mass [g]":0.25,
        "environmental impact [kg CO2e /kg]":11.93,
        "delivery time [days]":3,
        "data source":"https://www.bricklink.com/v2/catalog/catalogitem.page?P=32556",
        "dimension [studs]":1
    },
    "3673":{
        "item number":3673,
        "item description":"Technic, Pin without Friction Ridges",
        "category":"frame",
        "price [Euro]":0.01,
        "mass [g]":0.16,
        "environmental impact [kg CO2e /kg]":11.93,
        "delivery time [days]":3,
        "data source":"https://www.bricklink.com/v2/catalog/catalogitem.page?P=3673",
        "dimension [studs]":1
    },
    "32054":{
        "item number":32054,
        "item description":"Technic, Pin 4L with Friction Ridges and Stop Bush",
        "category":"frame",
        "price [Euro]":0.01,
        "mass [g]":0.33,
        "environmental impact [kg CO2e /kg]":11.93,
        "delivery time [days]":3,
        "data source":"https://www.bricklink.com/v2/catalog/catalogitem.page?P=32054",
        "dimension [studs]":1
    }
}