{
	"JSON": {
		"ID": "1efa1b85-845b-695b-9e10-29ada82e23ab",
		"label": "",
		"comment": "UUID6 is used"
	},
	"group": {
		"group_number": "11",
		"authors": "Jakob Koch",
		"experiment": "Kalorimetrie",
		"created": "17.11.2024"
	}
}