{
	"JSON": {
		"ID": "1efa1b5d-ab3f-67cf-9568-314724ae7a79",
		"label": "",
		"comment": "UUID6 is used"
	},
	"sensor": {
		"name": "Temperature_Sensor_1",
		"type": "DS18B20",
		"manufacturer": "keyestudio",
		"serial": "3ce104578d01",
		"comment": "",
		"range": {
			"min": -55,
			"max": 125,
			"units": "180"
		},
		"accuracy": {
			"value": 0.5,
			"type": "absolute/fromMaximum",
			"unit": "degree_celsius"
		}
	}
}
