{
	"JSON": {
		"ID": "1efa1f58-c806-63f0-8ff3-48531ed4b708",
		"label": "",
		"comment": "UUID6 is used"
	},
	"probe": {
		"Wassermasse in Liter": 0.2,
		"Höhe Tasse": "9cm",
		"Durchmesser Tasse": "10cm"
	}
}