{
	"JSON": {
		"ID": "1ee823b5-5d9b-6f24-9817-906ef09da71d",
		"label": "",
		"comment": "UUID6 is used"
	},
	"instrument": {
		"name": "motor_controller",
		"type": "BLDC-8015A",
		"manufacturer": "ACT",
		"power": {
			"value": 24,
			"unit": "Volt"
		},
		"current output": {
			"value": "15",
			"unit": "Ampere"
		}
	}
}
