{
	"JSON": {
		"ID": "1ee7d4d9-455a-6d5e-994b-029f86684d24",
		"label": "",
		"comment": "UUID6 is used"
	},
	"group": {
		"number": "29",
		"author": "Jakob Knoblach",
		"experiment": "Kalorimetrie am Küchentisch"
	}
}