 'jogar futebol não é o seu sonho? [...]Não é isso o que você sempre quis? Então não desista por causa de pessoas racistas. Você vai resistir'.;
 Em campo, nunca revidei. Cada um tem uma reação.;
 Vamos nos encontrar novamente e vai ser do meu jeito, [...]jogando futebol... Fica em paz!;
 mas estava tão concentrado no [...]jogo que encarava como uma forma de o rival me tirar do sério;
 tem uma atuação antirracista mais centrada nas redes sociais. ;
"""Deveria ter ignorado? Não sei ainda... Hoje, com a cabeça fria, respondo que sim.
";
"""Eu agora [...]só quero focar no futebol e voltar a campo novamente.";
"""Infelizmente, os insultos são uma ocorrência cotidiana no futebol, e eu posso suportá-los.";
"""Um cara desses nem merece atenção""";
"""ninguém deve duvidar do nosso compromisso contra o racismo""";
"""É claro que você é treinado para não reagir ou demonstrar emoção. ";
"""É triste, mas a[...] gente tem de levantar a cabeça, bola para frente, tem de esquecer isso.";
'Temos de ser fortes e ter orgulho da nossa raça';
"A gente relevava, mas é triste - disse.
";
Ahmad acabou fazendo o segundo gol do Excelsior e comemorou em frente aos [...]torcedores que o ofenderam.;
"Após suspensão por racismo, PSG goleia em jogo marcado por protestos";
De 'cabeça fria';
Depois de dois dias, estou tranquilo e quero falar. ;
"Depois, abaixou o tom e disse que o caso mostra a necessidade de uma reflexão, que aceita sua punição (de [...]dois jogos) e que espera que o adversário também seja punido.
";
Deveria [...]ter ignorado? Não sei ainda... Hoje com a cabeça fria respondo que sim;
Durante o jogo queria dar a resposta como sempre. Jogando futebol. ;
Escutava, mas relevava;
Espero que você não desiste do que ama fazer, que é jogar futebol. [...]Pegue isso como força, transforme ela em treino, dedicação, em amor ao que você faz, aos seus pais, a sua [...]família, a todos;
Eu estava fazendo uma das [...]coisas que mais amo na minha vida, que é jogar futebol, ;
Ficava bravo, mas não queria me [...]desconcentrar;
Nem tinha falado nada com ninguém, tentei ignorar.;
Neymar se diz de 'cabeça fria' ;
No jogo, queria dar a [...]resposta como sempre, jogando futebol.;
Nossa senhora, na moral, respirei fundo, me controlando;
Não deixávamos nos [...]abalar;
O atacante do PSG tem sido mais engajado na luta contra o [...]racismo;
"O que você quer que eu diga? Que racismo é errado e que esses torcedores são estúpidos? Não é sobre [...]isso. Não sou o primeiro nem o último jogador a sofrer isso"", declarou o goleiro francês.";
Passei por tantas dificuldades já que isso nem me preocupa. ;
Pegue isso como força, transforme isso em treino, em [...]dedicação, em amor ao que faz, aos seus pais, à família, a todos,;
"Preferiram se concentrar no duro duelo que tinham pela frente.
";
Quero te desejar força, muita luz, muito amor. Espero que você [...]não desista do que você ama fazer, que é jogar futebol. ;
Um cara desses nem merece atenção. Esse [...]fato não me atinge porque tenho a cabeça tranquila. Apenas me fortalece. É só mais um caso entre tantos que [...]já tive que lidar.;
"a melhor resposta a ser [...]dada é dentro de campo.
";
"afirma que deveria ter ignorado insulto racista
";
"afirmou [...]que agora, de ""cabeça fria"", analisa que deveria ter ignorado as palavras do espanhol Álvaro González,";
"agora, de ""cabeça fria"", analisa que deveria ter ignorado as palavras do espanhol ";
alguns de nosso elenco, que deram tudo pela camisa nesse [...]verão;
"e responde[...] com gol e comemoração diante dos adversários
";
ele comemorou colocando a mão no ouvido e olhando para as arquibancadas do [...]estádio,;
já de cabeça fria,;
"mas atacante brasileiro dá de ombros: ""Não [...]me atinge, apenas me fortalece""";
mas cabeça pra frente, nunca deixe de lutar e de fazer o que [...]você sabe e muito bem, que é jogar futebol. ;
naquele momento só estava concentrado em fazer o pênalti e nada mais.;
o atacante voltou a desabafar, mas, dessa vez, em tom mais pacífico.;
tenho muitos jogos como profissional e nunca vim falar nada na imprensa porque nunca[...] sofri esse preconceito.;
É triste, mas a[...] gente tem de levantar a cabeça, bola para frente, tem de esquecer isso;