; for which Jamie Carragher apologised in October last year ;;;
;"""But if I did I want Marcus to know that I'm truly sorry and I apologise sincerely. ""After everything he's [...]done for my kids and all the other kids in the country with the free school meals.
[...]""He's absolutely brilliant. He's helped my family and I can't thank him enough.""
";;;
;"""He has accepted [...]responsibility ";;;
;"""I need to apologise @MarcusRashford but [...]I'm still very angry. but not with you.""
";;;
;"""I really want to apologise to Saka, it was a mistake and I will not do it again to him or any black player.""";;;
;"""It was a big mistake. I was angry and I didn't know when Saka saw the monkey what he would feel. I[...] saw other people were typing the same emoji and I went with them.
";;;
;"""The boy was extremely remorseful for his actions";;;
;"""Unfortunately, on this occasion, we did not hear back and wrongly assumed that Jonathan did not require our [...]support.
";;;
;"""We apologise unreservedly to the Premier League, to Manchester City and to all those helping to promote [...]Black Lives Matter.""
";;;
;"""We'd like to apologise to Jonathan. We do not want any player to feel unsupported when going through [...]something as difficult as this.
";;;
;"""We're pleased that Mr Clare has taken responsibility for his abhorrent [...]actions and pleaded guilty. ";;;
;"A 12-year-old boy who sent racist messages to Crystal Palace winger Wilfried Zaha was ""extremely remorseful""";;;
;"A social media troll, who sent England's Bukayo Saka racist abuse following the Euro 2020 final, has admitted[...] he should be banned from platforms for life.
";;;
;"Baldry told Manchester [...]magistrates court that Sterling is one of his favourite players and that he regretted his actions as soon as [...]he made the remark.
";;;
;"Boy who racially abused Wilfried Zaha 'extremely remorseful'
";;;
;"Burke, giving evidence, said he was 'embarrassed by the way I reacted.' .
";;;
;"Clare, 40, from Waverley, Woodside, pleaded guilty at Telford Magistrates' Court last Friday to racially [...]aggravated public order in connection with the racist comments he made.
";;;
;"Greater Manchester Police said the 37-year-old man handed himself in at Cheadle Heath police station on [...]Wednesday morning.
";;;
;"He added: ""I'm a nice person. It's not my character to do anything like this. I have never been in trouble [...]before. I would like to apologise.""
";;;
;"He said he apologized[...] on behalf of Schalke to Moukoko and Dortmund chief executive Hans-Joachim Watzke.
";;;
;"Hodgin is thought to have apologised to Oldbury-born former Wolves youth player and ex-Stourbridge forward [...]Vincent immediately after the incident and the club's response has been praised by Worcester.
";;;
;"I am deeply sorry for the misunderstanding and I apologise to [...]anyone who may have been offended.""
";;;
;"In a statement in which he apologised 'to all Worcester City fans, players, management and committee'.
";;;
;Jonathan Leko receives apology from PFA after accusing them of failing to support him in racism case;;;
;"Ms Elphicke has now apologised, saying the message had ""shared the frustration and heartbreak of millions of [...]other England fans"".
[...]""I regret messaging privately a rash reaction about Marcus Rashford's missed penalty and apologise to him for[...] any suggestion that he is not fully focussed on his football,"" she said.
";;;
;Pretty apologised to anyone that was offended ;;;
;"Pretty appeared at Folkestone Magistrates' Court on Wednesday where he admitted sending a message that was [...]grossly offensive or of an indecent, obscene or menacing character.
";;;
;"Pretty then uploaded another video where he apologised for the first video, but said he did not care if he [...]offended anyone.
";;;
;Schalke apologise after Borussia Dortmund youngster Youssoufa Moukoko racially abused during derby;;;
;"Schalke coach Manuel Baum said values were a top priority for him, ""so how the club has positioned itself was[...] exactly the right reaction.""
";;;
;"Schalke has apologised for their fans' racist abuse of Borussia Dortmund youth player Youssoufa Moukoko [...]during a match between the rival clubs' under-19 sides on Sunday.
";;;
;"Social media troll who sent Bukayo Saka racist abuse admits he should be banned 'forever'
";;;
;"The PFA said it had ""wrongly assumed"" Leko did not require assistance from them after they contacted the [...]20-year-old and received no response.
";;;
;"The PFA said it would review its procedures as a result of a statement released by Leko, in which he [...]suggested there had been ""minimal contact"" from the association after his allegation towards Casilla.
";;;
;"The PFA subsequently released a statement apologising for the fact that Leko felt ""unsupported"" by the [...]organisation.
";;;
;"The Professional Footballers' Association (PFA) has issued an apology to Jonathan Leko after the West Brom [...]forward accused them of failing to support him during his racism case against Leeds United goalkeeper Kiko [...]Casilla.
";;;
;"The Sun reported that he has also begged for forgiveness from the Manchester United striker - and revealed [...]he had benefited from Marcus' school meals campaign.
";;;
;"The unnamed abuser of Saka told theBBC's File on 4 that he should be banned ""forever"" and that what he did [...]was ""really racist"".
";;;
;"although he did apologise ""for the misunderstanding"".";;;
;"but everyone in football and society, we have our responsibilities [...]in relation to this situation and if we make mistakes we have to accept responsibilities.""
";;;
;"but only he can open his heart, apologise and accept the [...]consequences.
";;;