" ""Here they go. This is how they start. Subtle to[...] begin with, but it will grow. It's what they do.""
";;;;
" ""I think that gives us as players more reassurance because there are players that [...]will receive it and think: is this a sixmonth path that I want to go down?""";;;;
" ""I've always said I don't think the authorities are doing enough about racism[...] and sensitivities as it pertains to language.
";;;;
" ""If it had been three white players who missed those penalties, I don't think [...]they would be getting the same level of disgusting, threatening comments. ";;;;
" ""Nothing changes.""
";;;;
" ""The Government [...]don't do enough, they don't say enough.
";;;;
 Booing 'knee' means you oppose equality;;;;
" England players booed for taking a knee despite plea by team
";;;;
 For this alleged incident to take place at a time when all Premier League clubs are visibly [...]supporting the No Room For Racism campaign shows the work we all have ahead of us;;;;
" France has become a country where [...]racist rhetoric [and] actions are intensified,""";;;;
" Racist abuse not taken as seriously as other topics
";;;;
" Swansea midfielder Yan Dhanda [...]recently criticised Facebook's decision to keep open the account of the person who racially abused him on [...]social media.
";;;;
 The Professional Footballers' [...]Association echoed Onuora's view that the onus should fall on the social networks.;;;;
" The government is under pressure to do more to tackle racist vitriol on social [...]media after several members of the England team received abuse in the wake of the defeat to Italy.
";;;;
 You don't get to stoke the fire at the beginning of the tournament by labelling our anti-racism message as[...] 'Gesture Politics' & then pretend to be disgusted when the very thing we're campaigning against, happens. ;;;;
 after accusing them of failing to support him in racism case;;;;
" and it is all too easy for individuals to hide behind an [...]account. Derby County
";;;;
 as three of his own players had been [...]targeted at home;;;;
" at the moment you've got a lot of people [...]unfortunately in senior positions, and members of the public, who deny that (racism) is a thing.""
";;;;
" because it's not one or two booing, there [...]is a big sound.
";;;;
" calling [...]on social media users to think more about the impact that sending abusive messages can have on recipients.
";;;;
 fans at Millwall and Colchester booed players taking a knee [...]in an anti-racism gesture;;;;
" fans who booed players taking a knee
";;;;
" he is baffled by the reaction and the [...]arguments of those that choose to boo given they are emotionally invested in a sport populated by a huge [...]proportion of black athletes.
";;;;
 if there was ever comments in regards to something else, I think things would be taken a lot more[...] seriously.;;;;
" in which he [...]suggested there had been ""minimal contact"" from the association after his allegation towards Casilla.
";;;;
" is a sad reality that your powerful platforms are not [...]doing enough to stop these messages.
";;;;
" quote tweeting French [...]outlet So Foot, who carried the story: ""Make sure your sources are reliable before writing.""
";;;;
" racism is ""part [...]of the game and always will be until proper punishments are put in place by those with the power"".
";;;;
" the abuse ""demonstrates exactly why more has to be done to identify the [...]perpetrators of such comments and bring them to justice"".
";;;;
" the banner was timed to fly above the ground at [...]the moment the two teams emerged for kick-off, when sides have been showing support for the Black Lives [...]Matter movement.
";;;;
 this is now down to the responsibility of the social media companies.;;;;
" were [...]boycotting social media because of a lack of action in combatting the issue.
";;;;
" which was flown above the stadium at kick-off to [...]coincide with players on the pitch taking the knee in support of the Black Lives Matter movement.
";;;;
"""And it continues... another week of @instagram doing absolutely nothing about racial [...]abuse. ";;;;
"""But half the England team are black players, and often they are the best players, so you travelling over to [...]boo them? It just confuses me.
";;;;
"""Cala has missed a great opportunity to accept his mistake and apologise to the player affected";;;;
"""Every time we speak about racial abuse, the punishments that follow never seem to be in line with [...]what's happened.";;;;
"""Following the investigation carried out by the UEFA ethics and disciplinary [...]inspector, a decision has been taken not to open any disciplinary proceedings.""
";;;;
"""Good to see the boycott changed nothing @ instagram"". ";;;;
"""I don't understand why it would offend you. How long do we go for a knee, about ten seconds?
";;;;
"""I have been disappointed with the amount of time it has taken to reach this point. Knowing what occurred [...]in the game that day, it has been difficult to watch Kiko Casilla continue to play for such a lengthy [...]period as if nothing had happened.
";;;;
"""I just thought, it's so easy for these (people sending abusive posts)...";;;;
"""I think that's the whole problem in society, they were[...] [the official was] trying to label people as different.
";;;;
"""I wonder if this account will be barred for a month and collect their 'Insta slap on the wrist' and 'don't[...] do that again' talk.""
";;;;
"""I'm confused, absolutely baffled to see the booing. I don't get it,"" ";;;;
"""I'm not here for all the nonsense that is being done instead of fixing the actual problem!
";;;;
"""Identifying these anonymous mindless idiots remains problematic.
";;;;
"""If you can create an anonymous account and abuse people, it's not right. We'll work together with everyone [...]to stop this nonsense.""
";;;;
"""In my opinion they've been far too[...] slow to take down harmful material, not just in terms of the abuse that footballers have suffered but abuse [...]generally. ""There is technology out there that can protect this a lot quicker than they've been minded to [...]move. ";;;;
"""It made me question whether I would be prepared to go through it all again were I on the receiving end of [...]similar abuse in the future. I";;;;
"""It's hard to fix a problem until you acknowledge the problem";;;;
"""It's so predictable now, it makes a mockery of Instagram's comments [...]this week.
";;;;
"""Just another day on social media...""";;;;
"""Sanctioning a victim of racial abuse is beyond comprehension and it plays into the hands of those who [...]promote this kind of disgraceful behaviour.""
";;;;
"""Social media abuse is, sadly, becoming more common and it is all too easy for individuals to hide [...]behind an account";;;;
"""Speak to me when you actually take this issue serious.""
";;;;
"""That's the way it's got to go, for too long people have thought there's no consequences to this.";;;;
"""There has been talk of strong commitments and tough measures from the social networks. Based on the evidence[...] so far, we're not buying it. Social networks, we need you to do better.""
";;;;
"""There is technology out there that can protect this a lot quicker.""
";;;;
"""They're clearly neglecting their responsibility to cut out this form of discrimination and these racist [...]remarks. ";;;;
"""They've been far too slow to take down harmful material.
";;;;
"""They've got the know how of how to stop it but clearly aren't doing enough at the moment.""
";;;;
"""Those taking the knee, and supporting the taking of the knee, not only show their willingness to support the[...] drive to eradicate racial oppression but force it to be a talking point even when it's uncomfortable. ";;;;
"""We are very disappointed by the decision of the Ukrainian FA to hand Taison a one-match ban,""";;;;
"""We encourage those that oppose this action to reflect on the message you are sending to the players you are[...] supporting.
";;;;
"""We keep talking about it every bloody week.";;;;
"""We regret that Uefa does not now choose to take this to its disciplinary committee. ";;;;
"""We've been told why the players are doing it and I don't understand why it would be such a problem for you [...]to not boo? Even if you don't believe in the movement, by booing you're actually opposing it and trying to [...]stand on the opposite side.
";;;;
"""We've faced backlash or criticism or opposition views before ";;;;
"""Why do we keep coming back to these same scenarios, when they're so predictable and they're so preventable? [...]If the governing bodies and the right people have got the intent to affect change, they'll do it.""
";;;;
"""You guys keep fuelling the negativity and the racism issue. ";;;;
'If you can't control your fans and you can't protect players that are going into that [...]environment;;;;
A minority of England fans once again defied calls not to jeer the players;;;;
After a minority booed the stance ahead of Wednesday's win over Austria,;;;;
"Arsenal's former France forward Thierry Henry has described racism on social media as ""too toxic to ignore"" [...]and disabled all of his accounts on Saturday following the recent instances on the platform.
";;;;
"As well as the targeting of Sterling and Bellingham, there were boos from the Budapest crowd the England team[...] took a knee before kick-off.
";;;;
Buruk also accused the Romanian referee, Ovidiu Hategan, of failing to properly manage the situation ;;;;
"But I found the hearing, at which I was made to feel I had done something wrong, [...]extremely stressful.
";;;;
"But a copy of the referee's report says ""nothing"" in the section ""extras to report"".
";;;;
But last night they booed knee taking;;;;
But the jeers returned to the Riverside Stadium for the second time in five days;;;;
"Cambridge criticise supporters for `disgraceful' [...]reaction
";;;;
Coun Rahman, who has worked for years with antiracism charity Show Racism the Red Card, said that white [...]players would not have received the same level of hate if they had missed penalties.;;;;
Deafening jeers welcomed England players taking the knee before kick-off ;;;;
England fans boo taking of the knee ;;;;
England fans should 'respect the wishes' of players taking the knee;;;;
"Erdogan accuses France of fuelling racism
";;;;
"FIFA and UEFA should have worked together to protect England's players from the ""preventable and predictable""[...] racist abuse they suffered in Hungary on Thursday night";;;;
"FIFPro has since expressed their disappointment over the decision and said such sanctions play into the hands[...] of ""those who promote this kind of disgraceful behaviour.""
";;;;
"Football needs more respect,[...] the world needs more respect!""
";;;;
"France has become a country where racist rhetoric [and] actions [...]are intensified.""
";;;;
GARETH Southgate's pleas for England supporters not to jeer his players taking a knee were defied;;;;
"He also said it would be ""laughable"" if Hungary's recent [...]track record was not taken into account because previous offences had taken place in a different [...]competition.
";;;;
However some of the 22,500 supporters at Wembley did boo;;;;
"However, we remain hugely concerned by the fact that racist posts continue to be aired on social media [...]platforms.
";;;;
Hungary crowd's abuse of England was 'preventable and predictable' ;;;;
"Hungary fans, just like last month in Budapest, expressed their opposition to England players taking the knee[...] before kick-off, with a banner displayed underlining their stance.
";;;;
"I certainly would think twice about how to advise another player placed in the [...]same situation.
";;;;
"I do feel social media platforms have a duty of care to its users who are victimised in this way.""
";;;;
I don't think a[...] lot of people understand the pressure that some people are under.;;;;
I feel when it is mentioned (as) racist abuse, I don't feel like it's taken as seriously as if [...]you would mention certain other topics.;;;;
I should not even say help, because it[...] should be a case where you see a situation happening and that should be allowed to happen;;;;
"If Fifa wanted [...]to solve this issue and wanted to do the right thing, we wouldn't have seen the events of last night because[...] they would have been serious and put the preventative measures in place.
";;;;
It then continued to circle overhead as the game began;;;;
"It was 22 weeks between the incident and the hearing during which I had minimal contact from the PFA, of [...]which I am a member, and no contact in the way of support from leading anti-racism bodies such as 'Kick It [...]Out' and 'Show Racism The Red Card'. Some support or guidance would have been very welcome.
";;;;
"It's never gonna stop!!""
";;;;
Italian authorities have long been criticised by anti-racism campaigners for not doing enough to tackle the [...]problem ;;;;
Kamara was jeered by the home crowd ;;;;
Kick It Out chief Burnett said what had happened was a governance failure on the part of football's [...]authorities and put players at unnecessary risk. ;;;;
"Kick It Out chief executive Tony Burnett said the abuse was ""preventable and predictable"" and criticised Fifa[...] and Uefa over the failure to ensure that a stadium ban issued by Uefa in July";;;;
"Knowing what occurred in [...]the game that day, it has been difficult to watch Kiko Casilla continue to play for such a lengthy period as [...]if nothing had happened.
";;;;
"Leko accuses PFA of lack of support over racist abuse
";;;;
"Mario Balotelli could be sued by local government in Verona after reporting racist abuse;";;;;
Millwall fans also booed players taking the knee;;;;
"No action taken over 'White Lives Matter' plane stunt
";;;;
Ole Gunnar Solskjaer has called for social media platforms to be held accountable;;;;
"On Tuesday, the Gazzetta dello Sport published a motion sent to the Verona council by four councillors [...]proposing that ""the mayor and the legal offices of the municipality should take legal action against the [...]footballer and all those who attack Verona by unjustly defaming it.""
";;;;
POLICE are not taking action;;;;
"People hiding behind false sites and posting obscene messages, in the world we live in today and the[...] technology we have today, is simply not good enough.""
";;;;
"Raheem Sterling feels racist abuse continues to not be taken as seriously as other social topics.
";;;;
"Reiterating that the banner had entirely ""missed the point"" of what the Premier League's support of Black [...]Lives Matter was trying to achieve,";;;;
"Republic of Ireland boss Stephen Kenny and striker Adam Idah have condemned the spectators who booed their [...]team as they took a knee in Hungary
";;;;
Section of England fans defy pleas not to boo players ;;;;
"Sky Sports every day says, 'We are all aiming to kick it out'. But things need to be put onto [...]social media when any footballer suffers abuse - that's homophobic, racist, whatever.
";;;;
Social media companies have been heavily criticised for their lack of action when it [...]comes to dealing with racist and abusive trolls. ;;;;
"Solskjaer welcomed stricter punishments and regulation. ""I think the social media platforms need to be looked[...] at,"" he said.
";;;;
Some England fans booed the players' anti-racism gesture of taking a knee;;;;
Southgate has been quick to point out that there are issues to tackle on the racism front closer to home;;;;
"Sparta Prague have released a statement praising the young fans who booed Rangers midfielder Glen Kamara for [...]creating a ""wonderful and unique"" atmosphere during their Europa League match on Thursday.
";;;;
"Sparta Prague praise 'wonderful' atmosphere despite young fans' booing of Rangers' Glen Kamara
";;;;
Stephen Kenny condemns fans who booed Republic players for taking the knee;;;;
"The Professional Footballers' Association described it as ""a sad indictment of the lack of understanding and [...]empathy for the players' fight against racism and discrimination"".
";;;;
"The Turkish president Tayyip Erdogan said on Wednesday that the racist incident during the Champions League [...]game between Paris Saint-Germain and Istanbul Basaksehir was a fresh expression of racist trends in France.
";;;;
"The Turkish president Tayyip Erdogan said yesterday that the alleged racist incident during the Champions [...]League game between Paris Saint-Germain and Istanbul Basaksehir on Tuesday was a fresh expression of racist [...]trends in France.
";;;;
The aircraft was seen above the stadium just minutes after all players and match officials took a knee in [...]solidarity with the Black Lives Matter movement.;;;;
The incident came on the same night as Cambridge United manager Mark Bonner condemned the club's fans for [...]doing similar;;;;
The incident comes days after some fans at Millwall 's English Championship match against Derby County booed [...]the players when they took a knee;;;;
"The incident has raised the prospect of social media companies facing stricter government regulations, with [...]reports on Friday suggesting that the likes of Twitter and Facebook could be made legally responsible for [...]racist abuse posted on their platforms.
";;;;
The incident in Hungary came after some England fans booed their own team as they took a knee;;;;
The incident took place shortly after all the players had taken the knee at kick off ;;;;
"The insults against Lukaku were judged by the tribunal to be too limited in terms of ""real perception"" for it[...] to take action.
";;;;
"The plane circled over the stadium after players from both sides had taken a knee in support of the Black [...]Lives Matter movement before kick-off.
";;;;
The referee should have dealt with the situation properly but[...] didn't. ;;;;
"The same person then suggests they will ""boo very loudly"" if Scunthorpe players take a knee when they [...]return to action ";;;;
Tony Burnett said the governing bodies of world and European football should have ensured that a UEFA [...]sanction issued against Hungary in July;;;;
"Troy Townsend, head of development at anti-racism charity Kick It Out, feels the latest incident ""makes a [...]mockery"" of Instagram's new ""tougher"" stance.
";;;;
Turkish president Tayyip Erdogan accuses France of fuelling racism ;;;;
"Uefa take no action after investigating alleged racist abuse
";;;;
Uefa will take no action after investigating claims Manchester United forward Anthony Elanga was racially [...]abused;;;;
"Watford captain Troy Deeney questioned why social media companies are not doing more to protect [...]people from such racism, given that anyone can sign up for an account without any form of identification.
";;;;
"We don't [...]support our players like
[...]Lord Mayor of Newcastle Habib Rahman we should. When they need us to come and get behind them, we see these [...]bigoted racists coming out instead.
";;;;
We keep talking about it every single week and it's not acceptable. ;;;;
"West Bromwich Albion'sJonathan Leko has accused the Professional Footballers' Association and 'leading [...]anti-racism bodies' of failing to support him after he was racially abused.
";;;;
While the England squad have seen the gesture booed by a minority of supporters of late,;;;;
a loud series of [...]horns and booing noises was heard from a group gathered outside the ground.;;;;
"a number of [...]fans boing the players' antiracism gesture before kick-off.
";;;;
a tiny [...]minority should choose to boo when players took the knee before the start of the game;;;;
after booing was heard when players took a knee;;;;
"after players are booed while taking a knee
";;;;
after players were booed for taking a knee in those December 5[...] fixtures;;;;
"after the West Brom [...]forward accused them of failing to support him during his racism case against Leeds United goalkeeper Kiko [...]Casilla.
";;;;
"as he [...]accused the media of fuelling ""racism and aggressive behaviour"".
";;;;
as long as the Romanian official remained involved[...] in the game;;;;
"as proof that there are similar problems at home.
";;;;
"believing that the orders have been under-utilised in [...]the past.
";;;;
booing was heard when players took a knee before kick-off ;;;;
"but the UAF confirmed a one-match ban[...] and a conditional two-match suspension on Thursday.
";;;;
"but the football authorities were [...]criticised over the failure to carry over a Uefa stadium ban imposed in July for racist chanting and [...]homophobic banners into the World Cup qualifiers, which are overseen by Fifa.
";;;;
"but the gesture was not well received by many among the[...] crowd.
";;;;
came despite pleas from the team to respect the [...]anti-racism gesture. ;;;;
"condemned social media companies Thursday for doing too little to block ""hateful and [...]hurtful"" messages on their platforms.
";;;;
"has called on England fans to ""respect the wishes"" of the decision of the players ";;;;
have been targeted by their own supporters;;;;
"he believed Coltescu had been ""let down"" by the authorities' failure to equip [...]officials with the awareness to avoid potential language or cultural issues.
";;;;
"how can people[...] be able to set up anonymous social media accounts?
";;;;
"if you boo the act of taking the knee, you are opposed to the fight [...]against racial www.discrimination.No ifs, no buts, no maybes, no what-abouts.
";;;;
"is a sad reality that your [...]powerful platforms are not doing enough to stop these messages,""";;;;
"it is still happening and for it to be by your [...]own fans as well, it is not nice.""
";;;;
"oppose anything that may appear to undermine or challenge[...] such a positive message.""
";;;;
racially abusing one of his own team's players;;;;
"said [...]the response from platforms in combating such abuse was ""simply not good enough"".
";;;;
sections of the crowd booed England's players before kick-off as they performed the [...]peaceful gesture of protest against racial discrimination;;;;
social media platforms need to take greater responsibility and accountability for [...]the actions of their users and the content that is published on their platforms;;;;
supporters who booed players taking a knee at Tuesday's Sky Bet League Two clash ;;;;
the jeers that met England's players taking the knee before kick-off in the [...]now-familiar stance against racism and discrimination were deafening.;;;;
"the travelling supporters booing as England players [...]took the knee before kick-off.
";;;;
"was ""unlikely to help a mature [...]discussion of the serious issue facing the game and wider society"".
";;;;
when multiple Cambridge [...]fans booed the players' show of solidarity ;;;;
"while there were more such incidents in League Two on Tuesday evening.
";;;;
"who are clearly neglecting their responsibility to cut out these forms of discrimination and [...]racist remarks.
";;;;
"who said it would be dealt with after the game[...] and that both players should continue.
";;;;
who saw his offer of a handshake before a match the following February refused by Suarez;;;;
"with players also pelted with cups and booed as they took the knee in an anti-racism gesture before [...]kick-off.
";;;;
"with social media providing an easy method for online trolls to send racist messages to others from [...]anonymous accounts.
";;;;
"with the travelling fans booing as England players took the [...]knee before kick-off.
";;;;
"""Obviously, it's disappointing to see the fans and the whole stadium booing us taking the knee.";;;;
"I've [...]lived in Portsmouth most my life and never have been as disappointed as I am now with this city and the [...]people that represent our club.""";;;;
It's disappointing and it doesn't reflect well on Hungary,;;;;
condemned the spectators who booed their [...]team;;;;
where griezmann added his reaction to his out at the[...] clear lack of respect shown to the 17-year-old Spain international.;;;;
"oppose anything that may appear to undermine or challenge[...] such a positive message.""";;;;
Deafening jeers welcomed England players taking the knee before kick-off;;;;
England fans boo taking of the knee;;;;