{
    "version": 3,
    "cmakeMinimumRequired": {
        "major": 3,
        "minor": 20,
        "patch": 0
    },
    "configurePresets": [
        {
            "name": "conf-common",
            "description": "General settings that apply to all configurations",
            "hidden": true,
            "generator": "Ninja Multi-Config",
            "binaryDir": "${sourceDir}/out/build/${presetName}",
            "installDir": "${sourceDir}/out/install/${presetName}"
        },
        {
            "name": "conf-windows-common",
            "description": "Windows settings for MSBuild toolchain that apply to msvc and clang",
            "hidden": true,
            "inherits": "conf-common",
            "condition": {
                "type": "equals",
                "lhs": "${hostSystemName}",
                "rhs": "Windows"
            },
            "architecture": {
                "value": "x64",
                "strategy": "external"
            },
            "toolset": {
                "value": "host=x64",
                "strategy": "external"
            }
        },
        {
            "name": "conf-msvc",
            "description": "Configuration MSVC compiler",
            "hidden": true,
            "cacheVariables": {
                "CMAKE_C_COMPILER": "cl",
                "CMAKE_CXX_COMPILER": "cl"
            }
        },
        {
            "name": "conf-clang",
            "description": "Configuration clang-cl compiler",
            "hidden": true,
            "cacheVariables": {
                "CMAKE_C_COMPILER": "clang-cl",
                "CMAKE_CXX_COMPILER": "clang-cl"
            }
        },
        {
            "name": "conf-vsbuild",
            "description": "Configuration using MSBuild/VS Project as generator",
            "hidden": true,
            "generator": "Visual Studio 16 2019"
        },
        {
            "name": "conf-dev-mode",
            "description": "Configuration with developer mode and testing",
            "hidden": true,
            "cacheVariables": {
                "DEVELOPER_MODE": "TRUE",
                "DOXYGEN_ADD_DEV_DOC": "TRUE"
            }
        },
        {
            "name": "conf-full",
            "description": "Settings for full Utility Lib build",
            "hidden": true,
            "cacheVariables": {
            }
        },
        {
            "name": "full-win-ninja-msvc",
            "description": "Configuration using MSBuild/VS Project as generator",
            "inherits": [
                "conf-windows-common",
                "conf-msvc",
                "conf-full"
            ]
        },
        {
            "name": "full-win-ninja-msvc-dev",
            "description": "Configuration using MSBuild/VS Project as generator",
            "inherits": [
                "conf-windows-common",
                "conf-msvc",
                "conf-full",
                "conf-dev-mode"
            ]
        },
        {
            "name": "full-win-vs-msvc",
            "description": "Configuration using MSBuild/VS Project as generator",
            "inherits": [
                "conf-vsbuild",
                "conf-windows-common",
                "conf-msvc",
                "conf-full"
            ]
        },
        {
            "name": "full-win-vs-msvc-dev",
            "description": "Configuration using MSBuild/VS Project as generator",
            "inherits": [
                "conf-vsbuild",
                "conf-windows-common",
                "conf-msvc",
                "conf-full",
                "conf-dev-mode"
            ]
        }
    ],
    "buildPresets": [
        {
            "name": "full-release-ninja",
            "description": "Release build type",
            "configuration": "Release",
            "configurePreset": "full-win-ninja-msvc"
        },
        {
            "name": "full-release-ninja-dev",
            "description": "Release build type with developer mode",
            "configuration": "RelWithDebInfo",
            "configurePreset": "full-win-ninja-msvc-dev"
        },
        {
            "name": "full-debug-ninja-dev",
            "description": "Debug build type with developer mode",
            "configuration": "Debug",
            "configurePreset": "full-win-ninja-msvc-dev"
        },
        {
            "name": "full-release-vs",
            "description": "Release build type",
            "configuration": "Release",
            "configurePreset": "full-win-vs-msvc"
        },
        {
            "name": "full-release-vs-dev",
            "description": "Release build type with developer mode",
            "configuration": "Release",
            "configurePreset": "full-win-vs-msvc-dev"
        },
        {
            "name": "full-debug-vs-dev",
            "description": "Debug build type with developer mode",
            "configuration": "Debug",
            "configurePreset": "full-win-vs-msvc-dev"
        }
    ]
}