<?xml version="1.0" encoding="UTF-8" standalone="no"?>
<!-- Created with Inkscape (http://www.inkscape.org/) -->

<svg
   xmlns:dc="http://purl.org/dc/elements/1.1/"
   xmlns:cc="http://creativecommons.org/ns#"
   xmlns:rdf="http://www.w3.org/1999/02/22-rdf-syntax-ns#"
   xmlns:svg="http://www.w3.org/2000/svg"
   xmlns="http://www.w3.org/2000/svg"
   xmlns:sodipodi="http://sodipodi.sourceforge.net/DTD/sodipodi-0.dtd"
   xmlns:inkscape="http://www.inkscape.org/namespaces/inkscape"
   width="22.604731mm"
   height="10.925821mm"
   viewBox="0 0 22.604731 10.925821"
   version="1.1"
   id="svg4547"
   inkscape:version="0.92.5 (2060ec1f9f, 2020-04-08)"
   sodipodi:docname="ihta.svg">
  <defs
     id="defs4541" />
  <sodipodi:namedview
     id="base"
     pagecolor="#ffffff"
     bordercolor="#666666"
     borderopacity="1.0"
     inkscape:pageopacity="0.0"
     inkscape:pageshadow="2"
     inkscape:zoom="3.959798"
     inkscape:cx="97.959219"
     inkscape:cy="-6.0870942"
     inkscape:document-units="mm"
     inkscape:current-layer="layer1"
     showgrid="false"
     fit-margin-top="0"
     fit-margin-left="0"
     fit-margin-right="0"
     fit-margin-bottom="0"
     inkscape:window-width="1920"
     inkscape:window-height="1001"
     inkscape:window-x="-9"
     inkscape:window-y="-9"
     inkscape:window-maximized="1" />
  <metadata
     id="metadata4544">
    <rdf:RDF>
      <cc:Work
         rdf:about="">
        <dc:format>image/svg+xml</dc:format>
        <dc:type
           rdf:resource="http://purl.org/dc/dcmitype/StillImage" />
        <dc:title></dc:title>
      </cc:Work>
    </rdf:RDF>
  </metadata>
  <g
     inkscape:label="Ebene 1"
     inkscape:groupmode="layer"
     id="layer1"
     transform="translate(348.45738,7.0641011)">
    <path
       style="fill:#00549f;fill-opacity:1;stroke-width:0.08466666"
       d="m -348.45738,-1.5992804 v -5.461 h 1.22767 1.22767 v 5.461 5.4610004 h -1.22767 -1.22767 z m 3.21734,0 v -5.461 h 1.27 1.27 v 1.9896666 1.9896667 h 1.016 1.016 v -1.9896667 -1.9896666 h 4.52966 4.52967 v 1.0583333 1.0583333 h -1.143 -1.143 l 0.005,3.6195 0.005,3.6195 0.1671,-0.3386666 c 0.0919,-0.1862667 1.0743,-2.28176668 2.18309,-4.6566667 l 2.01599,-4.318 1.53699,-0.023077 1.53699,-0.023077 5.3e-4,0.2770767 c 2.5e-4,0.1523923 0.13324,2.5821267 0.29551,5.39941 0.16227,2.8172834 0.29541,5.1509083 0.29586,5.1858333 5.3e-4,0.03492 -0.58973,0.0635 -1.31151,0.0635 h -1.31233 V 2.7587275 1.6557367 l -1.20396,0.02349 -1.20395,0.023492 -0.45704,1.0795 -0.45704,1.0795003 h -2.31836 -2.31834 V -0.54094708 -4.9436138 h -0.84667 -0.84666 V -0.54094708 3.86172 h -1.27 -1.27 V 1.5333862 -0.79494708 h -1.016 -1.016 V 1.5333862 3.86172 h -1.27 -1.27 v -5.4610004 z m 16.67675,-0.5715 c -0.002,-0.9331563 -0.0332,-1.5755467 -0.0742,-1.5028334 -0.10682,0.1895121 -1.27793,3.00698912 -1.27793,3.07447272 0,0.032007 0.3048,0.058194 0.67734,0.058194 h 0.67733 l -0.003,-1.62983332 z"
       id="path4530"
       inkscape:connector-curvature="0"
       sodipodi:nodetypes="cccccccccccccccccccccccccccssccccscscccccccccccccccccccccccccccccssccc" />
  </g>
</svg>
