9.018999999999999773e+01
9.232999999999999829e+01
9.304999999999999716e+01
9.376999999999999602e+01
9.343000000000000682e+01
9.378000000000000114e+01
9.348000000000000398e+01
9.385999999999999943e+01
9.414000000000000057e+01
9.442000000000000171e+01
9.423000000000000398e+01
9.393000000000000682e+01
9.406000000000000227e+01
9.431000000000000227e+01
9.423999999999999488e+01
9.460999999999999943e+01
9.509000000000000341e+01
9.501000000000000512e+01
9.518999999999999773e+01
9.531999999999999318e+01
9.539000000000000057e+01
9.545000000000000284e+01
9.556000000000000227e+01
9.545999999999999375e+01
9.551999999999999602e+01
9.568999999999999773e+01
9.565000000000000568e+01
9.559000000000000341e+01
9.576999999999999602e+01
9.562000000000000455e+01
9.546999999999999886e+01
9.592000000000000171e+01
9.576999999999999602e+01
9.590000000000000568e+01
9.560999999999999943e+01
9.573000000000000398e+01
9.565999999999999659e+01
9.559999999999999432e+01
9.568000000000000682e+01
9.579000000000000625e+01
9.554999999999999716e+01
9.554000000000000625e+01
9.593999999999999773e+01
9.543000000000000682e+01
9.557999999999999829e+01
9.575000000000000000e+01
9.554999999999999716e+01
9.598000000000000398e+01
9.581000000000000227e+01
9.585999999999999943e+01
