9.677774442109476638e+01
9.744335271706437140e+01
9.795447708813797760e+01
9.800661123910647632e+01
9.807538091419407067e+01
9.809657383289922450e+01
9.839131309068972087e+01
9.835126168694078785e+01
9.837447320891028824e+01
9.845998993457473603e+01
9.839098954143202036e+01
9.826183060383803536e+01
9.836263184329482101e+01
9.828296013655989327e+01
9.838190954773868668e+01
9.842995169082125528e+01
9.845054834490390760e+01
9.847113256889961974e+01
9.850040257648953457e+01
9.843074137410722813e+01
9.843058350100604059e+01
9.847036328871892863e+01
9.847036328871892863e+01
9.846060971928766037e+01
9.846091942460516577e+01
9.845086007443919129e+01
9.844048697052016905e+01
9.843042559613643050e+01
9.843026765948883394e+01
9.844033004628697370e+01
9.843026765948883394e+01
9.844033004628697370e+01
9.844033004628697370e+01
9.843042559613643050e+01
9.842036422175269195e+01
9.841030284736895339e+01
9.842020527269067998e+01
9.843026765948883394e+01
9.843010969105364438e+01
9.842020527269067998e+01
9.840024147298521484e+01
9.842020527269067998e+01
9.841046277665995490e+01
9.840982286634461218e+01
9.842004629163731977e+01
9.840982286634461218e+01
9.840982286634461218e+01
9.840982286634461218e+01
9.840024147298521484e+01
9.841014288589254022e+01
