{
  "example.com/facts/fact1": "Lorem dolor sit amet, consetetur sadipscing elitr, sed diam nonumy eirmod tempor invidunt ut labore et dolore magna aliquyam erat, sed diam voluptua.\nAt vero eos et accusam et justo duo dolores et ea rebum.\nStet clita kasd gubergren, no sea takimata sanctus est Lorem ipsum dolor sit amet.\nLorem ipsum dolor sit amet, consetetur sadipscing elitr, sed diam nonumy eirmod tempor invidunt ut labore et dolore magna aliquyam erat, sed diam voluptua.\nAt vero eos et accusam et justo duo dolores et ea rebum.\nStet clita kasd gubergren, no sea takimata sanctus est Lorem ipsum dolor sit amet.\nLorem ipsum dolor sit amet, consetetur sadipscing elitr, sed diam nonumy eirmod tempor invidunt ut labore et dolore magna aliquyam erat, sed diam voluptua.\nAt vero eos et accusam et justo duo dolores et ea rebum.\nStet clita kasd gubergren, no sea takimata sanctus est Lorem ipsum dolor sit amet.",
  "example.com/facts/fact2": "Duis vel eum iriure dolor in hendrerit in vulputate velit esse molestie consequat, vel illum dolore eu feugiat nulla facilisis at vero eros et accumsan et iusto odio dignissim qui blandit praesent luptatum zzril delenit augue duis dolore te feugait nulla facilisi.\nLorem ipsum dolor sit amet, consectetuer adipiscing elit, sed diam nonummy nibh euismod tincidunt ut laoreet dolore magna aliquam erat volutpat.\n",
  "example.com/facts/fact3": "Ut enim ad minim veniam, quis nostrud exerci tation ullamcorper suscipit lobortis nisl ut aliquip ex ea commodo consequat.\nDuis autem vel eum iriure dolor in hendrerit in vulputate velit esse molestie consequat, vel illum dolore eu feugiat nulla facilisis at vero eros et accumsan et iusto odio dignissim qui blandit praesent luptatum zzril delenit augue duis dolore te feugait nulla facilisi.\n",
  "example.com/facts/fact4": "Nam tempor cum soluta nobis eleifend option congue nihil imperdiet doming id quod mazim placerat facer possim assum.\nLorem ipsum dolor sit amet, consectetuer adipiscing elit, sed diam nonummy nibh euismod tincidunt ut laoreet dolore magna aliquam erat volutpat.\nUt wisi enim ad minim veniam, quis nostrud exerci tation ullamcorper suscipit lobortis nisl ut aliquip ex ea commodo consequat.\n"
}