{
  "$schema": "http://json-schema.org/draft-07/schema#",
  "type": "object",
  "properties": {
    "messageType": {
      "type": "string",
      "pattern": "ReceiverContract"
    },
    "contract": {
      "type": "object"
    },
    "contractIRI": {
      "type": "string"
    },
    "stateKey": {
      "type": "string"
    }
  },
  "required": [
    "messageType",
    "contract"
  ]
}