{
  "shell_port": 38917,
  "iopub_port": 44817,
  "stdin_port": 42321,
  "control_port": 38665,
  "hb_port": 44045,
  "ip": "127.0.0.1",
  "key": "d822b308-3a210fff780bee127d9cffcb",
  "transport": "tcp",
  "signature_scheme": "hmac-sha256",
  "kernel_name": ""
}