{
    "submeshPrinting": [{
      "submeshId": 0,
      "dripHeight": 1,
      "codePreDrip": [
        "if($run == 0)",
        "  $pName = appro($pName,tref)",
        "endIf"
      ],
      "codePostDrip": [],
      "thickness": 0.1,
      "thicknessPerRun": 0.1,
      "points": {
          "distance": 1.5,
          "pattern": "topDown"
      }
    }],
    "reusePrinting": false
}
