\relax 
\providecommand\hyper@newdestlabel[2]{}
\providecommand\HyperFirstAtBeginDocument{\AtBeginDocument}
\HyperFirstAtBeginDocument{\ifx\hyper@anchor\@undefined
\global\let\oldcontentsline\contentsline
\gdef\contentsline#1#2#3#4{\oldcontentsline{#1}{#2}{#3}}
\global\let\oldnewlabel\newlabel
\gdef\newlabel#1#2{\newlabelxx{#1}#2}
\gdef\newlabelxx#1#2#3#4#5#6{\oldnewlabel{#1}{{#2}{#3}}}
\AtEndDocument{\ifx\hyper@anchor\@undefined
\let\contentsline\oldcontentsline
\let\newlabel\oldnewlabel
\fi}
\fi}
\global\let\hyper@last\relax 
\gdef\HyperFirstAtBeginDocument#1{#1}
\providecommand\HyField@AuxAddToFields[1]{}
\providecommand\HyField@AuxAddToCoFields[2]{}
\@writefile{nav}{\headcommand {\slideentry {0}{0}{1}{1/1}{}{0}}}
\@writefile{nav}{\headcommand {\beamer@framepages {1}{1}}}
\@writefile{toc}{\beamer@sectionintoc {1}{Introduction}{2}{0}{1}}
\@writefile{nav}{\headcommand {\beamer@sectionpages {1}{1}}}
\@writefile{nav}{\headcommand {\beamer@subsectionpages {1}{1}}}
\@writefile{nav}{\headcommand {\sectionentry {1}{Introduction}{2}{Introduction}{0}}}
\@writefile{nav}{\headcommand {\slideentry {1}{0}{1}{2/9}{}{0}}}
\@writefile{nav}{\headcommand {\beamer@framepages {2}{9}}}
\citation{cardiac1}
\citation{cardiac1}
\providecommand*\caption@xref[2]{\@setref\relax\@undefined{#1}}
\newlabel{fig:dib}{{1}{10}{All steps for patient specific prints~\cite {cardiac1}\relax }{Doc-Start}{}}
\@writefile{snm}{\beamer@slide {fig:dib}{10}}
\citation{cardiac1}
\citation{cardiac1}
\@writefile{nav}{\headcommand {\slideentry {1}{0}{2}{10/11}{}{0}}}
\@writefile{nav}{\headcommand {\beamer@framepages {10}{11}}}
\citation{eth}
\citation{eth}
\citation{eth}
\citation{eth}
\citation{eth}
\citation{eth}
\citation{eth}
\citation{eth}
\@writefile{nav}{\headcommand {\slideentry {1}{0}{3}{12/13}{}{0}}}
\@writefile{nav}{\headcommand {\beamer@framepages {12}{13}}}
\@writefile{nav}{\headcommand {\slideentry {1}{0}{4}{14/18}{}{0}}}
\@writefile{nav}{\headcommand {\beamer@framepages {14}{18}}}
\@writefile{toc}{\beamer@sectionintoc {2}{Requirements}{19}{0}{2}}
\@writefile{nav}{\headcommand {\beamer@sectionpages {2}{18}}}
\@writefile{nav}{\headcommand {\beamer@subsectionpages {2}{18}}}
\@writefile{nav}{\headcommand {\sectionentry {2}{Requirements}{19}{Requirements}{0}}}
\newlabel{fig:dib}{{4}{19}{Input and output of the software\relax }{Doc-Start}{}}
\@writefile{snm}{\beamer@slide {fig:dib}{19}}
\@writefile{nav}{\headcommand {\slideentry {2}{0}{1}{19/22}{}{0}}}
\@writefile{nav}{\headcommand {\beamer@framepages {19}{22}}}
\@writefile{toc}{\beamer@sectionintoc {3}{From Model to Code}{23}{0}{3}}
\@writefile{nav}{\headcommand {\beamer@sectionpages {19}{22}}}
\@writefile{nav}{\headcommand {\beamer@subsectionpages {19}{22}}}
\@writefile{nav}{\headcommand {\sectionentry {3}{From Model to Code}{23}{From Model to Code}{0}}}
\@writefile{toc}{\beamer@subsectionintoc {3}{1}{Subdividing}{23}{0}{3}}
\@writefile{nav}{\headcommand {\beamer@subsectionpages {23}{22}}}
\@writefile{nav}{\headcommand {\beamer@subsectionentry {0}{3}{1}{23}{Subdividing}}}
\@writefile{nav}{\headcommand {\slideentry {3}{1}{1}{23/25}{Subdividing}{0}}}
\@writefile{nav}{\headcommand {\beamer@framepages {23}{25}}}
\newlabel{fig:dib}{{7}{26}{Adjacency graph (red \& blue) of triangle mesh (black)\relax }{Doc-Start}{}}
\@writefile{snm}{\beamer@slide {fig:dib}{26}}
\@writefile{nav}{\headcommand {\slideentry {3}{1}{2}{26/28}{Subdividing}{0}}}
\@writefile{nav}{\headcommand {\beamer@framepages {26}{28}}}
\@writefile{toc}{\beamer@subsectionintoc {3}{2}{Approximation}{29}{0}{3}}
\@writefile{nav}{\headcommand {\beamer@subsectionpages {23}{28}}}
\@writefile{nav}{\headcommand {\beamer@subsectionentry {0}{3}{2}{29}{Approximation}}}
\newlabel{fig:step2}{{\caption@xref {fig:step2}{ on input line 418}}{29}{Approximation}{Doc-Start}{}}
\@writefile{snm}{\beamer@slide {fig:step2}{29}}
\@writefile{nav}{\headcommand {\slideentry {3}{2}{1}{29/30}{Approximation}{0}}}
\@writefile{nav}{\headcommand {\beamer@framepages {29}{30}}}
\@writefile{toc}{\beamer@subsectionintoc {3}{3}{Point Generation}{31}{0}{3}}
\@writefile{nav}{\headcommand {\beamer@subsectionpages {29}{30}}}
\@writefile{nav}{\headcommand {\beamer@subsectionentry {0}{3}{3}{31}{Point Generation}}}
\newlabel{fig:dib}{{9}{31}{Generated points for leaflet\relax }{Doc-Start}{}}
\@writefile{snm}{\beamer@slide {fig:dib}{31}}
\@writefile{nav}{\headcommand {\slideentry {3}{3}{1}{31/33}{Point Generation}{0}}}
\@writefile{nav}{\headcommand {\beamer@framepages {31}{33}}}
\@writefile{toc}{\beamer@subsectionintoc {3}{4}{Raytracing}{34}{0}{3}}
\@writefile{nav}{\headcommand {\beamer@subsectionpages {31}{33}}}
\@writefile{nav}{\headcommand {\beamer@subsectionentry {0}{3}{4}{34}{Raytracing}}}
\newlabel{fig:step4}{{\caption@xref {fig:step4}{ on input line 476}}{34}{Raytracing}{Doc-Start}{}}
\@writefile{snm}{\beamer@slide {fig:step4}{34}}
\@writefile{nav}{\headcommand {\slideentry {3}{4}{1}{34/36}{Raytracing}{0}}}
\@writefile{nav}{\headcommand {\beamer@framepages {34}{36}}}
\@writefile{toc}{\beamer@subsectionintoc {3}{5}{Code Generation}{37}{0}{3}}
\@writefile{nav}{\headcommand {\beamer@subsectionpages {34}{36}}}
\@writefile{nav}{\headcommand {\beamer@subsectionentry {0}{3}{5}{37}{Code Generation}}}
\newlabel{fig:dib}{{11}{37}{Generated points and normals from model\relax }{Doc-Start}{}}
\@writefile{snm}{\beamer@slide {fig:dib}{37}}
\@writefile{nav}{\headcommand {\slideentry {3}{5}{1}{37/39}{Code Generation}{0}}}
\@writefile{nav}{\headcommand {\beamer@framepages {37}{39}}}
\@writefile{nav}{\headcommand {\slideentry {3}{5}{2}{40/40}{Code Generation}{0}}}
\@writefile{nav}{\headcommand {\beamer@framepages {40}{40}}}
\@writefile{toc}{\beamer@sectionintoc {4}{Validation}{41}{0}{4}}
\@writefile{nav}{\headcommand {\beamer@sectionpages {23}{40}}}
\@writefile{nav}{\headcommand {\beamer@subsectionpages {37}{40}}}
\@writefile{nav}{\headcommand {\sectionentry {4}{Validation}{41}{Validation}{0}}}
\newlabel{fig:step4}{{\caption@xref {fig:step4}{ on input line 557}}{41}{Validation}{Doc-Start}{}}
\@writefile{snm}{\beamer@slide {fig:step4}{41}}
\@writefile{nav}{\headcommand {\slideentry {4}{0}{1}{41/42}{}{0}}}
\@writefile{nav}{\headcommand {\beamer@framepages {41}{42}}}
\@writefile{nav}{\headcommand {\slideentry {4}{0}{2}{43/43}{}{0}}}
\@writefile{nav}{\headcommand {\beamer@framepages {43}{43}}}
\@writefile{toc}{\beamer@sectionintoc {5}{Conclusion}{44}{0}{5}}
\@writefile{nav}{\headcommand {\beamer@sectionpages {41}{43}}}
\@writefile{nav}{\headcommand {\beamer@subsectionpages {41}{43}}}
\@writefile{nav}{\headcommand {\sectionentry {5}{Conclusion}{44}{Conclusion}{0}}}
\@writefile{nav}{\headcommand {\slideentry {5}{0}{1}{44/47}{}{0}}}
\@writefile{nav}{\headcommand {\beamer@framepages {44}{47}}}
\bibstyle{abbrv}
\bibdata{references}
\bibcite{eth}{\hyperlink {beamerbibeth}{1}}
\bibcite{cardiac1}{\hyperlink {beamerbibcardiac1}{2}}
\@writefile{nav}{\headcommand {\slideentry {5}{0}{2}{48/48}{}{0}}}
\@writefile{nav}{\headcommand {\beamer@framepages {48}{48}}}
\@writefile{nav}{\headcommand {\beamer@partpages {1}{48}}}
\@writefile{nav}{\headcommand {\beamer@subsectionpages {44}{48}}}
\@writefile{nav}{\headcommand {\beamer@sectionpages {44}{48}}}
\@writefile{nav}{\headcommand {\beamer@documentpages {48}}}
\@writefile{nav}{\headcommand {\gdef \inserttotalframenumber {17}}}
