\relax 
\providecommand\hyper@newdestlabel[2]{}
\providecommand*\new@tpo@label[2]{}
\providecommand\HyperFirstAtBeginDocument{\AtBeginDocument}
\HyperFirstAtBeginDocument{\ifx\hyper@anchor\@undefined
\global\let\oldcontentsline\contentsline
\gdef\contentsline#1#2#3#4{\oldcontentsline{#1}{#2}{#3}}
\global\let\oldnewlabel\newlabel
\gdef\newlabel#1#2{\newlabelxx{#1}#2}
\gdef\newlabelxx#1#2#3#4#5#6{\oldnewlabel{#1}{{#2}{#3}}}
\AtEndDocument{\ifx\hyper@anchor\@undefined
\let\contentsline\oldcontentsline
\let\newlabel\oldnewlabel
\fi}
\fi}
\global\let\hyper@last\relax 
\gdef\HyperFirstAtBeginDocument#1{#1}
\providecommand\HyField@AuxAddToFields[1]{}
\providecommand\HyField@AuxAddToCoFields[2]{}
\citation{cardiac1}
\citation{cardiac1}
\citation{cardiac1}
\citation{cardiac1}
\citation{cardiac2}
\citation{cardiac2}
\citation{cardiac1}
\citation{cardiac1}
\citation{cardiac2}
\citation{poly}
\citation{eth}
\citation{eth}
\citation{eth}
\@writefile{toc}{\contentsline {section}{\numberline {1}Introduction}{1}{section.1}}
\citation{eth}
\citation{eth}
\@writefile{lof}{\contentsline {figure}{\numberline {1}{\ignorespaces All steps required to obtain a patient-specific 3D heart model, taken from\nobreakspace  {}\cite  {cardiac1}. Here CT images were used where the relevant parts are segmented from and combined to a 3D reconstruction. The digital model was adopted for the usage in flow loop before being printed as a final step.\relax }}{2}{figure.caption.1}}
\providecommand*\caption@xref[2]{\@setref\relax\@undefined{#1}}
\newlabel{fig:completeProcedure}{{1}{2}{All steps required to obtain a patient-specific 3D heart model, taken from~\cite {cardiac1}. Here CT images were used where the relevant parts are segmented from and combined to a 3D reconstruction. The digital model was adopted for the usage in flow loop before being printed as a final step.\relax }{figure.caption.1}{}}
\@writefile{lof}{\contentsline {figure}{\numberline {2}{\ignorespaces Individual heart valve printing procedure based on a combination of direct ink writing and substrate spraying taken from\nobreakspace  {}\cite  {eth}.\relax }}{3}{figure.caption.2}}
\newlabel{fig:eth}{{2}{3}{Individual heart valve printing procedure based on a combination of direct ink writing and substrate spraying taken from~\cite {eth}.\relax }{figure.caption.2}{}}
\@writefile{toc}{\contentsline {subsection}{\numberline {1.1}Preliminaries}{3}{subsection.1.1}}
\@writefile{toc}{\contentsline {subsubsection}{\numberline {1.1.1}Requirements}{3}{subsubsection.1.1.1}}
\newlabel{sec:requirements}{{1.1.1}{3}{Requirements}{subsubsection.1.1.1}{}}
\citation{tx60}
\citation{val3}
\citation{rotation}
\citation{ComGra}
\citation{stl}
\@writefile{toc}{\contentsline {subsubsection}{\numberline {1.1.2}Robot}{4}{subsubsection.1.1.2}}
\newlabel{sec:preRobot}{{1.1.2}{4}{Robot}{subsubsection.1.1.2}{}}
\@writefile{toc}{\contentsline {subsubsection}{\numberline {1.1.3}STL}{4}{subsubsection.1.1.3}}
\citation{point1}
\citation{ethpoint}
\citation{eth}
\@writefile{toc}{\contentsline {section}{\numberline {2}From the Model to the Val3 Code}{5}{section.2}}
\newlabel{sec:codeGen}{{2}{5}{From the Model to the Val3 Code}{section.2}{}}
\@writefile{lof}{\contentsline {figure}{\numberline {3}{\ignorespaces Illustration of the software's input and output \relax }}{5}{figure.caption.3}}
\newlabel{fig:pipelineStart}{{3}{5}{Illustration of the software's input and output \relax }{figure.caption.3}{}}
\@writefile{lof}{\contentsline {figure}{\numberline {4}{\ignorespaces Outline of the steps required to obtain the desired VAL3 code from the STL file\relax }}{6}{figure.caption.4}}
\newlabel{fig:pipeline}{{4}{6}{Outline of the steps required to obtain the desired VAL3 code from the STL file\relax }{figure.caption.4}{}}
\@writefile{toc}{\contentsline {subsection}{\numberline {2.1}Subdividing the Model}{7}{subsection.2.1}}
\@writefile{lof}{\contentsline {figure}{\numberline {5}{\ignorespaces Adjacency graph with nodes shown in blue and edges in red of a triangulation shown in black.\relax }}{7}{figure.caption.5}}
\newlabel{fig:triangleGraph}{{5}{7}{Adjacency graph with nodes shown in blue and edges in red of a triangulation shown in black.\relax }{figure.caption.5}{}}
\@writefile{lof}{\contentsline {figure}{\numberline {6}{\ignorespaces Desired result of a heart valve model subdivided into its subsurfaces shown by different colors.\relax }}{8}{figure.caption.6}}
\newlabel{fig:step1}{{6}{8}{Desired result of a heart valve model subdivided into its subsurfaces shown by different colors.\relax }{figure.caption.6}{}}
\@writefile{toc}{\contentsline {subsection}{\numberline {2.2}Approximation of the Subsurfaces}{8}{subsection.2.2}}
\@writefile{lof}{\contentsline {figure}{\numberline {7}{\ignorespaces 3D illustration of how a point on the symmetry axis is obtained by intersecting two lines in 2D for the case of a perfect cylinder mesh shown in gray. The cylinder forms a circle shown in black when projecting it onto the plane perpendicular to the symmetry vector. The red lines originate at some projected triangles and follow the direction of their normals.\relax }}{8}{figure.caption.7}}
\newlabel{fig:symPoint}{{7}{8}{3D illustration of how a point on the symmetry axis is obtained by intersecting two lines in 2D for the case of a perfect cylinder mesh shown in gray. The cylinder forms a circle shown in black when projecting it onto the plane perpendicular to the symmetry vector. The red lines originate at some projected triangles and follow the direction of their normals.\relax }{figure.caption.7}{}}
\citation{ComGra}
\citation{ComGra}
\@writefile{lof}{\contentsline {figure}{\numberline {8}{\ignorespaces Surface approximation illustrated in light gray of the different subsurfaces.\relax }}{10}{figure.caption.8}}
\newlabel{fig:step2}{{8}{10}{Surface approximation illustrated in light gray of the different subsurfaces.\relax }{figure.caption.8}{}}
\@writefile{toc}{\contentsline {subsection}{\numberline {2.3}Generating Points on the Projection Plane}{10}{subsection.2.3}}
\@writefile{lof}{\contentsline {figure}{\numberline {9}{\ignorespaces Convex hull shown in red of the projected triangle vertices of two subsurfaces from the heart vavle model shown in blue.\relax }}{10}{figure.caption.9}}
\newlabel{fig:convexHull}{{9}{10}{Convex hull shown in red of the projected triangle vertices of two subsurfaces from the heart vavle model shown in blue.\relax }{figure.caption.9}{}}
\citation{ComGra}
\citation{ComGra}
\@writefile{lof}{\contentsline {figure}{\numberline {10}{\ignorespaces Generated points on flat projection surface shown in blue and potentially intersection ones in green. They are determined from the red convex hull of the projected heart valve base.\relax }}{11}{figure.caption.10}}
\newlabel{fig:pointGeneration}{{10}{11}{Generated points on flat projection surface shown in blue and potentially intersection ones in green. They are determined from the red convex hull of the projected heart valve base.\relax }{figure.caption.10}{}}
\@writefile{toc}{\contentsline {subsection}{\numberline {2.4}Raytracing}{11}{subsection.2.4}}
\@writefile{lof}{\contentsline {figure}{\numberline {11}{\ignorespaces Illustration of the generated rays shown in red within the raytracing step for a flat and a cylindric surface shown in green. The approximating surface of the flat plate is omitted to get a clear illustration.\relax }}{12}{figure.caption.11}}
\newlabel{fig:step4}{{11}{12}{Illustration of the generated rays shown in red within the raytracing step for a flat and a cylindric surface shown in green. The approximating surface of the flat plate is omitted to get a clear illustration.\relax }{figure.caption.11}{}}
\@writefile{lof}{\contentsline {figure}{\numberline {12}{\ignorespaces Final result of the raytracing step for all subsurfaces of the heart valve. The red path illustrates how the red points with a blue normals are traversed. \relax }}{12}{figure.caption.12}}
\newlabel{fig:step4}{{12}{12}{Final result of the raytracing step for all subsurfaces of the heart valve. The red path illustrates how the red points with a blue normals are traversed. \relax }{figure.caption.12}{}}
\@writefile{toc}{\contentsline {subsection}{\numberline {2.5}Generating Val3 Code}{13}{subsection.2.5}}
\newlabel{sec:code}{{2.5}{13}{Generating Val3 Code}{subsection.2.5}{}}
\@writefile{lof}{\contentsline {figure}{\numberline {13}{\ignorespaces Generated image of the subdivided heart valve showing the submesh indices used to define individual printing patterns.\relax }}{13}{figure.caption.13}}
\newlabel{fig:valveFull}{{13}{13}{Generated image of the subdivided heart valve showing the submesh indices used to define individual printing patterns.\relax }{figure.caption.13}{}}
\@writefile{toc}{\contentsline {section}{\numberline {3}User Manual}{14}{section.3}}
\newlabel{sec:manual}{{3}{14}{User Manual}{section.3}{}}
\@writefile{toc}{\contentsline {subsection}{\numberline {3.1}Robot}{14}{subsection.3.1}}
\@writefile{toc}{\contentsline {subsection}{\numberline {3.2}System}{15}{subsection.3.2}}
\newlabel{sec:system}{{3.2}{15}{System}{subsection.3.2}{}}
\newlabel{list:config}{{1}{16}{Example of the config.json for the heart valve model}{lstlisting.1}{}}
\@writefile{lol}{\contentsline {lstlisting}{\numberline {1}Example of the config.json for the heart valve model}{16}{lstlisting.1}}
\newlabel{list:print}{{2}{16}{Example of the printing.json for the heart valve model}{lstlisting.2}{}}
\@writefile{lol}{\contentsline {lstlisting}{\numberline {2}Example of the printing.json for the heart valve model}{16}{lstlisting.2}}
\@writefile{toc}{\contentsline {section}{\numberline {4}Validation}{17}{section.4}}
\newlabel{sec:validate}{{4}{17}{Validation}{section.4}{}}
\@writefile{toc}{\contentsline {subsection}{\numberline {4.1}Software}{17}{subsection.4.1}}
\@writefile{lof}{\contentsline {figure}{\numberline {14}{\ignorespaces Testing path generation on a heart valve model. The subsurfaces are illustrated by different colors, paths and points are shown in red, and the normals in blue.\relax }}{18}{figure.caption.14}}
\newlabel{fig:valveTest}{{14}{18}{Testing path generation on a heart valve model. The subsurfaces are illustrated by different colors, paths and points are shown in red, and the normals in blue.\relax }{figure.caption.14}{}}
\@writefile{lof}{\contentsline {figure}{\numberline {15}{\ignorespaces Testing path generation on a cube model with cylindric top to have a combination of surface types. The subsurfaces are illustrated by different colors, paths and points are shown in red, and the normals in blue.\relax }}{18}{figure.caption.15}}
\newlabel{fig:cubeCylinderTest}{{15}{18}{Testing path generation on a cube model with cylindric top to have a combination of surface types. The subsurfaces are illustrated by different colors, paths and points are shown in red, and the normals in blue.\relax }{figure.caption.15}{}}
\@writefile{lof}{\contentsline {figure}{\numberline {16}{\ignorespaces Testing path generation on a cube model cylinder. The subsurfaces are illustrated by different colors, paths and points are shown in red, and the normals in blue.\relax }}{19}{figure.caption.16}}
\newlabel{fig:cylinderTest}{{16}{19}{Testing path generation on a cube model cylinder. The subsurfaces are illustrated by different colors, paths and points are shown in red, and the normals in blue.\relax }{figure.caption.16}{}}
\@writefile{toc}{\contentsline {subsection}{\numberline {4.2}Robot}{19}{subsection.4.2}}
\@writefile{toc}{\contentsline {section}{\numberline {5}Conclusion and Future Work}{19}{section.5}}
\bibstyle{abbrv}
\bibdata{references}
\bibcite{ethpoint}{1}
\@writefile{lof}{\contentsline {figure}{\numberline {17}{\ignorespaces Movement of the robot for the cylinder model illustrated by the cylindric container. The robot follows the axis of symmetry while aligning the normals of the model and traversing the generated points.\relax }}{20}{figure.caption.17}}
\newlabel{fig:cylinderRobot}{{17}{20}{Movement of the robot for the cylinder model illustrated by the cylindric container. The robot follows the axis of symmetry while aligning the normals of the model and traversing the generated points.\relax }{figure.caption.17}{}}
\@writefile{lof}{\contentsline {figure}{\numberline {18}{\ignorespaces Movement of the robot for a leaflet of the heart valve model. The robot follows the axis of symmetry of the leaflet while aligning the normals of the model and traversing the generated points.\relax }}{20}{figure.caption.18}}
\newlabel{fig:leafletRobot}{{18}{20}{Movement of the robot for a leaflet of the heart valve model. The robot follows the axis of symmetry of the leaflet while aligning the normals of the model and traversing the generated points.\relax }{figure.caption.18}{}}
\bibcite{point1}{2}
\bibcite{tx60}{3}
\bibcite{val3}{4}
\bibcite{poly}{5}
\bibcite{stl}{6}
\bibcite{ComGra}{7}
\bibcite{eth}{8}
\bibcite{cardiac2}{9}
\bibcite{rotation}{10}
\bibcite{cardiac1}{11}
