\beamer@sectionintoc {1}{Introduction}{2}{0}{1}
\beamer@sectionintoc {2}{Requirements}{19}{0}{2}
\beamer@sectionintoc {3}{From Model to Code}{23}{0}{3}
\beamer@subsectionintoc {3}{1}{Subdividing}{23}{0}{3}
\beamer@subsectionintoc {3}{2}{Approximation}{29}{0}{3}
\beamer@subsectionintoc {3}{3}{Point Generation}{31}{0}{3}
\beamer@subsectionintoc {3}{4}{Raytracing}{34}{0}{3}
\beamer@subsectionintoc {3}{5}{Code Generation}{37}{0}{3}
\beamer@sectionintoc {4}{Validation}{41}{0}{4}
\beamer@sectionintoc {5}{Conclusion}{44}{0}{5}
