^C:\USERS\ANWARI\SOURCE\REPOS\HODEX\HODEX\X64\RELEASE\HODEX.OBJ|C:\USERS\ANWARI\SOURCE\REPOS\HODEX\HODEX\X64\RELEASE\TINYXML2.OBJ
/OUT:"C:\USERS\ANWARI\SOURCE\REPOS\HODEX\X64\RELEASE\HODEX.EXE" /INCREMENTAL:NO /NOLOGO KERNEL32.LIB USER32.LIB GDI32.LIB WINSPOOL.LIB COMDLG32.LIB ADVAPI32.LIB SHELL32.LIB OLE32.LIB OLEAUT32.LIB UUID.LIB ODBC32.LIB ODBCCP32.LIB /MANIFEST /MANIFESTUAC:"level='asInvoker' uiAccess='false'" /manifest:embed /DEBUG /PDB:"C:\USERS\ANWARI\SOURCE\REPOS\HODEX\X64\RELEASE\HODEX.PDB" /MAP /MAPINFO:EXPORTS /SUBSYSTEM:CONSOLE /OPT:REF /OPT:ICF /LTCG:incremental /TLBID:1 /DYNAMICBASE /NXCOMPAT /IMPLIB:"C:\USERS\ANWARI\SOURCE\REPOS\HODEX\X64\RELEASE\HODEX.LIB" /MACHINE:X64 X64\RELEASE\HODEX.OBJX64\RELEASE\TINYXML2.OBJ
^E:\HODA\2.SECOND_TASK\000.HODEX_ALL_VERSION\HODEX\HODEX\X64\RELEASE\HODEX.OBJ|E:\HODA\2.SECOND_TASK\000.HODEX_ALL_VERSION\HODEX\HODEX\X64\RELEASE\TINYXML2.OBJ
/OUT:"E:\HODA\2.SECOND_TASK\000.HODEX_ALL_VERSION\HODEX\X64\RELEASE\HODEX.EXE" /INCREMENTAL:NO /NOLOGO KERNEL32.LIB USER32.LIB GDI32.LIB WINSPOOL.LIB COMDLG32.LIB ADVAPI32.LIB SHELL32.LIB OLE32.LIB OLEAUT32.LIB UUID.LIB ODBC32.LIB ODBCCP32.LIB /MANIFEST /MANIFESTUAC:"level='asInvoker' uiAccess='false'" /manifest:embed /DEBUG /PDB:"E:\HODA\2.SECOND_TASK\000.HODEX_ALL_VERSION\HODEX\X64\RELEASE\HODEX.PDB" /MAP /MAPINFO:EXPORTS /SUBSYSTEM:CONSOLE /OPT:REF /OPT:ICF /LTCG:incremental /TLBID:1 /DYNAMICBASE /NXCOMPAT /IMPLIB:"E:\HODA\2.SECOND_TASK\000.HODEX_ALL_VERSION\HODEX\X64\RELEASE\HODEX.LIB" /MACHINE:X64 X64\RELEASE\HODEX.OBJX64\RELEASE\TINYXML2.OBJ
