^\\SISYPHOS\BUNTRANSFER\AG_NOKHOSTIN\VON_HODA\HODA\2. SECOND TASK\000.GET_DIRECTION_ALL_VERSION\HODEX\HODEX\STDAFX.CPP
/c /ZI /nologo /W3 /WX- /diagnostics:classic /sdl /Od /Oy- /D WIN32 /D _DEBUG /D _CONSOLE /D _UNICODE /D UNICODE /Gm /EHsc /RTC1 /MDd /GS /fp:precise /Zc:wchar_t /Zc:forScope /Zc:inline /Yc"stdafx.h" /Fp"DEBUG\HODEX.PCH" /Fo"DEBUG\\" /Fd"DEBUG\VC141.PDB" /Gd /TP /analyze- \\SISYPHOS\BUNTRANSFER\AG_NOKHOSTIN\VON_HODA\HODA\2. SECOND TASK\000.GET_DIRECTION_ALL_VERSION\HODEX\HODEX\STDAFX.CPP
^\\SISYPHOS\BUNTRANSFER\AG_NOKHOSTIN\VON_HODA\HODA\2. SECOND TASK\000.GET_DIRECTION_ALL_VERSION\HODEX\HODEX\HODEX.CPP
/c /ZI /nologo /W3 /WX- /diagnostics:classic /sdl /Od /Oy- /D WIN32 /D _DEBUG /D _CONSOLE /D _UNICODE /D UNICODE /Gm /EHsc /RTC1 /MDd /GS /fp:precise /Zc:wchar_t /Zc:forScope /Zc:inline /Yu"stdafx.h" /Fp"DEBUG\HODEX.PCH" /Fo"DEBUG\\" /Fd"DEBUG\VC141.PDB" /Gd /TP /analyze- \\SISYPHOS\BUNTRANSFER\AG_NOKHOSTIN\VON_HODA\HODA\2. SECOND TASK\000.GET_DIRECTION_ALL_VERSION\HODEX\HODEX\HODEX.CPP
^\\SISYPHOS\BUNTRANSFER\AG_NOKHOSTIN\VON_HODA\HODA\2. SECOND TASK\000.GET_DIRECTION_ALL_VERSION\HODEX\HODEX\TINYXML2.CPP
/c /ZI /nologo /W3 /WX- /diagnostics:classic /sdl /Od /Oy- /D WIN32 /D _DEBUG /D _CONSOLE /D _UNICODE /D UNICODE /Gm /EHsc /RTC1 /MDd /GS /fp:precise /Zc:wchar_t /Zc:forScope /Zc:inline /Yu"stdafx.h" /Fp"DEBUG\HODEX.PCH" /Fo"DEBUG\\" /Fd"DEBUG\VC141.PDB" /Gd /TP /analyze- \\SISYPHOS\BUNTRANSFER\AG_NOKHOSTIN\VON_HODA\HODA\2. SECOND TASK\000.GET_DIRECTION_ALL_VERSION\HODEX\HODEX\TINYXML2.CPP
