^E:\HODA\2. SECOND TASK\000.HODEX_ALL_VERSION\HODEX\HODEX\X64\DEBUG\HODEX.OBJ|E:\HODA\2. SECOND TASK\000.HODEX_ALL_VERSION\HODEX\HODEX\X64\DEBUG\STDAFX.OBJ|E:\HODA\2. SECOND TASK\000.HODEX_ALL_VERSION\HODEX\HODEX\X64\DEBUG\TINYXML2.OBJ
E:\HODA\2. SECOND TASK\000.HODEX_ALL_VERSION\HODEX\X64\DEBUG\HODEX.ILK
E:\HODA\2. SECOND TASK\000.HODEX_ALL_VERSION\HODEX\X64\DEBUG\HODEX.EXE
E:\HODA\2. SECOND TASK\000.HODEX_ALL_VERSION\HODEX\X64\DEBUG\HODEX.PDB
