^E:\HODA\2. SECOND TASK\000.HODEX_ALL_VERSION\HODEX\HODEX\RELEASE\HODEX.OBJ|E:\HODA\2. SECOND TASK\000.HODEX_ALL_VERSION\HODEX\HODEX\RELEASE\STDAFX.OBJ|E:\HODA\2. SECOND TASK\000.HODEX_ALL_VERSION\HODEX\HODEX\RELEASE\TINYXML2.OBJ
E:\HODA\2. SECOND TASK\000.HODEX_ALL_VERSION\HODEX\RELEASE\HODEX.EXE
E:\HODA\2. SECOND TASK\000.HODEX_ALL_VERSION\HODEX\RELEASE\HODEX.PDB
^\\SISYPHOS\BUNTRANSFER\AG_NOKHOSTIN\VON_HODA\HODA\2. SECOND TASK\000.HODEX_ALL_VERSION\HODEX\HODEX\RELEASE\HODEX.OBJ|\\SISYPHOS\BUNTRANSFER\AG_NOKHOSTIN\VON_HODA\HODA\2. SECOND TASK\000.HODEX_ALL_VERSION\HODEX\HODEX\RELEASE\STDAFX.OBJ|\\SISYPHOS\BUNTRANSFER\AG_NOKHOSTIN\VON_HODA\HODA\2. SECOND TASK\000.HODEX_ALL_VERSION\HODEX\HODEX\RELEASE\TINYXML2.OBJ
\\SISYPHOS\BUNTRANSFER\AG_NOKHOSTIN\VON_HODA\HODA\2. SECOND TASK\000.HODEX_ALL_VERSION\HODEX\RELEASE\HODEX.EXE
\\SISYPHOS\BUNTRANSFER\AG_NOKHOSTIN\VON_HODA\HODA\2. SECOND TASK\000.HODEX_ALL_VERSION\HODEX\RELEASE\HODEX.PDB
