^C:\Users\Anwari\source\repos\HodEx\HodEx\HodEx.vcxproj
C:\Users\Anwari\source\repos\HodEx\x64\Release\HodEx.ipdb
C:\Users\Anwari\source\repos\HodEx\x64\Release\HodEx.iobj
^E:\Hoda\2.Second_Task\000.HodEx_all_version\HodEx\HodEx\HodEx.vcxproj
E:\Hoda\2.Second_Task\000.HodEx_all_version\HodEx\x64\Release\HodEx.ipdb
E:\Hoda\2.Second_Task\000.HodEx_all_version\HodEx\x64\Release\HodEx.iobj
