<---------------------
Date 26/2/2019
Time  14:24:47:142
Executing Time : 8.165s
--------------------->

<---------------------
Date 26/2/2019
Time  14:25:29:180
Executing Time : 8.226s
--------------------->

<---------------------
Date 26/2/2019
Time  14:28:53:735
Executing Time : 8.226s
--------------------->

<---------------------
Date 26/2/2019
Time  14:32:59:641
Executing Time : 8.267s
--------------------->

<---------------------
Date 26/2/2019
Time  14:49:40:216
Executing Time : 8.29s
--------------------->

<---------------------
Date 26/2/2019
Time  14:51:38:553
Executing Time : 8.213s
--------------------->

<---------------------
Date 7/3/2019
Time  15:8:50:832
<---------------------
Date 7/3/2019
Time  15:10:28:737
Executing Time : 8.831s
--------------------->
