^C:\USERS\ANWARI\SOURCE\REPOS\HODEX\HODEX\X64\RELEASE\HODEX.SBR|C:\USERS\ANWARI\SOURCE\REPOS\HODEX\HODEX\X64\RELEASE\TINYXML2.SBR
C:\WINDOWS\SYSTEM32\TZRES.DLL
C:\USERS\ANWARI\SOURCE\REPOS\HODEX\HODEX\X64\RELEASE\HODEX.SBR
C:\USERS\ANWARI\SOURCE\REPOS\HODEX\HODEX\X64\RELEASE\TINYXML2.SBR
^E:\HODA\2.SECOND_TASK\000.HODEX_ALL_VERSION\HODEX\HODEX\X64\RELEASE\HODEX.SBR|E:\HODA\2.SECOND_TASK\000.HODEX_ALL_VERSION\HODEX\HODEX\X64\RELEASE\TINYXML2.SBR
C:\WINDOWS\SYSTEM32\TZRES.DLL
E:\HODA\2.SECOND_TASK\000.HODEX_ALL_VERSION\HODEX\X64\RELEASE\HODEX.BSC
E:\HODA\2.SECOND_TASK\000.HODEX_ALL_VERSION\HODEX\HODEX\X64\RELEASE\HODEX.SBR
E:\HODA\2.SECOND_TASK\000.HODEX_ALL_VERSION\HODEX\HODEX\X64\RELEASE\TINYXML2.SBR
