{
	"JSON": {
		"ID": "1ee82409-3a6d-68d1-a097-317cd197966f",
		"label": "",
		"comment": "UUID6 is used"
	},
	"part": {
		"name": "disk_testrig_1",
		"mass": {
			"value": 1000,
			"unit": "gramm"
		},
		"material": "S235",
		"young's modulus": {
			"value": 210000,
			"unit": "N/mm**2"
		},
		"dimensions": {
			"thickness": {
				"value": 15,
				"unit": "millimeter"
			},
			"diameter": {
				"value": 99,
				"unit": "millimeter"
			}
		}
	}
}