{
	"JSON": {
		"ID": "1ee83016-e13f-620f-baa5-40c3edeba894",
		"label": "",
		"comment": "UUID6 is used"
	},
	"sensor": {
		"name": "Temperature_Sensor",
		"type": "DS18B20",
		"manufacturer": "keyestudio",
		"serial": "3ce10457ea8b",
		"comment": "",
		"range": {
			"min": -55,
			"max": 125,
			"units": "degree_celsius"
		},
		"accuracy": {
			"value": 0.0,
			"type": "absolute",
			"unit": "degree_celsius"
		}
	}
}
