{
	"JSON": {
		"ID": "1ee82fa7-e2eb-6ce1-9384-0358b5927397",
		"label": "",
		"comment": "UUID6 is used"
	},
	"probe": {
		"metadata": {
            "mass_1": "0.1",
            "mass_2": "0.1"
		},
    "info": "Temperatur von kaltem Wasser und heißem Wasser messen und dann die Temperatur beim Mischen von warem und kaltem Wasser"
	}
}