{
	"JSON": {
		"ID": "1ee82f88-3729-61fa-abf8-a9885208c380",
		"label": "",
		"comment": "UUID6 is used"
	},
	"group": {
		"number": "02",
		"author": "Hiab Berhane",
		"experiment": "kalorimetrie-experiment"
	}
}