<?xml version="1.0" encoding="UTF-8" standalone="no"?>
<!-- Created with Inkscape (http://www.inkscape.org/) -->

<svg
   width="695.98401mm"
   height="82.238792mm"
   viewBox="0 0 695.98401 82.238792"
   preserveAspectRatio="none"
   version="1.1"
   id="svg11188"
   inkscape:version="1.1.1 (eb90963e84, 2021-10-02)"
   sodipodi:docname="grass.svg"
   xmlns:inkscape="http://www.inkscape.org/namespaces/inkscape"
   xmlns:sodipodi="http://sodipodi.sourceforge.net/DTD/sodipodi-0.dtd"
   xmlns="http://www.w3.org/2000/svg"
   xmlns:svg="http://www.w3.org/2000/svg">
  <sodipodi:namedview
     id="namedview11190"
     pagecolor="#505050"
     bordercolor="#ffffff"
     borderopacity="1"
     inkscape:pageshadow="0"
     inkscape:pageopacity="0"
     inkscape:pagecheckerboard="1"
     inkscape:document-units="mm"
     showgrid="false"
     inkscape:zoom="0.64765011"
     inkscape:cx="1116.3435"
     inkscape:cy="15.440436"
     inkscape:window-width="2560"
     inkscape:window-height="1351"
     inkscape:window-x="1440"
     inkscape:window-y="400"
     inkscape:window-maximized="1"
     inkscape:current-layer="layer1" />
  <defs
     id="defs11185" />
  <g
     inkscape:label="Layer 1"
     inkscape:groupmode="layer"
     id="layer1"
     transform="translate(190.30011,-144.3524)">
    <path
       id="rect2501"
       style="fill:#5b7000;stroke-width:0.264583"
       d="m -190.30011,144.3524 h 695.98399 v 43.20522 c -16.96757,15.81509 -56.82316,27.91508 -111.31672,28.28469 -54.13978,0.36722 -121.7505,16.14085 -192.55308,8.80665 -81.12673,-8.40364 -146.240137,-13.71262 -214.93613,-9.72621 -68.865955,3.99628 -146.45929,-4.07538 -177.17806,-27.36513 z"
       sodipodi:nodetypes="cccssscc" />
  </g>
</svg>
