{
	"JSON": {
		"ID": "1ee848dd-c1f8-61bf-ae8e-94ab1ed52c5e",
		"label": "",
		"comment": "UUID6 is used"
	},
	"sensor": {
		"name": "Temperature_Sensor",
		"type": "DS18B20",
		"manufacturer": "keyestudio",
		"serial": "3ccd0457cb0f",
		"comment": "",
		"range": {
			"min": -55,
			"max": 125,
			"units": "degree_celsius"
		},
		"accuracy": {
			"value": 0.5,
			"type": "absolute",
			"unit": "degree_celsius",
			"comment": "accuracy from -10 to 85 degree celcius"
		}
	}
}
