{
	"JSON": {
		"ID": "1ee848d8-ac6f-61ad-a7e3-34cfb035c7f9",
		"label": "",
		"comment": "UUID6 is used"
	},
	"sensor": {
		"name": "Temperature_Sensor",
		"type": "DS18B20",
		"manufacturer": "keyestudio",
		"serial": "3ce104577f7d",
		"comment": "",
		"range": {
			"min": -55,
			"max": 125,
			"units": "degree_celsius"
		},
		"accuracy": {
			"value": 0.5,
			"type": "absolute",
			"unit": "degree_celsius",
			"comment": "accuracy from -10 to 85 degree celcius"
		}
	}
}
