{
	"JSON": {
		"ID": "1ee848f0-18a1-621f-92e6-34e9591086cd",
		"label": "",
		"comment": "UUID6 is used"
	},
    "comment": "here you can write down something important about this setup file",
    "info": "List below ALL components, you used in your experiment. By using the UUID there is no possibility to mix something up.",
	"setup": {
		"1ee848ac-1a57-6f4a-b459-39df41981926": {
            "type": "group_info",
			"name": "group_info",
            "comment": ""
        },
		"1ee848cf-c11a-60ec-8eec-a715c1371b9f": {
            "type": "instrument",
			"name": "raspberry_pi",
            "comment": ""
        },
		"1ee848d8-ac6f-61ad-a7e3-34cfb035c7f9": {
            "type": "sensor",
			"name": "sensor1_used_in_warm_water",
			"serial": "3ce104577f7d",
            "comment": ""
        },
		"1ee848dd-c1f8-61bf-ae8e-94ab1ed52c5e": {
            "type": "sensor",
			"name": "sensor2_used_in_cold_water",
			"serial": "3ccd0457cb0f",
            "comment": ""
        },
		"1ee848ec-9f8b-6114-9643-0c61820cd700": {
            "type": "probe",
			"name": "heat_capacity",
            "comment": ""
        }
	}
}