# CellSize = 0.1 
# n is number of missing lattice links at boundary lattice sites 
# ID | x | y | z | ID x+ | ID y+ | ID x- | ID y- | ID x+y+ | ID x-y+ | ID x-y- | ID x+y- [| n x Bnd IDs | n x Bnd Distance | n x [x,y] Closest Point on Boundary | n x [x,y] Bnd Normal at Closest Point] 
     0  -3.00000000e-01   5.00000000e-02   0.00000000e+00      1      3      2      4      5      6      7      8 
     1  -2.00000000e-01   5.00000000e-02   0.00000000e+00      9      5      0      8     10      3      4     11 
     2  -4.00000000e-01   5.00000000e-02   0.00000000e+00      0      6     12      7      3     13     14      4 
     3  -3.00000000e-01   1.50000000e-01   0.00000000e+00      5     15      6      0     16     17      2      1 
     4  -3.00000000e-01  -5.00000000e-02   0.00000000e+00      8      0      7     18      1      2     19     20 
     5  -2.00000000e-01   1.50000000e-01   0.00000000e+00     10     16      3      1     21     15      0      9 
     6  -4.00000000e-01   1.50000000e-01   0.00000000e+00      3     17     13      2     15     22     12      0 
     7  -4.00000000e-01  -5.00000000e-02   0.00000000e+00      4      2     14     19      0     12     23     18 
     8  -2.00000000e-01  -5.00000000e-02   0.00000000e+00     11      1      4     20      9      0     18     24 
     9  -1.00000000e-01   5.00000000e-02   0.00000000e+00     25     10      1     11     26      5      8     27 
    10  -1.00000000e-01   1.50000000e-01   0.00000000e+00     26     21      5      9     28     16      1     25 
    11  -1.00000000e-01  -5.00000000e-02   0.00000000e+00     27      9      8     24     25      1     20     29 
    12  -5.00000000e-01   5.00000000e-02   0.00000000e+00      2     13     30     14      6     31     32      7 
    13  -5.00000000e-01   1.50000000e-01   0.00000000e+00      6     22     31     12     17     33     30      2 
    14  -5.00000000e-01  -5.00000000e-02   0.00000000e+00      7     12     32     23      2     30     34     19 
    15  -3.00000000e-01   2.50000000e-01   0.00000000e+00     16     35     17      3     36     37      6      5 
    16  -2.00000000e-01   2.50000000e-01   0.00000000e+00     21     36     15      5     38     35      3     10 
    17  -4.00000000e-01   2.50000000e-01   0.00000000e+00     15     37     22      6     35     39     13      3 
    18  -3.00000000e-01  -1.50000000e-01   0.00000000e+00     20      4     19     40      8      7     41     42 
    19  -4.00000000e-01  -1.50000000e-01   0.00000000e+00     18      7     23     41      4     14     43     40 
    20  -2.00000000e-01  -1.50000000e-01   0.00000000e+00     24      8     18     42     11      4     40     44 
    21  -1.00000000e-01   2.50000000e-01   0.00000000e+00     28     38     16     10     45     36      5     26 
    22  -5.00000000e-01   2.50000000e-01   0.00000000e+00     17     39     33     13     37     46     31      6 
    23  -5.00000000e-01  -1.50000000e-01   0.00000000e+00     19     14     34     43      7     32     47     41 
    24  -1.00000000e-01  -1.50000000e-01   0.00000000e+00     29     11     20     44     27      8     42     48 
    25   5.55111512e-17   5.00000000e-02   0.00000000e+00     49     26      9     27     50     10     11     51 
    26   5.55111512e-17   1.50000000e-01   0.00000000e+00     50     28     10     25     52     21      9     49 
    27   5.55111512e-17  -5.00000000e-02   0.00000000e+00     51     25     11     29     49      9     24     53 
    28   5.55111512e-17   2.50000000e-01   0.00000000e+00     52     45     21     26     54     38     10     50 
    29   5.55111512e-17  -1.50000000e-01   0.00000000e+00     53     27     24     48     51     11     44     55 
    30  -6.00000000e-01   5.00000000e-02   0.00000000e+00     12     31     56     32     13     57     58     14 
    31  -6.00000000e-01   1.50000000e-01   0.00000000e+00     13     33     57     30     22     59     56     12 
    32  -6.00000000e-01  -5.00000000e-02   0.00000000e+00     14     30     58     34     12     56     60     23 
    33  -6.00000000e-01   2.50000000e-01   0.00000000e+00     22     46     59     31     39     61     57     13 
    34  -6.00000000e-01  -1.50000000e-01   0.00000000e+00     23     32     60     47     14     58     62     43 
    35  -3.00000000e-01   3.50000000e-01   0.00000000e+00     36     63     37     15     64     65     17     16 
    36  -2.00000000e-01   3.50000000e-01   0.00000000e+00     38     64     35     16     66     63     15     21 
    37  -4.00000000e-01   3.50000000e-01   0.00000000e+00     35     65     39     17     63     67     22     15 
    38  -1.00000000e-01   3.50000000e-01   0.00000000e+00     45     66     36     21     68     64     16     28 
    39  -5.00000000e-01   3.50000000e-01   0.00000000e+00     37     67     46     22     65     69     33     17 
    40  -3.00000000e-01  -2.50000000e-01   0.00000000e+00     42     18     41     70     20     19     71     72 
    41  -4.00000000e-01  -2.50000000e-01   0.00000000e+00     40     19     43     71     18     23     73     70 
    42  -2.00000000e-01  -2.50000000e-01   0.00000000e+00     44     20     40     72     24     18     70     74 
    43  -5.00000000e-01  -2.50000000e-01   0.00000000e+00     41     23     47     73     19     34     75     71 
    44  -1.00000000e-01  -2.50000000e-01   0.00000000e+00     48     24     42     74     29     20     72     76 
    45   5.55111512e-17   3.50000000e-01   0.00000000e+00     54     68     38     28     77     66     21     52 
    46  -6.00000000e-01   3.50000000e-01   0.00000000e+00     39     69     61     33     67     78     59     22 
    47  -6.00000000e-01  -2.50000000e-01   0.00000000e+00     43     34     62     75     23     60     79     73 
    48   5.55111512e-17  -2.50000000e-01   0.00000000e+00     55     29     44     76     53     24     74     80 
    49   1.00000000e-01   5.00000000e-02   0.00000000e+00     81     50     25     51     82     26     27     83 
    50   1.00000000e-01   1.50000000e-01   0.00000000e+00     82     52     26     49     84     28     25     81 
    51   1.00000000e-01  -5.00000000e-02   0.00000000e+00     83     49     27     53     81     25     29     85 
    52   1.00000000e-01   2.50000000e-01   0.00000000e+00     84     54     28     50     86     45     26     82 
    53   1.00000000e-01  -1.50000000e-01   0.00000000e+00     85     51     29     55     83     27     48     87 
    54   1.00000000e-01   3.50000000e-01   0.00000000e+00     86     77     45     52     88     68     28     84 
    55   1.00000000e-01  -2.50000000e-01   0.00000000e+00     87     53     48     80     85     29     76     89 
    56  -7.00000000e-01   5.00000000e-02   0.00000000e+00     30     57     90     58     31     91     92     32 
    57  -7.00000000e-01   1.50000000e-01   0.00000000e+00     31     59     91     56     33     93     90     30 
    58  -7.00000000e-01  -5.00000000e-02   0.00000000e+00     32     56     92     60     30     90     94     34 
    59  -7.00000000e-01   2.50000000e-01   0.00000000e+00     33     61     93     57     46     95     91     31 
    60  -7.00000000e-01  -1.50000000e-01   0.00000000e+00     34     58     94     62     32     92     96     47 
    61  -7.00000000e-01   3.50000000e-01   0.00000000e+00     46     78     95     59     69     97     93     33 
    62  -7.00000000e-01  -2.50000000e-01   0.00000000e+00     47     60     96     79     34     94     98     75 
    63  -3.00000000e-01   4.50000000e-01   0.00000000e+00     64     99     65     35    100    101     37     36 
    64  -2.00000000e-01   4.50000000e-01   0.00000000e+00     66    100     63     36    102     99     35     38 
    65  -4.00000000e-01   4.50000000e-01   0.00000000e+00     63    101     67     37     99    103     39     35 
    66  -1.00000000e-01   4.50000000e-01   0.00000000e+00     68    102     64     38    104    100     36     45 
    67  -5.00000000e-01   4.50000000e-01   0.00000000e+00     65    103     69     39    101    105     46     37 
    68   5.55111512e-17   4.50000000e-01   0.00000000e+00     77    104     66     45    106    102     38     54 
    69  -6.00000000e-01   4.50000000e-01   0.00000000e+00     67    105     78     46    103    107     61     39 
    70  -3.00000000e-01  -3.50000000e-01   0.00000000e+00     72     40     71    108     42     41    109    110 
    71  -4.00000000e-01  -3.50000000e-01   0.00000000e+00     70     41     73    109     40     43    111    108 
    72  -2.00000000e-01  -3.50000000e-01   0.00000000e+00     74     42     70    110     44     40    108    112 
    73  -5.00000000e-01  -3.50000000e-01   0.00000000e+00     71     43     75    111     41     47    113    109 
    74  -1.00000000e-01  -3.50000000e-01   0.00000000e+00     76     44     72    112     48     42    110    114 
    75  -6.00000000e-01  -3.50000000e-01   0.00000000e+00     73     47     79    113     43     62    115    111 
    76   5.55111512e-17  -3.50000000e-01   0.00000000e+00     80     48     74    114     55     44    112    116 
    77   1.00000000e-01   4.50000000e-01   0.00000000e+00     88    106     68     54    117    104     45     86 
    78  -7.00000000e-01   4.50000000e-01   0.00000000e+00     69    107     97     61    105    118     95     46 
    79  -7.00000000e-01  -3.50000000e-01   0.00000000e+00     75     62     98    115     47     96    119    113 
    80   1.00000000e-01  -3.50000000e-01   0.00000000e+00     89     55     76    116     87     48    114    120 
    81   2.00000000e-01   5.00000000e-02   0.00000000e+00    121     82     49     83    122     50     51    123 
    82   2.00000000e-01   1.50000000e-01   0.00000000e+00    122     84     50     81    124     52     49    121 
    83   2.00000000e-01  -5.00000000e-02   0.00000000e+00    123     81     51     85    121     49     53    125 
    84   2.00000000e-01   2.50000000e-01   0.00000000e+00    124     86     52     82    126     54     50    122 
    85   2.00000000e-01  -1.50000000e-01   0.00000000e+00    125     83     53     87    123     51     55    127 
    86   2.00000000e-01   3.50000000e-01   0.00000000e+00    126     88     54     84    128     77     52    124 
    87   2.00000000e-01  -2.50000000e-01   0.00000000e+00    127     85     55     89    125     53     80    129 
    88   2.00000000e-01   4.50000000e-01   0.00000000e+00    128    117     77     86    130    106     54    126 
    89   2.00000000e-01  -3.50000000e-01   0.00000000e+00    129     87     80    120    127     55    116    131 
    90  -8.00000000e-01   5.00000000e-02   0.00000000e+00     56     91    132     92     57    133    134     58 
    91  -8.00000000e-01   1.50000000e-01   0.00000000e+00     57     93    133     90     59    135    132     56 
    92  -8.00000000e-01  -5.00000000e-02   0.00000000e+00     58     90    134     94     56    132    136     60 
    93  -8.00000000e-01   2.50000000e-01   0.00000000e+00     59     95    135     91     61    137    133     57 
    94  -8.00000000e-01  -1.50000000e-01   0.00000000e+00     60     92    136     96     58    134    138     62 
    95  -8.00000000e-01   3.50000000e-01   0.00000000e+00     61     97    137     93     78    139    135     59 
    96  -8.00000000e-01  -2.50000000e-01   0.00000000e+00     62     94    138     98     60    136    140     79 
    97  -8.00000000e-01   4.50000000e-01   0.00000000e+00     78    118    139     95    107    141    137     61 
    98  -8.00000000e-01  -3.50000000e-01   0.00000000e+00     79     96    140    119     62    138    142    115 
    99  -3.00000000e-01   5.50000000e-01   0.00000000e+00    100    143    101     63    144    145     65     64 
   100  -2.00000000e-01   5.50000000e-01   0.00000000e+00    102    144     99     64    146    143     63     66 
   101  -4.00000000e-01   5.50000000e-01   0.00000000e+00     99    145    103     65    143    147     67     63 
   102  -1.00000000e-01   5.50000000e-01   0.00000000e+00    104    146    100     66    148    144     64     68 
   103  -5.00000000e-01   5.50000000e-01   0.00000000e+00    101    147    105     67    145    149     69     65 
   104   5.55111512e-17   5.50000000e-01   0.00000000e+00    106    148    102     68    150    146     66     77 
   105  -6.00000000e-01   5.50000000e-01   0.00000000e+00    103    149    107     69    147    151     78     67 
   106   1.00000000e-01   5.50000000e-01   0.00000000e+00    117    150    104     77    152    148     68     88 
   107  -7.00000000e-01   5.50000000e-01   0.00000000e+00    105    151    118     78    149    153     97     69 
   108  -3.00000000e-01  -4.50000000e-01   0.00000000e+00    110     70    109    154     72     71    155    156 
   109  -4.00000000e-01  -4.50000000e-01   0.00000000e+00    108     71    111    155     70     73    157    154 
   110  -2.00000000e-01  -4.50000000e-01   0.00000000e+00    112     72    108    156     74     70    154    158 
   111  -5.00000000e-01  -4.50000000e-01   0.00000000e+00    109     73    113    157     71     75    159    155 
   112  -1.00000000e-01  -4.50000000e-01   0.00000000e+00    114     74    110    158     76     72    156    160 
   113  -6.00000000e-01  -4.50000000e-01   0.00000000e+00    111     75    115    159     73     79    161    157 
   114   5.55111512e-17  -4.50000000e-01   0.00000000e+00    116     76    112    160     80     74    158    162 
   115  -7.00000000e-01  -4.50000000e-01   0.00000000e+00    113     79    119    161     75     98    163    159 
   116   1.00000000e-01  -4.50000000e-01   0.00000000e+00    120     80    114    162     89     76    160    164 
   117   2.00000000e-01   5.50000000e-01   0.00000000e+00    130    152    106     88    165    150     77    128 
   118  -8.00000000e-01   5.50000000e-01   0.00000000e+00    107    153    141     97    151    166    139     78 
   119  -8.00000000e-01  -4.50000000e-01   0.00000000e+00    115     98    142    163     79    140    167    161 
   120   2.00000000e-01  -4.50000000e-01   0.00000000e+00    131     89    116    164    129     80    162    168 
   121   3.00000000e-01   5.00000000e-02   0.00000000e+00    169    122     81    123    170     82     83    171 
   122   3.00000000e-01   1.50000000e-01   0.00000000e+00    170    124     82    121    172     84     81    169 
   123   3.00000000e-01  -5.00000000e-02   0.00000000e+00    171    121     83    125    169     81     85    173 
   124   3.00000000e-01   2.50000000e-01   0.00000000e+00    172    126     84    122    174     86     82    170 
   125   3.00000000e-01  -1.50000000e-01   0.00000000e+00    173    123     85    127    171     83     87    175 
   126   3.00000000e-01   3.50000000e-01   0.00000000e+00    174    128     86    124    176     88     84    172 
   127   3.00000000e-01  -2.50000000e-01   0.00000000e+00    175    125     87    129    173     85     89    177 
   128   3.00000000e-01   4.50000000e-01   0.00000000e+00    176    130     88    126    178    117     86    174 
   129   3.00000000e-01  -3.50000000e-01   0.00000000e+00    177    127     89    131    175     87    120    179 
   130   3.00000000e-01   5.50000000e-01   0.00000000e+00    178    165    117    128    180    152     88    176 
   131   3.00000000e-01  -4.50000000e-01   0.00000000e+00    179    129    120    168    177     89    164    181 
   132  -9.00000000e-01   5.00000000e-02   0.00000000e+00     90    133    182    134     91    183    184     92 
   133  -9.00000000e-01   1.50000000e-01   0.00000000e+00     91    135    183    132     93    185    182     90 
   134  -9.00000000e-01  -5.00000000e-02   0.00000000e+00     92    132    184    136     90    182    186     94 
   135  -9.00000000e-01   2.50000000e-01   0.00000000e+00     93    137    185    133     95    187    183     91 
   136  -9.00000000e-01  -1.50000000e-01   0.00000000e+00     94    134    186    138     92    184    188     96 
   137  -9.00000000e-01   3.50000000e-01   0.00000000e+00     95    139    187    135     97    189    185     93 
   138  -9.00000000e-01  -2.50000000e-01   0.00000000e+00     96    136    188    140     94    186    190     98 
   139  -9.00000000e-01   4.50000000e-01   0.00000000e+00     97    141    189    137    118    191    187     95 
   140  -9.00000000e-01  -3.50000000e-01   0.00000000e+00     98    138    190    142     96    188    192    119 
   141  -9.00000000e-01   5.50000000e-01   0.00000000e+00    118    166    191    139    153    193    189     97 
   142  -9.00000000e-01  -4.50000000e-01   0.00000000e+00    119    140    192    167     98    190    194    163 
   143  -3.00000000e-01   6.50000000e-01   0.00000000e+00    144    195    145     99    196    197    101    100 
   144  -2.00000000e-01   6.50000000e-01   0.00000000e+00    146    196    143    100    198    195     99    102 
   145  -4.00000000e-01   6.50000000e-01   0.00000000e+00    143    197    147    101    195    199    103     99 
   146  -1.00000000e-01   6.50000000e-01   0.00000000e+00    148    198    144    102    200    196    100    104 
   147  -5.00000000e-01   6.50000000e-01   0.00000000e+00    145    199    149    103    197    201    105    101 
   148   5.55111512e-17   6.50000000e-01   0.00000000e+00    150    200    146    104    202    198    102    106 
   149  -6.00000000e-01   6.50000000e-01   0.00000000e+00    147    201    151    105    199    203    107    103 
   150   1.00000000e-01   6.50000000e-01   0.00000000e+00    152    202    148    106    204    200    104    117 
   151  -7.00000000e-01   6.50000000e-01   0.00000000e+00    149    203    153    107    201    205    118    105 
   152   2.00000000e-01   6.50000000e-01   0.00000000e+00    165    204    150    117    206    202    106    130 
   153  -8.00000000e-01   6.50000000e-01   0.00000000e+00    151    205    166    118    203    207    141    107 
   154  -3.00000000e-01  -5.50000000e-01   0.00000000e+00    156    108    155    208    110    109    209    210 
   155  -4.00000000e-01  -5.50000000e-01   0.00000000e+00    154    109    157    209    108    111    211    208 
   156  -2.00000000e-01  -5.50000000e-01   0.00000000e+00    158    110    154    210    112    108    208    212 
   157  -5.00000000e-01  -5.50000000e-01   0.00000000e+00    155    111    159    211    109    113    213    209 
   158  -1.00000000e-01  -5.50000000e-01   0.00000000e+00    160    112    156    212    114    110    210    214 
   159  -6.00000000e-01  -5.50000000e-01   0.00000000e+00    157    113    161    213    111    115    215    211 
   160   5.55111512e-17  -5.50000000e-01   0.00000000e+00    162    114    158    214    116    112    212    216 
   161  -7.00000000e-01  -5.50000000e-01   0.00000000e+00    159    115    163    215    113    119    217    213 
   162   1.00000000e-01  -5.50000000e-01   0.00000000e+00    164    116    160    216    120    114    214    218 
   163  -8.00000000e-01  -5.50000000e-01   0.00000000e+00    161    119    167    217    115    142    219    215 
   164   2.00000000e-01  -5.50000000e-01   0.00000000e+00    168    120    162    218    131    116    216    220 
   165   3.00000000e-01   6.50000000e-01   0.00000000e+00    180    206    152    130    221    204    117    178 
   166  -9.00000000e-01   6.50000000e-01   0.00000000e+00    153    207    193    141    205    222    191    118 
   167  -9.00000000e-01  -5.50000000e-01   0.00000000e+00    163    142    194    219    119    192    223    217 
   168   3.00000000e-01  -5.50000000e-01   0.00000000e+00    181    131    164    220    179    120    218    224 
   169   4.00000000e-01   5.00000000e-02   0.00000000e+00    225    170    121    171    226    122    123    227 
   170   4.00000000e-01   1.50000000e-01   0.00000000e+00    226    172    122    169    228    124    121    225 
   171   4.00000000e-01  -5.00000000e-02   0.00000000e+00    227    169    123    173    225    121    125    229 
   172   4.00000000e-01   2.50000000e-01   0.00000000e+00    228    174    124    170    230    126    122    226 
   173   4.00000000e-01  -1.50000000e-01   0.00000000e+00    229    171    125    175    227    123    127    231 
   174   4.00000000e-01   3.50000000e-01   0.00000000e+00    230    176    126    172    232    128    124    228 
   175   4.00000000e-01  -2.50000000e-01   0.00000000e+00    231    173    127    177    229    125    129    233 
   176   4.00000000e-01   4.50000000e-01   0.00000000e+00    232    178    128    174    234    130    126    230 
   177   4.00000000e-01  -3.50000000e-01   0.00000000e+00    233    175    129    179    231    127    131    235 
   178   4.00000000e-01   5.50000000e-01   0.00000000e+00    234    180    130    176    236    165    128    232 
   179   4.00000000e-01  -4.50000000e-01   0.00000000e+00    235    177    131    181    233    129    168    237 
   180   4.00000000e-01   6.50000000e-01   0.00000000e+00    236    221    165    178    238    206    130    234 
   181   4.00000000e-01  -5.50000000e-01   0.00000000e+00    237    179    168    224    235    131    220    239 
   182  -1.00000000e+00   5.00000000e-02   0.00000000e+00    132    183     -1    184    133     -1     -1    134      2      2      2   0.00000000e+00   0.00000000e+00   0.00000000e+00  -1.00000000e+00   5.00000000e-02 -1.00000000e+00   5.00000000e-02 -1.00000000e+00   5.00000000e-02 -1.00000000e+00  -0.00000000e+00 -1.00000000e+00  -0.00000000e+00 -1.00000000e+00  -0.00000000e+00
   183  -1.00000000e+00   1.50000000e-01   0.00000000e+00    133    185     -1    182    135     -1     -1    132      2      2      2   0.00000000e+00   0.00000000e+00   0.00000000e+00  -1.00000000e+00   1.50000000e-01 -1.00000000e+00   1.50000000e-01 -1.00000000e+00   1.50000000e-01 -1.00000000e+00  -0.00000000e+00 -1.00000000e+00  -0.00000000e+00 -1.00000000e+00  -0.00000000e+00
   184  -1.00000000e+00  -5.00000000e-02   0.00000000e+00    134    182     -1    186    132     -1     -1    136      2      2      2   0.00000000e+00   0.00000000e+00   0.00000000e+00  -1.00000000e+00  -5.00000000e-02 -1.00000000e+00  -5.00000000e-02 -1.00000000e+00  -5.00000000e-02 -1.00000000e+00  -0.00000000e+00 -1.00000000e+00  -0.00000000e+00 -1.00000000e+00  -0.00000000e+00
   185  -1.00000000e+00   2.50000000e-01   0.00000000e+00    135    187     -1    183    137     -1     -1    133      2      2      2   0.00000000e+00   0.00000000e+00   0.00000000e+00  -1.00000000e+00   2.50000000e-01 -1.00000000e+00   2.50000000e-01 -1.00000000e+00   2.50000000e-01 -1.00000000e+00  -0.00000000e+00 -1.00000000e+00  -0.00000000e+00 -1.00000000e+00  -0.00000000e+00
   186  -1.00000000e+00  -1.50000000e-01   0.00000000e+00    136    184     -1    188    134     -1     -1    138      2      2      2   0.00000000e+00   0.00000000e+00   0.00000000e+00  -1.00000000e+00  -1.50000000e-01 -1.00000000e+00  -1.50000000e-01 -1.00000000e+00  -1.50000000e-01 -1.00000000e+00  -0.00000000e+00 -1.00000000e+00  -0.00000000e+00 -1.00000000e+00  -0.00000000e+00
   187  -1.00000000e+00   3.50000000e-01   0.00000000e+00    137    189     -1    185    139     -1     -1    135      2      2      2   0.00000000e+00   0.00000000e+00   0.00000000e+00  -1.00000000e+00   3.50000000e-01 -1.00000000e+00   3.50000000e-01 -1.00000000e+00   3.50000000e-01 -1.00000000e+00  -0.00000000e+00 -1.00000000e+00  -0.00000000e+00 -1.00000000e+00  -0.00000000e+00
   188  -1.00000000e+00  -2.50000000e-01   0.00000000e+00    138    186     -1    190    136     -1     -1    140      2      2      2   0.00000000e+00   0.00000000e+00   0.00000000e+00  -1.00000000e+00  -2.50000000e-01 -1.00000000e+00  -2.50000000e-01 -1.00000000e+00  -2.50000000e-01 -1.00000000e+00  -0.00000000e+00 -1.00000000e+00  -0.00000000e+00 -1.00000000e+00  -0.00000000e+00
   189  -1.00000000e+00   4.50000000e-01   0.00000000e+00    139    191     -1    187    141     -1     -1    137      2      2      2   0.00000000e+00   0.00000000e+00   0.00000000e+00  -1.00000000e+00   4.50000000e-01 -1.00000000e+00   4.50000000e-01 -1.00000000e+00   4.50000000e-01 -1.00000000e+00  -0.00000000e+00 -1.00000000e+00  -0.00000000e+00 -1.00000000e+00  -0.00000000e+00
   190  -1.00000000e+00  -3.50000000e-01   0.00000000e+00    140    188     -1    192    138     -1     -1    142      2      2      2   0.00000000e+00   0.00000000e+00   0.00000000e+00  -1.00000000e+00  -3.50000000e-01 -1.00000000e+00  -3.50000000e-01 -1.00000000e+00  -3.50000000e-01 -1.00000000e+00  -0.00000000e+00 -1.00000000e+00  -0.00000000e+00 -1.00000000e+00  -0.00000000e+00
   191  -1.00000000e+00   5.50000000e-01   0.00000000e+00    141    193     -1    189    166     -1     -1    139      2      2      2   0.00000000e+00   0.00000000e+00   0.00000000e+00  -1.00000000e+00   5.50000000e-01 -1.00000000e+00   5.50000000e-01 -1.00000000e+00   5.50000000e-01 -1.00000000e+00  -0.00000000e+00 -1.00000000e+00  -0.00000000e+00 -1.00000000e+00  -0.00000000e+00
   192  -1.00000000e+00  -4.50000000e-01   0.00000000e+00    142    190     -1    194    140     -1     -1    167      2      2      2   0.00000000e+00   0.00000000e+00   0.00000000e+00  -1.00000000e+00  -4.50000000e-01 -1.00000000e+00  -4.50000000e-01 -1.00000000e+00  -4.50000000e-01 -1.00000000e+00  -0.00000000e+00 -1.00000000e+00  -0.00000000e+00 -1.00000000e+00  -0.00000000e+00
   193  -1.00000000e+00   6.50000000e-01   0.00000000e+00    166    222     -1    191    207     -1     -1    141      2      2      2   0.00000000e+00   0.00000000e+00   0.00000000e+00  -1.00000000e+00   6.50000000e-01 -1.00000000e+00   6.50000000e-01 -1.00000000e+00   6.50000000e-01 -1.00000000e+00  -0.00000000e+00 -1.00000000e+00  -0.00000000e+00 -1.00000000e+00  -0.00000000e+00
   194  -1.00000000e+00  -5.50000000e-01   0.00000000e+00    167    192     -1    223    142     -1     -1    219      2      2      2   0.00000000e+00   0.00000000e+00   0.00000000e+00  -1.00000000e+00  -5.50000000e-01 -1.00000000e+00  -5.50000000e-01 -1.00000000e+00  -5.50000000e-01 -1.00000000e+00  -0.00000000e+00 -1.00000000e+00  -0.00000000e+00 -1.00000000e+00  -0.00000000e+00
   195  -3.00000000e-01   7.50000000e-01   0.00000000e+00    196    240    197    143    241    242    145    144 
   196  -2.00000000e-01   7.50000000e-01   0.00000000e+00    198    241    195    144    243    240    143    146 
   197  -4.00000000e-01   7.50000000e-01   0.00000000e+00    195    242    199    145    240    244    147    143 
   198  -1.00000000e-01   7.50000000e-01   0.00000000e+00    200    243    196    146    245    241    144    148 
   199  -5.00000000e-01   7.50000000e-01   0.00000000e+00    197    244    201    147    242    246    149    145 
   200   5.55111512e-17   7.50000000e-01   0.00000000e+00    202    245    198    148    247    243    146    150 
   201  -6.00000000e-01   7.50000000e-01   0.00000000e+00    199    246    203    149    244    248    151    147 
   202   1.00000000e-01   7.50000000e-01   0.00000000e+00    204    247    200    150    249    245    148    152 
   203  -7.00000000e-01   7.50000000e-01   0.00000000e+00    201    248    205    151    246    250    153    149 
   204   2.00000000e-01   7.50000000e-01   0.00000000e+00    206    249    202    152    251    247    150    165 
   205  -8.00000000e-01   7.50000000e-01   0.00000000e+00    203    250    207    153    248    252    166    151 
   206   3.00000000e-01   7.50000000e-01   0.00000000e+00    221    251    204    165    253    249    152    180 
   207  -9.00000000e-01   7.50000000e-01   0.00000000e+00    205    252    222    166    250    254    193    153 
   208  -3.00000000e-01  -6.50000000e-01   0.00000000e+00    210    154    209    255    156    155    256    257 
   209  -4.00000000e-01  -6.50000000e-01   0.00000000e+00    208    155    211    256    154    157    258    255 
   210  -2.00000000e-01  -6.50000000e-01   0.00000000e+00    212    156    208    257    158    154    255    259 
   211  -5.00000000e-01  -6.50000000e-01   0.00000000e+00    209    157    213    258    155    159    260    256 
   212  -1.00000000e-01  -6.50000000e-01   0.00000000e+00    214    158    210    259    160    156    257    261 
   213  -6.00000000e-01  -6.50000000e-01   0.00000000e+00    211    159    215    260    157    161    262    258 
   214   5.55111512e-17  -6.50000000e-01   0.00000000e+00    216    160    212    261    162    158    259    263 
   215  -7.00000000e-01  -6.50000000e-01   0.00000000e+00    213    161    217    262    159    163    264    260 
   216   1.00000000e-01  -6.50000000e-01   0.00000000e+00    218    162    214    263    164    160    261    265 
   217  -8.00000000e-01  -6.50000000e-01   0.00000000e+00    215    163    219    264    161    167    266    262 
   218   2.00000000e-01  -6.50000000e-01   0.00000000e+00    220    164    216    265    168    162    263    267 
   219  -9.00000000e-01  -6.50000000e-01   0.00000000e+00    217    167    223    266    163    194    268    264 
   220   3.00000000e-01  -6.50000000e-01   0.00000000e+00    224    168    218    267    181    164    265    269 
   221   4.00000000e-01   7.50000000e-01   0.00000000e+00    238    253    206    180    270    251    165    236 
   222  -1.00000000e+00   7.50000000e-01   0.00000000e+00    207    254     -1    193    252     -1     -1    166      2      2      2   0.00000000e+00   0.00000000e+00   0.00000000e+00  -1.00000000e+00   7.50000000e-01 -1.00000000e+00   7.50000000e-01 -1.00000000e+00   7.50000000e-01 -1.00000000e+00  -0.00000000e+00 -1.00000000e+00  -0.00000000e+00 -1.00000000e+00  -0.00000000e+00
   223  -1.00000000e+00  -6.50000000e-01   0.00000000e+00    219    194     -1    268    167     -1     -1    266      2      2      2   0.00000000e+00   0.00000000e+00   0.00000000e+00  -1.00000000e+00  -6.50000000e-01 -1.00000000e+00  -6.50000000e-01 -1.00000000e+00  -6.50000000e-01 -1.00000000e+00  -0.00000000e+00 -1.00000000e+00  -0.00000000e+00 -1.00000000e+00  -0.00000000e+00
   224   4.00000000e-01  -6.50000000e-01   0.00000000e+00    239    181    220    269    237    168    267    271 
   225   5.00000000e-01   5.00000000e-02   0.00000000e+00    272    226    169    227    273    170    171    274 
   226   5.00000000e-01   1.50000000e-01   0.00000000e+00    273    228    170    225    275    172    169    272 
   227   5.00000000e-01  -5.00000000e-02   0.00000000e+00    274    225    171    229    272    169    173    276 
   228   5.00000000e-01   2.50000000e-01   0.00000000e+00    275    230    172    226    277    174    170    273 
   229   5.00000000e-01  -1.50000000e-01   0.00000000e+00    276    227    173    231    274    171    175    278 
   230   5.00000000e-01   3.50000000e-01   0.00000000e+00    277    232    174    228    279    176    172    275 
   231   5.00000000e-01  -2.50000000e-01   0.00000000e+00    278    229    175    233    276    173    177    280 
   232   5.00000000e-01   4.50000000e-01   0.00000000e+00    279    234    176    230    281    178    174    277 
   233   5.00000000e-01  -3.50000000e-01   0.00000000e+00    280    231    177    235    278    175    179    282 
   234   5.00000000e-01   5.50000000e-01   0.00000000e+00    281    236    178    232    283    180    176    279 
   235   5.00000000e-01  -4.50000000e-01   0.00000000e+00    282    233    179    237    280    177    181    284 
   236   5.00000000e-01   6.50000000e-01   0.00000000e+00    283    238    180    234    285    221    178    281 
   237   5.00000000e-01  -5.50000000e-01   0.00000000e+00    284    235    181    239    282    179    224    286 
   238   5.00000000e-01   7.50000000e-01   0.00000000e+00    285    270    221    236    287    253    180    283 
   239   5.00000000e-01  -6.50000000e-01   0.00000000e+00    286    237    224    271    284    181    269    288 
   240  -3.00000000e-01   8.50000000e-01   0.00000000e+00    241    289    242    195    290    291    197    196 
   241  -2.00000000e-01   8.50000000e-01   0.00000000e+00    243    290    240    196    292    289    195    198 
   242  -4.00000000e-01   8.50000000e-01   0.00000000e+00    240    291    244    197    289    293    199    195 
   243  -1.00000000e-01   8.50000000e-01   0.00000000e+00    245    292    241    198    294    290    196    200 
   244  -5.00000000e-01   8.50000000e-01   0.00000000e+00    242    293    246    199    291    295    201    197 
   245   5.55111512e-17   8.50000000e-01   0.00000000e+00    247    294    243    200    296    292    198    202 
   246  -6.00000000e-01   8.50000000e-01   0.00000000e+00    244    295    248    201    293    297    203    199 
   247   1.00000000e-01   8.50000000e-01   0.00000000e+00    249    296    245    202    298    294    200    204 
   248  -7.00000000e-01   8.50000000e-01   0.00000000e+00    246    297    250    203    295    299    205    201 
   249   2.00000000e-01   8.50000000e-01   0.00000000e+00    251    298    247    204    300    296    202    206 
   250  -8.00000000e-01   8.50000000e-01   0.00000000e+00    248    299    252    205    297    301    207    203 
   251   3.00000000e-01   8.50000000e-01   0.00000000e+00    253    300    249    206    302    298    204    221 
   252  -9.00000000e-01   8.50000000e-01   0.00000000e+00    250    301    254    207    299    303    222    205 
   253   4.00000000e-01   8.50000000e-01   0.00000000e+00    270    302    251    221    304    300    206    238 
   254  -1.00000000e+00   8.50000000e-01   0.00000000e+00    252    303     -1    222    301     -1     -1    207      2      2      2   0.00000000e+00   0.00000000e+00   0.00000000e+00  -1.00000000e+00   8.50000000e-01 -1.00000000e+00   8.50000000e-01 -1.00000000e+00   8.50000000e-01 -1.00000000e+00  -0.00000000e+00 -1.00000000e+00  -0.00000000e+00 -1.00000000e+00  -0.00000000e+00
   255  -3.00000000e-01  -7.50000000e-01   0.00000000e+00    257    208    256    305    210    209    306    307 
   256  -4.00000000e-01  -7.50000000e-01   0.00000000e+00    255    209    258    306    208    211    308    305 
   257  -2.00000000e-01  -7.50000000e-01   0.00000000e+00    259    210    255    307    212    208    305    309 
   258  -5.00000000e-01  -7.50000000e-01   0.00000000e+00    256    211    260    308    209    213    310    306 
   259  -1.00000000e-01  -7.50000000e-01   0.00000000e+00    261    212    257    309    214    210    307    311 
   260  -6.00000000e-01  -7.50000000e-01   0.00000000e+00    258    213    262    310    211    215    312    308 
   261   5.55111512e-17  -7.50000000e-01   0.00000000e+00    263    214    259    311    216    212    309    313 
   262  -7.00000000e-01  -7.50000000e-01   0.00000000e+00    260    215    264    312    213    217    314    310 
   263   1.00000000e-01  -7.50000000e-01   0.00000000e+00    265    216    261    313    218    214    311    315 
   264  -8.00000000e-01  -7.50000000e-01   0.00000000e+00    262    217    266    314    215    219    316    312 
   265   2.00000000e-01  -7.50000000e-01   0.00000000e+00    267    218    263    315    220    216    313    317 
   266  -9.00000000e-01  -7.50000000e-01   0.00000000e+00    264    219    268    316    217    223    318    314 
   267   3.00000000e-01  -7.50000000e-01   0.00000000e+00    269    220    265    317    224    218    315    319 
   268  -1.00000000e+00  -7.50000000e-01   0.00000000e+00    266    223     -1    318    219     -1     -1    316      2      2      2   0.00000000e+00   0.00000000e+00   0.00000000e+00  -1.00000000e+00  -7.50000000e-01 -1.00000000e+00  -7.50000000e-01 -1.00000000e+00  -7.50000000e-01 -1.00000000e+00  -0.00000000e+00 -1.00000000e+00  -0.00000000e+00 -1.00000000e+00  -0.00000000e+00
   269   4.00000000e-01  -7.50000000e-01   0.00000000e+00    271    224    267    319    239    220    317    320 
   270   5.00000000e-01   8.50000000e-01   0.00000000e+00    287    304    253    238    321    302    221    285 
   271   5.00000000e-01  -7.50000000e-01   0.00000000e+00    288    239    269    320    286    224    319    322 
   272   6.00000000e-01   5.00000000e-02   0.00000000e+00    323    273    225    274    324    226    227    325 
   273   6.00000000e-01   1.50000000e-01   0.00000000e+00    324    275    226    272    326    228    225    323 
   274   6.00000000e-01  -5.00000000e-02   0.00000000e+00    325    272    227    276    323    225    229    327 
   275   6.00000000e-01   2.50000000e-01   0.00000000e+00    326    277    228    273    328    230    226    324 
   276   6.00000000e-01  -1.50000000e-01   0.00000000e+00    327    274    229    278    325    227    231    329 
   277   6.00000000e-01   3.50000000e-01   0.00000000e+00    328    279    230    275    330    232    228    326 
   278   6.00000000e-01  -2.50000000e-01   0.00000000e+00    329    276    231    280    327    229    233    331 
   279   6.00000000e-01   4.50000000e-01   0.00000000e+00    330    281    232    277    332    234    230    328 
   280   6.00000000e-01  -3.50000000e-01   0.00000000e+00    331    278    233    282    329    231    235    333 
   281   6.00000000e-01   5.50000000e-01   0.00000000e+00    332    283    234    279    334    236    232    330 
   282   6.00000000e-01  -4.50000000e-01   0.00000000e+00    333    280    235    284    331    233    237    335 
   283   6.00000000e-01   6.50000000e-01   0.00000000e+00    334    285    236    281    336    238    234    332 
   284   6.00000000e-01  -5.50000000e-01   0.00000000e+00    335    282    237    286    333    235    239    337 
   285   6.00000000e-01   7.50000000e-01   0.00000000e+00    336    287    238    283    338    270    236    334 
   286   6.00000000e-01  -6.50000000e-01   0.00000000e+00    337    284    239    288    335    237    271    339 
   287   6.00000000e-01   8.50000000e-01   0.00000000e+00    338    321    270    285    340    304    238    336 
   288   6.00000000e-01  -7.50000000e-01   0.00000000e+00    339    286    271    322    337    239    320    341 
   289  -3.00000000e-01   9.50000000e-01   0.00000000e+00    290     -1    291    240     -1     -1    242    241      0      0      0   5.00000000e-02   7.07106781e-02   7.07106781e-02  -3.00000000e-01   1.00000000e+00 -3.00000000e-01   1.00000000e+00 -3.00000000e-01   1.00000000e+00  0.00000000e+00   1.00000000e+00  0.00000000e+00   1.00000000e+00  0.00000000e+00   1.00000000e+00
   290  -2.00000000e-01   9.50000000e-01   0.00000000e+00    292     -1    289    241     -1     -1    240    243      0      0      0   5.00000000e-02   7.07106781e-02   7.07106781e-02  -2.00000000e-01   1.00000000e+00 -2.00000000e-01   1.00000000e+00 -2.00000000e-01   1.00000000e+00  0.00000000e+00   1.00000000e+00  0.00000000e+00   1.00000000e+00  0.00000000e+00   1.00000000e+00
   291  -4.00000000e-01   9.50000000e-01   0.00000000e+00    289     -1    293    242     -1     -1    244    240      0      0      0   5.00000000e-02   7.07106781e-02   7.07106781e-02  -4.00000000e-01   1.00000000e+00 -4.00000000e-01   1.00000000e+00 -4.00000000e-01   1.00000000e+00  0.00000000e+00   1.00000000e+00  0.00000000e+00   1.00000000e+00  0.00000000e+00   1.00000000e+00
   292  -1.00000000e-01   9.50000000e-01   0.00000000e+00    294     -1    290    243     -1     -1    241    245      0      0      0   5.00000000e-02   7.07106781e-02   7.07106781e-02  -1.00000000e-01   1.00000000e+00 -1.00000000e-01   1.00000000e+00 -1.00000000e-01   1.00000000e+00  0.00000000e+00   1.00000000e+00  0.00000000e+00   1.00000000e+00  0.00000000e+00   1.00000000e+00
   293  -5.00000000e-01   9.50000000e-01   0.00000000e+00    291     -1    295    244     -1     -1    246    242      0      0      0   5.00000000e-02   7.07106781e-02   7.07106781e-02  -5.00000000e-01   1.00000000e+00 -5.00000000e-01   1.00000000e+00 -5.00000000e-01   1.00000000e+00  0.00000000e+00   1.00000000e+00  0.00000000e+00   1.00000000e+00  0.00000000e+00   1.00000000e+00
   294   5.55111512e-17   9.50000000e-01   0.00000000e+00    296     -1    292    245     -1     -1    243    247      0      0      0   5.00000000e-02   7.07106781e-02   7.07106781e-02   0.00000000e+00   1.00000000e+00  0.00000000e+00   1.00000000e+00  0.00000000e+00   1.00000000e+00  0.00000000e+00   1.00000000e+00  0.00000000e+00   1.00000000e+00  0.00000000e+00   1.00000000e+00
   295  -6.00000000e-01   9.50000000e-01   0.00000000e+00    293     -1    297    246     -1     -1    248    244      0      0      0   5.00000000e-02   7.07106781e-02   7.07106781e-02  -6.00000000e-01   1.00000000e+00 -6.00000000e-01   1.00000000e+00 -6.00000000e-01   1.00000000e+00  0.00000000e+00   1.00000000e+00  0.00000000e+00   1.00000000e+00  0.00000000e+00   1.00000000e+00
   296   1.00000000e-01   9.50000000e-01   0.00000000e+00    298     -1    294    247     -1     -1    245    249      0      0      0   5.00000000e-02   7.07106781e-02   7.07106781e-02   1.00000000e-01   1.00000000e+00  1.00000000e-01   1.00000000e+00  1.00000000e-01   1.00000000e+00  0.00000000e+00   1.00000000e+00  0.00000000e+00   1.00000000e+00  0.00000000e+00   1.00000000e+00
   297  -7.00000000e-01   9.50000000e-01   0.00000000e+00    295     -1    299    248     -1     -1    250    246      0      0      0   5.00000000e-02   7.07106781e-02   7.07106781e-02  -7.00000000e-01   1.00000000e+00 -7.00000000e-01   1.00000000e+00 -7.00000000e-01   1.00000000e+00  0.00000000e+00   1.00000000e+00  0.00000000e+00   1.00000000e+00  0.00000000e+00   1.00000000e+00
   298   2.00000000e-01   9.50000000e-01   0.00000000e+00    300     -1    296    249     -1     -1    247    251      0      0      0   5.00000000e-02   7.07106781e-02   7.07106781e-02   2.00000000e-01   1.00000000e+00  2.00000000e-01   1.00000000e+00  2.00000000e-01   1.00000000e+00  0.00000000e+00   1.00000000e+00  0.00000000e+00   1.00000000e+00  0.00000000e+00   1.00000000e+00
   299  -8.00000000e-01   9.50000000e-01   0.00000000e+00    297     -1    301    250     -1     -1    252    248      0      0      0   5.00000000e-02   7.07106781e-02   7.07106781e-02  -8.00000000e-01   1.00000000e+00 -8.00000000e-01   1.00000000e+00 -8.00000000e-01   1.00000000e+00  0.00000000e+00   1.00000000e+00  0.00000000e+00   1.00000000e+00  0.00000000e+00   1.00000000e+00
   300   3.00000000e-01   9.50000000e-01   0.00000000e+00    302     -1    298    251     -1     -1    249    253      0      0      0   5.00000000e-02   7.07106781e-02   7.07106781e-02   3.00000000e-01   1.00000000e+00  3.00000000e-01   1.00000000e+00  3.00000000e-01   1.00000000e+00  0.00000000e+00   1.00000000e+00  0.00000000e+00   1.00000000e+00  0.00000000e+00   1.00000000e+00
   301  -9.00000000e-01   9.50000000e-01   0.00000000e+00    299     -1    303    252     -1     -1    254    250      0      0      0   5.00000000e-02   7.07106781e-02   7.07106781e-02  -9.00000000e-01   1.00000000e+00 -9.00000000e-01   1.00000000e+00 -9.00000000e-01   1.00000000e+00  0.00000000e+00   1.00000000e+00  0.00000000e+00   1.00000000e+00  0.00000000e+00   1.00000000e+00
   302   4.00000000e-01   9.50000000e-01   0.00000000e+00    304     -1    300    253     -1     -1    251    270      0      0      0   5.00000000e-02   7.07106781e-02   7.07106781e-02   4.00000000e-01   1.00000000e+00  4.00000000e-01   1.00000000e+00  4.00000000e-01   1.00000000e+00  0.00000000e+00   1.00000000e+00  0.00000000e+00   1.00000000e+00  0.00000000e+00   1.00000000e+00
   303  -1.00000000e+00   9.50000000e-01   0.00000000e+00    301     -1     -1    254     -1     -1     -1    252      0      2      0      2      2   5.00000000e-02   0.00000000e+00   7.07106781e-02   0.00000000e+00   0.00000000e+00  -1.00000000e+00   1.00000000e+00 -1.00000000e+00   9.50000000e-01 -1.00000000e+00   1.00000000e+00 -1.00000000e+00   9.50000000e-01 -1.00000000e+00   9.50000000e-01  0.00000000e+00   1.00000000e+00 -1.00000000e+00  -0.00000000e+00  0.00000000e+00   1.00000000e+00 -1.00000000e+00  -0.00000000e+00 -1.00000000e+00  -0.00000000e+00
   304   5.00000000e-01   9.50000000e-01   0.00000000e+00    321     -1    302    270     -1     -1    253    287      0      0      0   5.00000000e-02   7.07106781e-02   7.07106781e-02   5.00000000e-01   1.00000000e+00  5.00000000e-01   1.00000000e+00  5.00000000e-01   1.00000000e+00  0.00000000e+00   1.00000000e+00  0.00000000e+00   1.00000000e+00  0.00000000e+00   1.00000000e+00
   305  -3.00000000e-01  -8.50000000e-01   0.00000000e+00    307    255    306    342    257    256    343    344 
   306  -4.00000000e-01  -8.50000000e-01   0.00000000e+00    305    256    308    343    255    258    345    342 
   307  -2.00000000e-01  -8.50000000e-01   0.00000000e+00    309    257    305    344    259    255    342    346 
   308  -5.00000000e-01  -8.50000000e-01   0.00000000e+00    306    258    310    345    256    260    347    343 
   309  -1.00000000e-01  -8.50000000e-01   0.00000000e+00    311    259    307    346    261    257    344    348 
   310  -6.00000000e-01  -8.50000000e-01   0.00000000e+00    308    260    312    347    258    262    349    345 
   311   5.55111512e-17  -8.50000000e-01   0.00000000e+00    313    261    309    348    263    259    346    350 
   312  -7.00000000e-01  -8.50000000e-01   0.00000000e+00    310    262    314    349    260    264    351    347 
   313   1.00000000e-01  -8.50000000e-01   0.00000000e+00    315    263    311    350    265    261    348    352 
   314  -8.00000000e-01  -8.50000000e-01   0.00000000e+00    312    264    316    351    262    266    353    349 
   315   2.00000000e-01  -8.50000000e-01   0.00000000e+00    317    265    313    352    267    263    350    354 
   316  -9.00000000e-01  -8.50000000e-01   0.00000000e+00    314    266    318    353    264    268    355    351 
   317   3.00000000e-01  -8.50000000e-01   0.00000000e+00    319    267    315    354    269    265    352    356 
   318  -1.00000000e+00  -8.50000000e-01   0.00000000e+00    316    268     -1    355    266     -1     -1    353      2      2      2   0.00000000e+00   0.00000000e+00   0.00000000e+00  -1.00000000e+00  -8.50000000e-01 -1.00000000e+00  -8.50000000e-01 -1.00000000e+00  -8.50000000e-01 -1.00000000e+00  -0.00000000e+00 -1.00000000e+00  -0.00000000e+00 -1.00000000e+00  -0.00000000e+00
   319   4.00000000e-01  -8.50000000e-01   0.00000000e+00    320    269    317    356    271    267    354    357 
   320   5.00000000e-01  -8.50000000e-01   0.00000000e+00    322    271    319    357    288    269    356    358 
   321   6.00000000e-01   9.50000000e-01   0.00000000e+00    340     -1    304    287     -1     -1    270    338      0      0      0   5.00000000e-02   7.07106781e-02   7.07106781e-02   6.00000000e-01   1.00000000e+00  6.00000000e-01   1.00000000e+00  6.00000000e-01   1.00000000e+00  0.00000000e+00   1.00000000e+00  0.00000000e+00   1.00000000e+00  0.00000000e+00   1.00000000e+00
   322   6.00000000e-01  -8.50000000e-01   0.00000000e+00    341    288    320    358    339    271    357    359 
   323   7.00000000e-01   5.00000000e-02   0.00000000e+00    360    324    272    325    361    273    274    362 
   324   7.00000000e-01   1.50000000e-01   0.00000000e+00    361    326    273    323    363    275    272    360 
   325   7.00000000e-01  -5.00000000e-02   0.00000000e+00    362    323    274    327    360    272    276    364 
   326   7.00000000e-01   2.50000000e-01   0.00000000e+00    363    328    275    324    365    277    273    361 
   327   7.00000000e-01  -1.50000000e-01   0.00000000e+00    364    325    276    329    362    274    278    366 
   328   7.00000000e-01   3.50000000e-01   0.00000000e+00    365    330    277    326    367    279    275    363 
   329   7.00000000e-01  -2.50000000e-01   0.00000000e+00    366    327    278    331    364    276    280    368 
   330   7.00000000e-01   4.50000000e-01   0.00000000e+00    367    332    279    328    369    281    277    365 
   331   7.00000000e-01  -3.50000000e-01   0.00000000e+00    368    329    280    333    366    278    282    370 
   332   7.00000000e-01   5.50000000e-01   0.00000000e+00    369    334    281    330    371    283    279    367 
   333   7.00000000e-01  -4.50000000e-01   0.00000000e+00    370    331    282    335    368    280    284    372 
   334   7.00000000e-01   6.50000000e-01   0.00000000e+00    371    336    283    332    373    285    281    369 
   335   7.00000000e-01  -5.50000000e-01   0.00000000e+00    372    333    284    337    370    282    286    374 
   336   7.00000000e-01   7.50000000e-01   0.00000000e+00    373    338    285    334    375    287    283    371 
   337   7.00000000e-01  -6.50000000e-01   0.00000000e+00    374    335    286    339    372    284    288    376 
   338   7.00000000e-01   8.50000000e-01   0.00000000e+00    375    340    287    336    377    321    285    373 
   339   7.00000000e-01  -7.50000000e-01   0.00000000e+00    376    337    288    341    374    286    322    378 
   340   7.00000000e-01   9.50000000e-01   0.00000000e+00    377     -1    321    338     -1     -1    287    375      0      0      0   5.00000000e-02   7.07106781e-02   7.07106781e-02   7.00000000e-01   1.00000000e+00  7.00000000e-01   1.00000000e+00  7.00000000e-01   1.00000000e+00  0.00000000e+00   1.00000000e+00  0.00000000e+00   1.00000000e+00  0.00000000e+00   1.00000000e+00
   341   7.00000000e-01  -8.50000000e-01   0.00000000e+00    378    339    322    359    376    288    358    379 
   342  -3.00000000e-01  -9.50000000e-01   0.00000000e+00    344    305    343     -1    307    306     -1     -1      1      1      1   5.00000000e-02   7.07106781e-02   7.07106781e-02  -3.00000000e-01  -1.00000000e+00 -3.00000000e-01  -1.00000000e+00 -3.00000000e-01  -1.00000000e+00  0.00000000e+00  -1.00000000e+00  0.00000000e+00  -1.00000000e+00  0.00000000e+00  -1.00000000e+00
   343  -4.00000000e-01  -9.50000000e-01   0.00000000e+00    342    306    345     -1    305    308     -1     -1      1      1      1   5.00000000e-02   7.07106781e-02   7.07106781e-02  -4.00000000e-01  -1.00000000e+00 -4.00000000e-01  -1.00000000e+00 -4.00000000e-01  -1.00000000e+00  0.00000000e+00  -1.00000000e+00  0.00000000e+00  -1.00000000e+00  0.00000000e+00  -1.00000000e+00
   344  -2.00000000e-01  -9.50000000e-01   0.00000000e+00    346    307    342     -1    309    305     -1     -1      1      1      1   5.00000000e-02   7.07106781e-02   7.07106781e-02  -2.00000000e-01  -1.00000000e+00 -2.00000000e-01  -1.00000000e+00 -2.00000000e-01  -1.00000000e+00  0.00000000e+00  -1.00000000e+00  0.00000000e+00  -1.00000000e+00  0.00000000e+00  -1.00000000e+00
   345  -5.00000000e-01  -9.50000000e-01   0.00000000e+00    343    308    347     -1    306    310     -1     -1      1      1      1   5.00000000e-02   7.07106781e-02   7.07106781e-02  -5.00000000e-01  -1.00000000e+00 -5.00000000e-01  -1.00000000e+00 -5.00000000e-01  -1.00000000e+00  0.00000000e+00  -1.00000000e+00  0.00000000e+00  -1.00000000e+00  0.00000000e+00  -1.00000000e+00
   346  -1.00000000e-01  -9.50000000e-01   0.00000000e+00    348    309    344     -1    311    307     -1     -1      1      1      1   5.00000000e-02   7.07106781e-02   7.07106781e-02  -1.00000000e-01  -1.00000000e+00 -1.00000000e-01  -1.00000000e+00 -1.00000000e-01  -1.00000000e+00  0.00000000e+00  -1.00000000e+00  0.00000000e+00  -1.00000000e+00  0.00000000e+00  -1.00000000e+00
   347  -6.00000000e-01  -9.50000000e-01   0.00000000e+00    345    310    349     -1    308    312     -1     -1      1      1      1   5.00000000e-02   7.07106781e-02   7.07106781e-02  -6.00000000e-01  -1.00000000e+00 -6.00000000e-01  -1.00000000e+00 -6.00000000e-01  -1.00000000e+00  0.00000000e+00  -1.00000000e+00  0.00000000e+00  -1.00000000e+00  0.00000000e+00  -1.00000000e+00
   348   5.55111512e-17  -9.50000000e-01   0.00000000e+00    350    311    346     -1    313    309     -1     -1      1      1      1   5.00000000e-02   7.07106781e-02   7.07106781e-02   0.00000000e+00  -1.00000000e+00  0.00000000e+00  -1.00000000e+00  0.00000000e+00  -1.00000000e+00  0.00000000e+00  -1.00000000e+00  0.00000000e+00  -1.00000000e+00  0.00000000e+00  -1.00000000e+00
   349  -7.00000000e-01  -9.50000000e-01   0.00000000e+00    347    312    351     -1    310    314     -1     -1      1      1      1   5.00000000e-02   7.07106781e-02   7.07106781e-02  -7.00000000e-01  -1.00000000e+00 -7.00000000e-01  -1.00000000e+00 -7.00000000e-01  -1.00000000e+00  0.00000000e+00  -1.00000000e+00  0.00000000e+00  -1.00000000e+00  0.00000000e+00  -1.00000000e+00
   350   1.00000000e-01  -9.50000000e-01   0.00000000e+00    352    313    348     -1    315    311     -1     -1      1      1      1   5.00000000e-02   7.07106781e-02   7.07106781e-02   1.00000000e-01  -1.00000000e+00  1.00000000e-01  -1.00000000e+00  1.00000000e-01  -1.00000000e+00  0.00000000e+00  -1.00000000e+00  0.00000000e+00  -1.00000000e+00  0.00000000e+00  -1.00000000e+00
   351  -8.00000000e-01  -9.50000000e-01   0.00000000e+00    349    314    353     -1    312    316     -1     -1      1      1      1   5.00000000e-02   7.07106781e-02   7.07106781e-02  -8.00000000e-01  -1.00000000e+00 -8.00000000e-01  -1.00000000e+00 -8.00000000e-01  -1.00000000e+00  0.00000000e+00  -1.00000000e+00  0.00000000e+00  -1.00000000e+00  0.00000000e+00  -1.00000000e+00
   352   2.00000000e-01  -9.50000000e-01   0.00000000e+00    354    315    350     -1    317    313     -1     -1      1      1      1   5.00000000e-02   7.07106781e-02   7.07106781e-02   2.00000000e-01  -1.00000000e+00  2.00000000e-01  -1.00000000e+00  2.00000000e-01  -1.00000000e+00  0.00000000e+00  -1.00000000e+00  0.00000000e+00  -1.00000000e+00  0.00000000e+00  -1.00000000e+00
   353  -9.00000000e-01  -9.50000000e-01   0.00000000e+00    351    316    355     -1    314    318     -1     -1      1      1      1   5.00000000e-02   7.07106781e-02   7.07106781e-02  -9.00000000e-01  -1.00000000e+00 -9.00000000e-01  -1.00000000e+00 -9.00000000e-01  -1.00000000e+00  0.00000000e+00  -1.00000000e+00  0.00000000e+00  -1.00000000e+00  0.00000000e+00  -1.00000000e+00
   354   3.00000000e-01  -9.50000000e-01   0.00000000e+00    356    317    352     -1    319    315     -1     -1      1      1      1   5.00000000e-02   7.07106781e-02   7.07106781e-02   3.00000000e-01  -1.00000000e+00  3.00000000e-01  -1.00000000e+00  3.00000000e-01  -1.00000000e+00  0.00000000e+00  -1.00000000e+00  0.00000000e+00  -1.00000000e+00  0.00000000e+00  -1.00000000e+00
   355  -1.00000000e+00  -9.50000000e-01   0.00000000e+00    353    318     -1     -1    316     -1     -1     -1      2      1      2      2      1   0.00000000e+00   5.00000000e-02   0.00000000e+00   0.00000000e+00   7.07106781e-02  -1.00000000e+00  -9.50000000e-01 -1.00000000e+00  -1.00000000e+00 -1.00000000e+00  -9.50000000e-01 -1.00000000e+00  -9.50000000e-01 -1.00000000e+00  -1.00000000e+00 -1.00000000e+00  -0.00000000e+00  0.00000000e+00  -1.00000000e+00 -1.00000000e+00  -0.00000000e+00 -1.00000000e+00  -0.00000000e+00  0.00000000e+00  -1.00000000e+00
   356   4.00000000e-01  -9.50000000e-01   0.00000000e+00    357    319    354     -1    320    317     -1     -1      1      1      1   5.00000000e-02   7.07106781e-02   7.07106781e-02   4.00000000e-01  -1.00000000e+00  4.00000000e-01  -1.00000000e+00  4.00000000e-01  -1.00000000e+00  0.00000000e+00  -1.00000000e+00  0.00000000e+00  -1.00000000e+00  0.00000000e+00  -1.00000000e+00
   357   5.00000000e-01  -9.50000000e-01   0.00000000e+00    358    320    356     -1    322    319     -1     -1      1      1      1   5.00000000e-02   7.07106781e-02   7.07106781e-02   5.00000000e-01  -1.00000000e+00  5.00000000e-01  -1.00000000e+00  5.00000000e-01  -1.00000000e+00  0.00000000e+00  -1.00000000e+00  0.00000000e+00  -1.00000000e+00  0.00000000e+00  -1.00000000e+00
   358   6.00000000e-01  -9.50000000e-01   0.00000000e+00    359    322    357     -1    341    320     -1     -1      1      1      1   5.00000000e-02   7.07106781e-02   7.07106781e-02   6.00000000e-01  -1.00000000e+00  6.00000000e-01  -1.00000000e+00  6.00000000e-01  -1.00000000e+00  0.00000000e+00  -1.00000000e+00  0.00000000e+00  -1.00000000e+00  0.00000000e+00  -1.00000000e+00
   359   7.00000000e-01  -9.50000000e-01   0.00000000e+00    379    341    358     -1    378    322     -1     -1      1      1      1   5.00000000e-02   7.07106781e-02   7.07106781e-02   7.00000000e-01  -1.00000000e+00  7.00000000e-01  -1.00000000e+00  7.00000000e-01  -1.00000000e+00  0.00000000e+00  -1.00000000e+00  0.00000000e+00  -1.00000000e+00  0.00000000e+00  -1.00000000e+00
   360   8.00000000e-01   5.00000000e-02   0.00000000e+00    380    361    323    362    381    324    325    382 
   361   8.00000000e-01   1.50000000e-01   0.00000000e+00    381    363    324    360    383    326    323    380 
   362   8.00000000e-01  -5.00000000e-02   0.00000000e+00    382    360    325    364    380    323    327    384 
   363   8.00000000e-01   2.50000000e-01   0.00000000e+00    383    365    326    361    385    328    324    381 
   364   8.00000000e-01  -1.50000000e-01   0.00000000e+00    384    362    327    366    382    325    329    386 
   365   8.00000000e-01   3.50000000e-01   0.00000000e+00    385    367    328    363    387    330    326    383 
   366   8.00000000e-01  -2.50000000e-01   0.00000000e+00    386    364    329    368    384    327    331    388 
   367   8.00000000e-01   4.50000000e-01   0.00000000e+00    387    369    330    365    389    332    328    385 
   368   8.00000000e-01  -3.50000000e-01   0.00000000e+00    388    366    331    370    386    329    333    390 
   369   8.00000000e-01   5.50000000e-01   0.00000000e+00    389    371    332    367    391    334    330    387 
   370   8.00000000e-01  -4.50000000e-01   0.00000000e+00    390    368    333    372    388    331    335    392 
   371   8.00000000e-01   6.50000000e-01   0.00000000e+00    391    373    334    369    393    336    332    389 
   372   8.00000000e-01  -5.50000000e-01   0.00000000e+00    392    370    335    374    390    333    337    394 
   373   8.00000000e-01   7.50000000e-01   0.00000000e+00    393    375    336    371    395    338    334    391 
   374   8.00000000e-01  -6.50000000e-01   0.00000000e+00    394    372    337    376    392    335    339    396 
   375   8.00000000e-01   8.50000000e-01   0.00000000e+00    395    377    338    373    397    340    336    393 
   376   8.00000000e-01  -7.50000000e-01   0.00000000e+00    396    374    339    378    394    337    341    398 
   377   8.00000000e-01   9.50000000e-01   0.00000000e+00    397     -1    340    375     -1     -1    338    395      0      0      0   5.00000000e-02   7.07106781e-02   7.07106781e-02   8.00000000e-01   1.00000000e+00  8.00000000e-01   1.00000000e+00  8.00000000e-01   1.00000000e+00  0.00000000e+00   1.00000000e+00  0.00000000e+00   1.00000000e+00  0.00000000e+00   1.00000000e+00
   378   8.00000000e-01  -8.50000000e-01   0.00000000e+00    398    376    341    379    396    339    359    399 
   379   8.00000000e-01  -9.50000000e-01   0.00000000e+00    399    378    359     -1    398    341     -1     -1      1      1      1   5.00000000e-02   7.07106781e-02   7.07106781e-02   8.00000000e-01  -1.00000000e+00  8.00000000e-01  -1.00000000e+00  8.00000000e-01  -1.00000000e+00  0.00000000e+00  -1.00000000e+00  0.00000000e+00  -1.00000000e+00  0.00000000e+00  -1.00000000e+00
   380   9.00000000e-01   5.00000000e-02   0.00000000e+00    400    381    360    382    401    361    362    402 
   381   9.00000000e-01   1.50000000e-01   0.00000000e+00    401    383    361    380    403    363    360    400 
   382   9.00000000e-01  -5.00000000e-02   0.00000000e+00    402    380    362    384    400    360    364    404 
   383   9.00000000e-01   2.50000000e-01   0.00000000e+00    403    385    363    381    405    365    361    401 
   384   9.00000000e-01  -1.50000000e-01   0.00000000e+00    404    382    364    386    402    362    366    406 
   385   9.00000000e-01   3.50000000e-01   0.00000000e+00    405    387    365    383    407    367    363    403 
   386   9.00000000e-01  -2.50000000e-01   0.00000000e+00    406    384    366    388    404    364    368    408 
   387   9.00000000e-01   4.50000000e-01   0.00000000e+00    407    389    367    385    409    369    365    405 
   388   9.00000000e-01  -3.50000000e-01   0.00000000e+00    408    386    368    390    406    366    370    410 
   389   9.00000000e-01   5.50000000e-01   0.00000000e+00    409    391    369    387    411    371    367    407 
   390   9.00000000e-01  -4.50000000e-01   0.00000000e+00    410    388    370    392    408    368    372    412 
   391   9.00000000e-01   6.50000000e-01   0.00000000e+00    411    393    371    389    413    373    369    409 
   392   9.00000000e-01  -5.50000000e-01   0.00000000e+00    412    390    372    394    410    370    374    414 
   393   9.00000000e-01   7.50000000e-01   0.00000000e+00    413    395    373    391    415    375    371    411 
   394   9.00000000e-01  -6.50000000e-01   0.00000000e+00    414    392    374    396    412    372    376    416 
   395   9.00000000e-01   8.50000000e-01   0.00000000e+00    415    397    375    393    417    377    373    413 
   396   9.00000000e-01  -7.50000000e-01   0.00000000e+00    416    394    376    398    414    374    378    418 
   397   9.00000000e-01   9.50000000e-01   0.00000000e+00    417     -1    377    395     -1     -1    375    415      0      0      0   5.00000000e-02   7.07106781e-02   7.07106781e-02   9.00000000e-01   1.00000000e+00  9.00000000e-01   1.00000000e+00  9.00000000e-01   1.00000000e+00  0.00000000e+00   1.00000000e+00  0.00000000e+00   1.00000000e+00  0.00000000e+00   1.00000000e+00
   398   9.00000000e-01  -8.50000000e-01   0.00000000e+00    418    396    378    399    416    376    379    419 
   399   9.00000000e-01  -9.50000000e-01   0.00000000e+00    419    398    379     -1    418    378     -1     -1      1      1      1   5.00000000e-02   7.07106781e-02   7.07106781e-02   9.00000000e-01  -1.00000000e+00  9.00000000e-01  -1.00000000e+00  9.00000000e-01  -1.00000000e+00  0.00000000e+00  -1.00000000e+00  0.00000000e+00  -1.00000000e+00  0.00000000e+00  -1.00000000e+00
   400   1.00000000e+00   5.00000000e-02   0.00000000e+00     -1    401    380    402     -1    381    382     -1      2      2      2   0.00000000e+00   0.00000000e+00   0.00000000e+00   1.00000000e+00   5.00000000e-02  1.00000000e+00   5.00000000e-02  1.00000000e+00   5.00000000e-02  1.00000000e+00  -0.00000000e+00  1.00000000e+00  -0.00000000e+00  1.00000000e+00  -0.00000000e+00
   401   1.00000000e+00   1.50000000e-01   0.00000000e+00     -1    403    381    400     -1    383    380     -1      2      2      2   0.00000000e+00   0.00000000e+00   0.00000000e+00   1.00000000e+00   1.50000000e-01  1.00000000e+00   1.50000000e-01  1.00000000e+00   1.50000000e-01  1.00000000e+00  -0.00000000e+00  1.00000000e+00  -0.00000000e+00  1.00000000e+00  -0.00000000e+00
   402   1.00000000e+00  -5.00000000e-02   0.00000000e+00     -1    400    382    404     -1    380    384     -1      2      2      2   0.00000000e+00   0.00000000e+00   0.00000000e+00   1.00000000e+00  -5.00000000e-02  1.00000000e+00  -5.00000000e-02  1.00000000e+00  -5.00000000e-02  1.00000000e+00  -0.00000000e+00  1.00000000e+00  -0.00000000e+00  1.00000000e+00  -0.00000000e+00
   403   1.00000000e+00   2.50000000e-01   0.00000000e+00     -1    405    383    401     -1    385    381     -1      2      2      2   0.00000000e+00   0.00000000e+00   0.00000000e+00   1.00000000e+00   2.50000000e-01  1.00000000e+00   2.50000000e-01  1.00000000e+00   2.50000000e-01  1.00000000e+00  -0.00000000e+00  1.00000000e+00  -0.00000000e+00  1.00000000e+00  -0.00000000e+00
   404   1.00000000e+00  -1.50000000e-01   0.00000000e+00     -1    402    384    406     -1    382    386     -1      2      2      2   0.00000000e+00   0.00000000e+00   0.00000000e+00   1.00000000e+00  -1.50000000e-01  1.00000000e+00  -1.50000000e-01  1.00000000e+00  -1.50000000e-01  1.00000000e+00  -0.00000000e+00  1.00000000e+00  -0.00000000e+00  1.00000000e+00  -0.00000000e+00
   405   1.00000000e+00   3.50000000e-01   0.00000000e+00     -1    407    385    403     -1    387    383     -1      2      2      2   0.00000000e+00   0.00000000e+00   0.00000000e+00   1.00000000e+00   3.50000000e-01  1.00000000e+00   3.50000000e-01  1.00000000e+00   3.50000000e-01  1.00000000e+00  -0.00000000e+00  1.00000000e+00  -0.00000000e+00  1.00000000e+00  -0.00000000e+00
   406   1.00000000e+00  -2.50000000e-01   0.00000000e+00     -1    404    386    408     -1    384    388     -1      2      2      2   0.00000000e+00   0.00000000e+00   0.00000000e+00   1.00000000e+00  -2.50000000e-01  1.00000000e+00  -2.50000000e-01  1.00000000e+00  -2.50000000e-01  1.00000000e+00  -0.00000000e+00  1.00000000e+00  -0.00000000e+00  1.00000000e+00  -0.00000000e+00
   407   1.00000000e+00   4.50000000e-01   0.00000000e+00     -1    409    387    405     -1    389    385     -1      2      2      2   0.00000000e+00   0.00000000e+00   0.00000000e+00   1.00000000e+00   4.50000000e-01  1.00000000e+00   4.50000000e-01  1.00000000e+00   4.50000000e-01  1.00000000e+00  -0.00000000e+00  1.00000000e+00  -0.00000000e+00  1.00000000e+00  -0.00000000e+00
   408   1.00000000e+00  -3.50000000e-01   0.00000000e+00     -1    406    388    410     -1    386    390     -1      2      2      2   0.00000000e+00   0.00000000e+00   0.00000000e+00   1.00000000e+00  -3.50000000e-01  1.00000000e+00  -3.50000000e-01  1.00000000e+00  -3.50000000e-01  1.00000000e+00  -0.00000000e+00  1.00000000e+00  -0.00000000e+00  1.00000000e+00  -0.00000000e+00
   409   1.00000000e+00   5.50000000e-01   0.00000000e+00     -1    411    389    407     -1    391    387     -1      2      2      2   0.00000000e+00   0.00000000e+00   0.00000000e+00   1.00000000e+00   5.50000000e-01  1.00000000e+00   5.50000000e-01  1.00000000e+00   5.50000000e-01  1.00000000e+00  -0.00000000e+00  1.00000000e+00  -0.00000000e+00  1.00000000e+00  -0.00000000e+00
   410   1.00000000e+00  -4.50000000e-01   0.00000000e+00     -1    408    390    412     -1    388    392     -1      2      2      2   0.00000000e+00   0.00000000e+00   0.00000000e+00   1.00000000e+00  -4.50000000e-01  1.00000000e+00  -4.50000000e-01  1.00000000e+00  -4.50000000e-01  1.00000000e+00  -0.00000000e+00  1.00000000e+00  -0.00000000e+00  1.00000000e+00  -0.00000000e+00
   411   1.00000000e+00   6.50000000e-01   0.00000000e+00     -1    413    391    409     -1    393    389     -1      2      2      2   0.00000000e+00   0.00000000e+00   0.00000000e+00   1.00000000e+00   6.50000000e-01  1.00000000e+00   6.50000000e-01  1.00000000e+00   6.50000000e-01  1.00000000e+00  -0.00000000e+00  1.00000000e+00  -0.00000000e+00  1.00000000e+00  -0.00000000e+00
   412   1.00000000e+00  -5.50000000e-01   0.00000000e+00     -1    410    392    414     -1    390    394     -1      2      2      2   0.00000000e+00   0.00000000e+00   0.00000000e+00   1.00000000e+00  -5.50000000e-01  1.00000000e+00  -5.50000000e-01  1.00000000e+00  -5.50000000e-01  1.00000000e+00  -0.00000000e+00  1.00000000e+00  -0.00000000e+00  1.00000000e+00  -0.00000000e+00
   413   1.00000000e+00   7.50000000e-01   0.00000000e+00     -1    415    393    411     -1    395    391     -1      2      2      2   0.00000000e+00   0.00000000e+00   0.00000000e+00   1.00000000e+00   7.50000000e-01  1.00000000e+00   7.50000000e-01  1.00000000e+00   7.50000000e-01  1.00000000e+00  -0.00000000e+00  1.00000000e+00  -0.00000000e+00  1.00000000e+00  -0.00000000e+00
   414   1.00000000e+00  -6.50000000e-01   0.00000000e+00     -1    412    394    416     -1    392    396     -1      2      2      2   0.00000000e+00   0.00000000e+00   0.00000000e+00   1.00000000e+00  -6.50000000e-01  1.00000000e+00  -6.50000000e-01  1.00000000e+00  -6.50000000e-01  1.00000000e+00  -0.00000000e+00  1.00000000e+00  -0.00000000e+00  1.00000000e+00  -0.00000000e+00
   415   1.00000000e+00   8.50000000e-01   0.00000000e+00     -1    417    395    413     -1    397    393     -1      2      2      2   0.00000000e+00   0.00000000e+00   0.00000000e+00   1.00000000e+00   8.50000000e-01  1.00000000e+00   8.50000000e-01  1.00000000e+00   8.50000000e-01  1.00000000e+00  -0.00000000e+00  1.00000000e+00  -0.00000000e+00  1.00000000e+00  -0.00000000e+00
   416   1.00000000e+00  -7.50000000e-01   0.00000000e+00     -1    414    396    418     -1    394    398     -1      2      2      2   0.00000000e+00   0.00000000e+00   0.00000000e+00   1.00000000e+00  -7.50000000e-01  1.00000000e+00  -7.50000000e-01  1.00000000e+00  -7.50000000e-01  1.00000000e+00  -0.00000000e+00  1.00000000e+00  -0.00000000e+00  1.00000000e+00  -0.00000000e+00
   417   1.00000000e+00   9.50000000e-01   0.00000000e+00     -1     -1    397    415     -1     -1    395     -1      2      0      2      0      2   0.00000000e+00   5.00000000e-02   0.00000000e+00   0.00000000e+00   0.00000000e+00   1.00000000e+00   9.50000000e-01  1.00000000e+00   1.00000000e+00  1.00000000e+00   9.50000000e-01  1.00000000e+00   1.00000000e+00  1.00000000e+00   9.50000000e-01  1.00000000e+00  -0.00000000e+00  0.00000000e+00   1.00000000e+00  1.00000000e+00  -0.00000000e+00  0.00000000e+00   1.00000000e+00  1.00000000e+00  -0.00000000e+00
   418   1.00000000e+00  -8.50000000e-01   0.00000000e+00     -1    416    398    419     -1    396    399     -1      2      2      2   0.00000000e+00   0.00000000e+00   0.00000000e+00   1.00000000e+00  -8.50000000e-01  1.00000000e+00  -8.50000000e-01  1.00000000e+00  -8.50000000e-01  1.00000000e+00  -0.00000000e+00  1.00000000e+00  -0.00000000e+00  1.00000000e+00  -0.00000000e+00
   419   1.00000000e+00  -9.50000000e-01   0.00000000e+00     -1    418    399     -1     -1    398     -1     -1      2      1      2      1      2   0.00000000e+00   5.00000000e-02   0.00000000e+00   7.07106781e-02   0.00000000e+00   1.00000000e+00  -9.50000000e-01  1.00000000e+00  -1.00000000e+00  1.00000000e+00  -9.50000000e-01  1.00000000e+00  -1.00000000e+00  1.00000000e+00  -9.50000000e-01  1.00000000e+00  -0.00000000e+00  0.00000000e+00  -1.00000000e+00  1.00000000e+00  -0.00000000e+00  0.00000000e+00  -1.00000000e+00  1.00000000e+00  -0.00000000e+00
