#2D-Boundary

POINTS
-2.0 -2.0 0.0
+2.0 -2.0 0.0
+2.0 +2.0 0.0
+0.05 +2.0 0.0
+0.05 +1.5 0.0
-0.05 +1.5 0.0
-0.05 +2.0 0.0
-2.0 +2.0 0.0
0.0 0.0 0.0
ENDPOINTS

LINES
1 2 0
2 3 1
3 4 0
4 5 0
5 6 0
6 7 0
7 8 0
8 1 2
ENDLINES

CIRCLES
9 0.5 1 3
ENDCIRCLES