# CellSize = 0.05 
# n is number of missing lattice links at boundary lattice sites 
# velocity set D2Q5 
# ID | x | y | z | ID x+ | ID y+ | ID x- | ID y- [| n x Bnd IDs | n x Bnd Distance | n x [x,y] Closest Point on Boundary | n x [x,y] Bnd Normal at Closest Point] 
     0  -2.75000000e-01   2.50000000e-02   0.00000000e+00      1      3      2      4 
     1  -2.25000000e-01   2.50000000e-02   0.00000000e+00      5      6      0      7 
     2  -3.25000000e-01   2.50000000e-02   0.00000000e+00      0      9      8     10 
     3  -2.75000000e-01   7.50000000e-02   0.00000000e+00      6     11      9      0 
     4  -2.75000000e-01  -2.50000000e-02   0.00000000e+00      7      0     10     12 
     5  -1.75000000e-01   2.50000000e-02   0.00000000e+00     13     14      1     15 
     6  -2.25000000e-01   7.50000000e-02   0.00000000e+00     14     16      3      1 
     7  -2.25000000e-01  -2.50000000e-02   0.00000000e+00     15      1      4     17 
     8  -3.75000000e-01   2.50000000e-02   0.00000000e+00      2     19     18     20 
     9  -3.25000000e-01   7.50000000e-02   0.00000000e+00      3     21     19      2 
    10  -3.25000000e-01  -2.50000000e-02   0.00000000e+00      4      2     20     22 
    11  -2.75000000e-01   1.25000000e-01   0.00000000e+00     16     23     21      3 
    12  -2.75000000e-01  -7.50000000e-02   0.00000000e+00     17      4     22     24 
    13  -1.25000000e-01   2.50000000e-02   0.00000000e+00     25     26      5     27 
    14  -1.75000000e-01   7.50000000e-02   0.00000000e+00     26     28      6      5 
    15  -1.75000000e-01  -2.50000000e-02   0.00000000e+00     27      5      7     29 
    16  -2.25000000e-01   1.25000000e-01   0.00000000e+00     28     30     11      6 
    17  -2.25000000e-01  -7.50000000e-02   0.00000000e+00     29      7     12     31 
    18  -4.25000000e-01   2.50000000e-02   0.00000000e+00      8     33     32     34 
    19  -3.75000000e-01   7.50000000e-02   0.00000000e+00      9     35     33      8 
    20  -3.75000000e-01  -2.50000000e-02   0.00000000e+00     10      8     34     36 
    21  -3.25000000e-01   1.25000000e-01   0.00000000e+00     11     37     35      9 
    22  -3.25000000e-01  -7.50000000e-02   0.00000000e+00     12     10     36     38 
    23  -2.75000000e-01   1.75000000e-01   0.00000000e+00     30     39     37     11 
    24  -2.75000000e-01  -1.25000000e-01   0.00000000e+00     31     12     38     40 
    25  -7.50000000e-02   2.50000000e-02   0.00000000e+00     41     42     13     43 
    26  -1.25000000e-01   7.50000000e-02   0.00000000e+00     42     44     14     13 
    27  -1.25000000e-01  -2.50000000e-02   0.00000000e+00     43     13     15     45 
    28  -1.75000000e-01   1.25000000e-01   0.00000000e+00     44     46     16     14 
    29  -1.75000000e-01  -7.50000000e-02   0.00000000e+00     45     15     17     47 
    30  -2.25000000e-01   1.75000000e-01   0.00000000e+00     46     48     23     16 
    31  -2.25000000e-01  -1.25000000e-01   0.00000000e+00     47     17     24     49 
    32  -4.75000000e-01   2.50000000e-02   0.00000000e+00     18     50     -1     51      2   2.50000000e-02  -5.00000000e-01   2.50000000e-02 -1.00000000e+00  -0.00000000e+00
    33  -4.25000000e-01   7.50000000e-02   0.00000000e+00     19     52     50     18 
    34  -4.25000000e-01  -2.50000000e-02   0.00000000e+00     20     18     51     53 
    35  -3.75000000e-01   1.25000000e-01   0.00000000e+00     21     54     52     19 
    36  -3.75000000e-01  -7.50000000e-02   0.00000000e+00     22     20     53     55 
    37  -3.25000000e-01   1.75000000e-01   0.00000000e+00     23     56     54     21 
    38  -3.25000000e-01  -1.25000000e-01   0.00000000e+00     24     22     55     57 
    39  -2.75000000e-01   2.25000000e-01   0.00000000e+00     48     58     56     23 
    40  -2.75000000e-01  -1.75000000e-01   0.00000000e+00     49     24     57     59 
    41  -2.50000000e-02   2.50000000e-02   0.00000000e+00     60     61     25     62 
    42  -7.50000000e-02   7.50000000e-02   0.00000000e+00     61     63     26     25 
    43  -7.50000000e-02  -2.50000000e-02   0.00000000e+00     62     25     27     64 
    44  -1.25000000e-01   1.25000000e-01   0.00000000e+00     63     65     28     26 
    45  -1.25000000e-01  -7.50000000e-02   0.00000000e+00     64     27     29     66 
    46  -1.75000000e-01   1.75000000e-01   0.00000000e+00     65     67     30     28 
    47  -1.75000000e-01  -1.25000000e-01   0.00000000e+00     66     29     31     68 
    48  -2.25000000e-01   2.25000000e-01   0.00000000e+00     67     69     39     30 
    49  -2.25000000e-01  -1.75000000e-01   0.00000000e+00     68     31     40     70 
    50  -4.75000000e-01   7.50000000e-02   0.00000000e+00     33     71     -1     32      2   2.50000000e-02  -5.00000000e-01   7.50000000e-02 -1.00000000e+00  -0.00000000e+00
    51  -4.75000000e-01  -2.50000000e-02   0.00000000e+00     34     32     -1     72      2   2.50000000e-02  -5.00000000e-01  -2.50000000e-02 -1.00000000e+00  -0.00000000e+00
    52  -4.25000000e-01   1.25000000e-01   0.00000000e+00     35     73     71     33 
    53  -4.25000000e-01  -7.50000000e-02   0.00000000e+00     36     34     72     74 
    54  -3.75000000e-01   1.75000000e-01   0.00000000e+00     37     75     73     35 
    55  -3.75000000e-01  -1.25000000e-01   0.00000000e+00     38     36     74     76 
    56  -3.25000000e-01   2.25000000e-01   0.00000000e+00     39     77     75     37 
    57  -3.25000000e-01  -1.75000000e-01   0.00000000e+00     40     38     76     78 
    58  -2.75000000e-01   2.75000000e-01   0.00000000e+00     69     79     77     39 
    59  -2.75000000e-01  -2.25000000e-01   0.00000000e+00     70     40     78     80 
    60   2.50000000e-02   2.50000000e-02   0.00000000e+00     81     82     41     83 
    61  -2.50000000e-02   7.50000000e-02   0.00000000e+00     82     84     42     41 
    62  -2.50000000e-02  -2.50000000e-02   0.00000000e+00     83     41     43     85 
    63  -7.50000000e-02   1.25000000e-01   0.00000000e+00     84     86     44     42 
    64  -7.50000000e-02  -7.50000000e-02   0.00000000e+00     85     43     45     87 
    65  -1.25000000e-01   1.75000000e-01   0.00000000e+00     86     88     46     44 
    66  -1.25000000e-01  -1.25000000e-01   0.00000000e+00     87     45     47     89 
    67  -1.75000000e-01   2.25000000e-01   0.00000000e+00     88     90     48     46 
    68  -1.75000000e-01  -1.75000000e-01   0.00000000e+00     89     47     49     91 
    69  -2.25000000e-01   2.75000000e-01   0.00000000e+00     90     92     58     48 
    70  -2.25000000e-01  -2.25000000e-01   0.00000000e+00     91     49     59     93 
    71  -4.75000000e-01   1.25000000e-01   0.00000000e+00     52     94     -1     50      2   2.50000000e-02  -5.00000000e-01   1.25000000e-01 -1.00000000e+00  -0.00000000e+00
    72  -4.75000000e-01  -7.50000000e-02   0.00000000e+00     53     51     -1     95      2   2.50000000e-02  -5.00000000e-01  -7.50000000e-02 -1.00000000e+00  -0.00000000e+00
    73  -4.25000000e-01   1.75000000e-01   0.00000000e+00     54     96     94     52 
    74  -4.25000000e-01  -1.25000000e-01   0.00000000e+00     55     53     95     97 
    75  -3.75000000e-01   2.25000000e-01   0.00000000e+00     56     98     96     54 
    76  -3.75000000e-01  -1.75000000e-01   0.00000000e+00     57     55     97     99 
    77  -3.25000000e-01   2.75000000e-01   0.00000000e+00     58    100     98     56 
    78  -3.25000000e-01  -2.25000000e-01   0.00000000e+00     59     57     99    101 
    79  -2.75000000e-01   3.25000000e-01   0.00000000e+00     92    102    100     58 
    80  -2.75000000e-01  -2.75000000e-01   0.00000000e+00     93     59    101    103 
    81   7.50000000e-02   2.50000000e-02   0.00000000e+00    104    105     60    106 
    82   2.50000000e-02   7.50000000e-02   0.00000000e+00    105    107     61     60 
    83   2.50000000e-02  -2.50000000e-02   0.00000000e+00    106     60     62    108 
    84  -2.50000000e-02   1.25000000e-01   0.00000000e+00    107    109     63     61 
    85  -2.50000000e-02  -7.50000000e-02   0.00000000e+00    108     62     64    110 
    86  -7.50000000e-02   1.75000000e-01   0.00000000e+00    109    111     65     63 
    87  -7.50000000e-02  -1.25000000e-01   0.00000000e+00    110     64     66    112 
    88  -1.25000000e-01   2.25000000e-01   0.00000000e+00    111    113     67     65 
    89  -1.25000000e-01  -1.75000000e-01   0.00000000e+00    112     66     68    114 
    90  -1.75000000e-01   2.75000000e-01   0.00000000e+00    113    115     69     67 
    91  -1.75000000e-01  -2.25000000e-01   0.00000000e+00    114     68     70    116 
    92  -2.25000000e-01   3.25000000e-01   0.00000000e+00    115    117     79     69 
    93  -2.25000000e-01  -2.75000000e-01   0.00000000e+00    116     70     80    118 
    94  -4.75000000e-01   1.75000000e-01   0.00000000e+00     73    119     -1     71      2   2.50000000e-02  -5.00000000e-01   1.75000000e-01 -1.00000000e+00  -0.00000000e+00
    95  -4.75000000e-01  -1.25000000e-01   0.00000000e+00     74     72     -1    120      2   2.50000000e-02  -5.00000000e-01  -1.25000000e-01 -1.00000000e+00  -0.00000000e+00
    96  -4.25000000e-01   2.25000000e-01   0.00000000e+00     75    121    119     73 
    97  -4.25000000e-01  -1.75000000e-01   0.00000000e+00     76     74    120    122 
    98  -3.75000000e-01   2.75000000e-01   0.00000000e+00     77    123    121     75 
    99  -3.75000000e-01  -2.25000000e-01   0.00000000e+00     78     76    122    124 
   100  -3.25000000e-01   3.25000000e-01   0.00000000e+00     79    125    123     77 
   101  -3.25000000e-01  -2.75000000e-01   0.00000000e+00     80     78    124    126 
   102  -2.75000000e-01   3.75000000e-01   0.00000000e+00    117    127    125     79 
   103  -2.75000000e-01  -3.25000000e-01   0.00000000e+00    118     80    126    128 
   104   1.25000000e-01   2.50000000e-02   0.00000000e+00    129    130     81    131 
   105   7.50000000e-02   7.50000000e-02   0.00000000e+00    130    132     82     81 
   106   7.50000000e-02  -2.50000000e-02   0.00000000e+00    131     81     83    133 
   107   2.50000000e-02   1.25000000e-01   0.00000000e+00    132    134     84     82 
   108   2.50000000e-02  -7.50000000e-02   0.00000000e+00    133     83     85    135 
   109  -2.50000000e-02   1.75000000e-01   0.00000000e+00    134    136     86     84 
   110  -2.50000000e-02  -1.25000000e-01   0.00000000e+00    135     85     87    137 
   111  -7.50000000e-02   2.25000000e-01   0.00000000e+00    136    138     88     86 
   112  -7.50000000e-02  -1.75000000e-01   0.00000000e+00    137     87     89    139 
   113  -1.25000000e-01   2.75000000e-01   0.00000000e+00    138    140     90     88 
   114  -1.25000000e-01  -2.25000000e-01   0.00000000e+00    139     89     91    141 
   115  -1.75000000e-01   3.25000000e-01   0.00000000e+00    140    142     92     90 
   116  -1.75000000e-01  -2.75000000e-01   0.00000000e+00    141     91     93    143 
   117  -2.25000000e-01   3.75000000e-01   0.00000000e+00    142    144    102     92 
   118  -2.25000000e-01  -3.25000000e-01   0.00000000e+00    143     93    103    145 
   119  -4.75000000e-01   2.25000000e-01   0.00000000e+00     96    146     -1     94      2   2.50000000e-02  -5.00000000e-01   2.25000000e-01 -1.00000000e+00  -0.00000000e+00
   120  -4.75000000e-01  -1.75000000e-01   0.00000000e+00     97     95     -1    147      2   2.50000000e-02  -5.00000000e-01  -1.75000000e-01 -1.00000000e+00  -0.00000000e+00
   121  -4.25000000e-01   2.75000000e-01   0.00000000e+00     98    148    146     96 
   122  -4.25000000e-01  -2.25000000e-01   0.00000000e+00     99     97    147    149 
   123  -3.75000000e-01   3.25000000e-01   0.00000000e+00    100    150    148     98 
   124  -3.75000000e-01  -2.75000000e-01   0.00000000e+00    101     99    149    151 
   125  -3.25000000e-01   3.75000000e-01   0.00000000e+00    102    152    150    100 
   126  -3.25000000e-01  -3.25000000e-01   0.00000000e+00    103    101    151    153 
   127  -2.75000000e-01   4.25000000e-01   0.00000000e+00    144    154    152    102 
   128  -2.75000000e-01  -3.75000000e-01   0.00000000e+00    145    103    153    155 
   129   1.75000000e-01   2.50000000e-02   0.00000000e+00    156    157    104    158 
   130   1.25000000e-01   7.50000000e-02   0.00000000e+00    157    159    105    104 
   131   1.25000000e-01  -2.50000000e-02   0.00000000e+00    158    104    106    160 
   132   7.50000000e-02   1.25000000e-01   0.00000000e+00    159    161    107    105 
   133   7.50000000e-02  -7.50000000e-02   0.00000000e+00    160    106    108    162 
   134   2.50000000e-02   1.75000000e-01   0.00000000e+00    161    163    109    107 
   135   2.50000000e-02  -1.25000000e-01   0.00000000e+00    162    108    110    164 
   136  -2.50000000e-02   2.25000000e-01   0.00000000e+00    163    165    111    109 
   137  -2.50000000e-02  -1.75000000e-01   0.00000000e+00    164    110    112    166 
   138  -7.50000000e-02   2.75000000e-01   0.00000000e+00    165    167    113    111 
   139  -7.50000000e-02  -2.25000000e-01   0.00000000e+00    166    112    114    168 
   140  -1.25000000e-01   3.25000000e-01   0.00000000e+00    167    169    115    113 
   141  -1.25000000e-01  -2.75000000e-01   0.00000000e+00    168    114    116    170 
   142  -1.75000000e-01   3.75000000e-01   0.00000000e+00    169    171    117    115 
   143  -1.75000000e-01  -3.25000000e-01   0.00000000e+00    170    116    118    172 
   144  -2.25000000e-01   4.25000000e-01   0.00000000e+00    171    173    127    117 
   145  -2.25000000e-01  -3.75000000e-01   0.00000000e+00    172    118    128    174 
   146  -4.75000000e-01   2.75000000e-01   0.00000000e+00    121    175     -1    119      2   2.50000000e-02  -5.00000000e-01   2.75000000e-01 -1.00000000e+00  -0.00000000e+00
   147  -4.75000000e-01  -2.25000000e-01   0.00000000e+00    122    120     -1    176      2   2.50000000e-02  -5.00000000e-01  -2.25000000e-01 -1.00000000e+00  -0.00000000e+00
   148  -4.25000000e-01   3.25000000e-01   0.00000000e+00    123    177    175    121 
   149  -4.25000000e-01  -2.75000000e-01   0.00000000e+00    124    122    176    178 
   150  -3.75000000e-01   3.75000000e-01   0.00000000e+00    125    179    177    123 
   151  -3.75000000e-01  -3.25000000e-01   0.00000000e+00    126    124    178    180 
   152  -3.25000000e-01   4.25000000e-01   0.00000000e+00    127    181    179    125 
   153  -3.25000000e-01  -3.75000000e-01   0.00000000e+00    128    126    180    182 
   154  -2.75000000e-01   4.75000000e-01   0.00000000e+00    173     -1    181    127      0   2.50000000e-02  -2.75000000e-01   5.00000000e-01  0.00000000e+00   1.00000000e+00
   155  -2.75000000e-01  -4.25000000e-01   0.00000000e+00    174    128    182    183 
   156   2.25000000e-01   2.50000000e-02   0.00000000e+00    184    185    129    186 
   157   1.75000000e-01   7.50000000e-02   0.00000000e+00    185    187    130    129 
   158   1.75000000e-01  -2.50000000e-02   0.00000000e+00    186    129    131    188 
   159   1.25000000e-01   1.25000000e-01   0.00000000e+00    187    189    132    130 
   160   1.25000000e-01  -7.50000000e-02   0.00000000e+00    188    131    133    190 
   161   7.50000000e-02   1.75000000e-01   0.00000000e+00    189    191    134    132 
   162   7.50000000e-02  -1.25000000e-01   0.00000000e+00    190    133    135    192 
   163   2.50000000e-02   2.25000000e-01   0.00000000e+00    191    193    136    134 
   164   2.50000000e-02  -1.75000000e-01   0.00000000e+00    192    135    137    194 
   165  -2.50000000e-02   2.75000000e-01   0.00000000e+00    193    195    138    136 
   166  -2.50000000e-02  -2.25000000e-01   0.00000000e+00    194    137    139    196 
   167  -7.50000000e-02   3.25000000e-01   0.00000000e+00    195    197    140    138 
   168  -7.50000000e-02  -2.75000000e-01   0.00000000e+00    196    139    141    198 
   169  -1.25000000e-01   3.75000000e-01   0.00000000e+00    197    199    142    140 
   170  -1.25000000e-01  -3.25000000e-01   0.00000000e+00    198    141    143    200 
   171  -1.75000000e-01   4.25000000e-01   0.00000000e+00    199    201    144    142 
   172  -1.75000000e-01  -3.75000000e-01   0.00000000e+00    200    143    145    202 
   173  -2.25000000e-01   4.75000000e-01   0.00000000e+00    201     -1    154    144      0   2.50000000e-02  -2.25000000e-01   5.00000000e-01  0.00000000e+00   1.00000000e+00
   174  -2.25000000e-01  -4.25000000e-01   0.00000000e+00    202    145    155    203 
   175  -4.75000000e-01   3.25000000e-01   0.00000000e+00    148    204     -1    146      2   2.50000000e-02  -5.00000000e-01   3.25000000e-01 -1.00000000e+00  -0.00000000e+00
   176  -4.75000000e-01  -2.75000000e-01   0.00000000e+00    149    147     -1    205      2   2.50000000e-02  -5.00000000e-01  -2.75000000e-01 -1.00000000e+00  -0.00000000e+00
   177  -4.25000000e-01   3.75000000e-01   0.00000000e+00    150    206    204    148 
   178  -4.25000000e-01  -3.25000000e-01   0.00000000e+00    151    149    205    207 
   179  -3.75000000e-01   4.25000000e-01   0.00000000e+00    152    208    206    150 
   180  -3.75000000e-01  -3.75000000e-01   0.00000000e+00    153    151    207    209 
   181  -3.25000000e-01   4.75000000e-01   0.00000000e+00    154     -1    208    152      0   2.50000000e-02  -3.25000000e-01   5.00000000e-01  0.00000000e+00   1.00000000e+00
   182  -3.25000000e-01  -4.25000000e-01   0.00000000e+00    155    153    209    210 
   183  -2.75000000e-01  -4.75000000e-01   0.00000000e+00    203    155    210     -1      1   2.50000000e-02  -2.75000000e-01  -5.00000000e-01  0.00000000e+00  -1.00000000e+00
   184   2.75000000e-01   2.50000000e-02   0.00000000e+00    211    212    156    213 
   185   2.25000000e-01   7.50000000e-02   0.00000000e+00    212    214    157    156 
   186   2.25000000e-01  -2.50000000e-02   0.00000000e+00    213    156    158    215 
   187   1.75000000e-01   1.25000000e-01   0.00000000e+00    214    216    159    157 
   188   1.75000000e-01  -7.50000000e-02   0.00000000e+00    215    158    160    217 
   189   1.25000000e-01   1.75000000e-01   0.00000000e+00    216    218    161    159 
   190   1.25000000e-01  -1.25000000e-01   0.00000000e+00    217    160    162    219 
   191   7.50000000e-02   2.25000000e-01   0.00000000e+00    218    220    163    161 
   192   7.50000000e-02  -1.75000000e-01   0.00000000e+00    219    162    164    221 
   193   2.50000000e-02   2.75000000e-01   0.00000000e+00    220    222    165    163 
   194   2.50000000e-02  -2.25000000e-01   0.00000000e+00    221    164    166    223 
   195  -2.50000000e-02   3.25000000e-01   0.00000000e+00    222    224    167    165 
   196  -2.50000000e-02  -2.75000000e-01   0.00000000e+00    223    166    168    225 
   197  -7.50000000e-02   3.75000000e-01   0.00000000e+00    224    226    169    167 
   198  -7.50000000e-02  -3.25000000e-01   0.00000000e+00    225    168    170    227 
   199  -1.25000000e-01   4.25000000e-01   0.00000000e+00    226    228    171    169 
   200  -1.25000000e-01  -3.75000000e-01   0.00000000e+00    227    170    172    229 
   201  -1.75000000e-01   4.75000000e-01   0.00000000e+00    228     -1    173    171      0   2.50000000e-02  -1.75000000e-01   5.00000000e-01  0.00000000e+00   1.00000000e+00
   202  -1.75000000e-01  -4.25000000e-01   0.00000000e+00    229    172    174    230 
   203  -2.25000000e-01  -4.75000000e-01   0.00000000e+00    230    174    183     -1      1   2.50000000e-02  -2.25000000e-01  -5.00000000e-01  0.00000000e+00  -1.00000000e+00
   204  -4.75000000e-01   3.75000000e-01   0.00000000e+00    177    231     -1    175      2   2.50000000e-02  -5.00000000e-01   3.75000000e-01 -1.00000000e+00  -0.00000000e+00
   205  -4.75000000e-01  -3.25000000e-01   0.00000000e+00    178    176     -1    232      2   2.50000000e-02  -5.00000000e-01  -3.25000000e-01 -1.00000000e+00  -0.00000000e+00
   206  -4.25000000e-01   4.25000000e-01   0.00000000e+00    179    233    231    177 
   207  -4.25000000e-01  -3.75000000e-01   0.00000000e+00    180    178    232    234 
   208  -3.75000000e-01   4.75000000e-01   0.00000000e+00    181     -1    233    179      0   2.50000000e-02  -3.75000000e-01   5.00000000e-01  0.00000000e+00   1.00000000e+00
   209  -3.75000000e-01  -4.25000000e-01   0.00000000e+00    182    180    234    235 
   210  -3.25000000e-01  -4.75000000e-01   0.00000000e+00    183    182    235     -1      1   2.50000000e-02  -3.25000000e-01  -5.00000000e-01  0.00000000e+00  -1.00000000e+00
   211   3.25000000e-01   2.50000000e-02   0.00000000e+00    236    237    184    238 
   212   2.75000000e-01   7.50000000e-02   0.00000000e+00    237    239    185    184 
   213   2.75000000e-01  -2.50000000e-02   0.00000000e+00    238    184    186    240 
   214   2.25000000e-01   1.25000000e-01   0.00000000e+00    239    241    187    185 
   215   2.25000000e-01  -7.50000000e-02   0.00000000e+00    240    186    188    242 
   216   1.75000000e-01   1.75000000e-01   0.00000000e+00    241    243    189    187 
   217   1.75000000e-01  -1.25000000e-01   0.00000000e+00    242    188    190    244 
   218   1.25000000e-01   2.25000000e-01   0.00000000e+00    243    245    191    189 
   219   1.25000000e-01  -1.75000000e-01   0.00000000e+00    244    190    192    246 
   220   7.50000000e-02   2.75000000e-01   0.00000000e+00    245    247    193    191 
   221   7.50000000e-02  -2.25000000e-01   0.00000000e+00    246    192    194    248 
   222   2.50000000e-02   3.25000000e-01   0.00000000e+00    247    249    195    193 
   223   2.50000000e-02  -2.75000000e-01   0.00000000e+00    248    194    196    250 
   224  -2.50000000e-02   3.75000000e-01   0.00000000e+00    249    251    197    195 
   225  -2.50000000e-02  -3.25000000e-01   0.00000000e+00    250    196    198    252 
   226  -7.50000000e-02   4.25000000e-01   0.00000000e+00    251    253    199    197 
   227  -7.50000000e-02  -3.75000000e-01   0.00000000e+00    252    198    200    254 
   228  -1.25000000e-01   4.75000000e-01   0.00000000e+00    253     -1    201    199      0   2.50000000e-02  -1.25000000e-01   5.00000000e-01  0.00000000e+00   1.00000000e+00
   229  -1.25000000e-01  -4.25000000e-01   0.00000000e+00    254    200    202    255 
   230  -1.75000000e-01  -4.75000000e-01   0.00000000e+00    255    202    203     -1      1   2.50000000e-02  -1.75000000e-01  -5.00000000e-01  0.00000000e+00  -1.00000000e+00
   231  -4.75000000e-01   4.25000000e-01   0.00000000e+00    206    256     -1    204      2   2.50000000e-02  -5.00000000e-01   4.25000000e-01 -1.00000000e+00  -0.00000000e+00
   232  -4.75000000e-01  -3.75000000e-01   0.00000000e+00    207    205     -1    257      2   2.50000000e-02  -5.00000000e-01  -3.75000000e-01 -1.00000000e+00  -0.00000000e+00
   233  -4.25000000e-01   4.75000000e-01   0.00000000e+00    208     -1    256    206      0   2.50000000e-02  -4.25000000e-01   5.00000000e-01  0.00000000e+00   1.00000000e+00
   234  -4.25000000e-01  -4.25000000e-01   0.00000000e+00    209    207    257    258 
   235  -3.75000000e-01  -4.75000000e-01   0.00000000e+00    210    209    258     -1      1   2.50000000e-02  -3.75000000e-01  -5.00000000e-01  0.00000000e+00  -1.00000000e+00
   236   3.75000000e-01   2.50000000e-02   0.00000000e+00    259    260    211    261 
   237   3.25000000e-01   7.50000000e-02   0.00000000e+00    260    262    212    211 
   238   3.25000000e-01  -2.50000000e-02   0.00000000e+00    261    211    213    263 
   239   2.75000000e-01   1.25000000e-01   0.00000000e+00    262    264    214    212 
   240   2.75000000e-01  -7.50000000e-02   0.00000000e+00    263    213    215    265 
   241   2.25000000e-01   1.75000000e-01   0.00000000e+00    264    266    216    214 
   242   2.25000000e-01  -1.25000000e-01   0.00000000e+00    265    215    217    267 
   243   1.75000000e-01   2.25000000e-01   0.00000000e+00    266    268    218    216 
   244   1.75000000e-01  -1.75000000e-01   0.00000000e+00    267    217    219    269 
   245   1.25000000e-01   2.75000000e-01   0.00000000e+00    268    270    220    218 
   246   1.25000000e-01  -2.25000000e-01   0.00000000e+00    269    219    221    271 
   247   7.50000000e-02   3.25000000e-01   0.00000000e+00    270    272    222    220 
   248   7.50000000e-02  -2.75000000e-01   0.00000000e+00    271    221    223    273 
   249   2.50000000e-02   3.75000000e-01   0.00000000e+00    272    274    224    222 
   250   2.50000000e-02  -3.25000000e-01   0.00000000e+00    273    223    225    275 
   251  -2.50000000e-02   4.25000000e-01   0.00000000e+00    274    276    226    224 
   252  -2.50000000e-02  -3.75000000e-01   0.00000000e+00    275    225    227    277 
   253  -7.50000000e-02   4.75000000e-01   0.00000000e+00    276     -1    228    226      0   2.50000000e-02  -7.50000000e-02   5.00000000e-01  0.00000000e+00   1.00000000e+00
   254  -7.50000000e-02  -4.25000000e-01   0.00000000e+00    277    227    229    278 
   255  -1.25000000e-01  -4.75000000e-01   0.00000000e+00    278    229    230     -1      1   2.50000000e-02  -1.25000000e-01  -5.00000000e-01  0.00000000e+00  -1.00000000e+00
   256  -4.75000000e-01   4.75000000e-01   0.00000000e+00    233     -1     -1    231      0      2   2.50000000e-02   2.50000000e-02  -4.75000000e-01   5.00000000e-01 -5.00000000e-01   4.75000000e-01  0.00000000e+00   1.00000000e+00 -1.00000000e+00  -0.00000000e+00
   257  -4.75000000e-01  -4.25000000e-01   0.00000000e+00    234    232     -1    279      2   2.50000000e-02  -5.00000000e-01  -4.25000000e-01 -1.00000000e+00  -0.00000000e+00
   258  -4.25000000e-01  -4.75000000e-01   0.00000000e+00    235    234    279     -1      1   2.50000000e-02  -4.25000000e-01  -5.00000000e-01  0.00000000e+00  -1.00000000e+00
   259   4.25000000e-01   2.50000000e-02   0.00000000e+00    280    281    236    282 
   260   3.75000000e-01   7.50000000e-02   0.00000000e+00    281    283    237    236 
   261   3.75000000e-01  -2.50000000e-02   0.00000000e+00    282    236    238    284 
   262   3.25000000e-01   1.25000000e-01   0.00000000e+00    283    285    239    237 
   263   3.25000000e-01  -7.50000000e-02   0.00000000e+00    284    238    240    286 
   264   2.75000000e-01   1.75000000e-01   0.00000000e+00    285    287    241    239 
   265   2.75000000e-01  -1.25000000e-01   0.00000000e+00    286    240    242    288 
   266   2.25000000e-01   2.25000000e-01   0.00000000e+00    287    289    243    241 
   267   2.25000000e-01  -1.75000000e-01   0.00000000e+00    288    242    244    290 
   268   1.75000000e-01   2.75000000e-01   0.00000000e+00    289    291    245    243 
   269   1.75000000e-01  -2.25000000e-01   0.00000000e+00    290    244    246    292 
   270   1.25000000e-01   3.25000000e-01   0.00000000e+00    291    293    247    245 
   271   1.25000000e-01  -2.75000000e-01   0.00000000e+00    292    246    248    294 
   272   7.50000000e-02   3.75000000e-01   0.00000000e+00    293    295    249    247 
   273   7.50000000e-02  -3.25000000e-01   0.00000000e+00    294    248    250    296 
   274   2.50000000e-02   4.25000000e-01   0.00000000e+00    295    297    251    249 
   275   2.50000000e-02  -3.75000000e-01   0.00000000e+00    296    250    252    298 
   276  -2.50000000e-02   4.75000000e-01   0.00000000e+00    297     -1    253    251      0   2.50000000e-02  -2.50000000e-02   5.00000000e-01  0.00000000e+00   1.00000000e+00
   277  -2.50000000e-02  -4.25000000e-01   0.00000000e+00    298    252    254    299 
   278  -7.50000000e-02  -4.75000000e-01   0.00000000e+00    299    254    255     -1      1   2.50000000e-02  -7.50000000e-02  -5.00000000e-01  0.00000000e+00  -1.00000000e+00
   279  -4.75000000e-01  -4.75000000e-01   0.00000000e+00    258    257     -1     -1      2      1   2.50000000e-02   2.50000000e-02  -5.00000000e-01  -4.75000000e-01 -4.75000000e-01  -5.00000000e-01 -1.00000000e+00  -0.00000000e+00  0.00000000e+00  -1.00000000e+00
   280   4.75000000e-01   2.50000000e-02   0.00000000e+00     -1    300    259    301      2   2.50000000e-02   5.00000000e-01   2.50000000e-02  1.00000000e+00  -0.00000000e+00
   281   4.25000000e-01   7.50000000e-02   0.00000000e+00    300    302    260    259 
   282   4.25000000e-01  -2.50000000e-02   0.00000000e+00    301    259    261    303 
   283   3.75000000e-01   1.25000000e-01   0.00000000e+00    302    304    262    260 
   284   3.75000000e-01  -7.50000000e-02   0.00000000e+00    303    261    263    305 
   285   3.25000000e-01   1.75000000e-01   0.00000000e+00    304    306    264    262 
   286   3.25000000e-01  -1.25000000e-01   0.00000000e+00    305    263    265    307 
   287   2.75000000e-01   2.25000000e-01   0.00000000e+00    306    308    266    264 
   288   2.75000000e-01  -1.75000000e-01   0.00000000e+00    307    265    267    309 
   289   2.25000000e-01   2.75000000e-01   0.00000000e+00    308    310    268    266 
   290   2.25000000e-01  -2.25000000e-01   0.00000000e+00    309    267    269    311 
   291   1.75000000e-01   3.25000000e-01   0.00000000e+00    310    312    270    268 
   292   1.75000000e-01  -2.75000000e-01   0.00000000e+00    311    269    271    313 
   293   1.25000000e-01   3.75000000e-01   0.00000000e+00    312    314    272    270 
   294   1.25000000e-01  -3.25000000e-01   0.00000000e+00    313    271    273    315 
   295   7.50000000e-02   4.25000000e-01   0.00000000e+00    314    316    274    272 
   296   7.50000000e-02  -3.75000000e-01   0.00000000e+00    315    273    275    317 
   297   2.50000000e-02   4.75000000e-01   0.00000000e+00    316     -1    276    274      0   2.50000000e-02   2.50000000e-02   5.00000000e-01  0.00000000e+00   1.00000000e+00
   298   2.50000000e-02  -4.25000000e-01   0.00000000e+00    317    275    277    318 
   299  -2.50000000e-02  -4.75000000e-01   0.00000000e+00    318    277    278     -1      1   2.50000000e-02  -2.50000000e-02  -5.00000000e-01  0.00000000e+00  -1.00000000e+00
   300   4.75000000e-01   7.50000000e-02   0.00000000e+00     -1    319    281    280      2   2.50000000e-02   5.00000000e-01   7.50000000e-02  1.00000000e+00  -0.00000000e+00
   301   4.75000000e-01  -2.50000000e-02   0.00000000e+00     -1    280    282    320      2   2.50000000e-02   5.00000000e-01  -2.50000000e-02  1.00000000e+00  -0.00000000e+00
   302   4.25000000e-01   1.25000000e-01   0.00000000e+00    319    321    283    281 
   303   4.25000000e-01  -7.50000000e-02   0.00000000e+00    320    282    284    322 
   304   3.75000000e-01   1.75000000e-01   0.00000000e+00    321    323    285    283 
   305   3.75000000e-01  -1.25000000e-01   0.00000000e+00    322    284    286    324 
   306   3.25000000e-01   2.25000000e-01   0.00000000e+00    323    325    287    285 
   307   3.25000000e-01  -1.75000000e-01   0.00000000e+00    324    286    288    326 
   308   2.75000000e-01   2.75000000e-01   0.00000000e+00    325    327    289    287 
   309   2.75000000e-01  -2.25000000e-01   0.00000000e+00    326    288    290    328 
   310   2.25000000e-01   3.25000000e-01   0.00000000e+00    327    329    291    289 
   311   2.25000000e-01  -2.75000000e-01   0.00000000e+00    328    290    292    330 
   312   1.75000000e-01   3.75000000e-01   0.00000000e+00    329    331    293    291 
   313   1.75000000e-01  -3.25000000e-01   0.00000000e+00    330    292    294    332 
   314   1.25000000e-01   4.25000000e-01   0.00000000e+00    331    333    295    293 
   315   1.25000000e-01  -3.75000000e-01   0.00000000e+00    332    294    296    334 
   316   7.50000000e-02   4.75000000e-01   0.00000000e+00    333     -1    297    295      0   2.50000000e-02   7.50000000e-02   5.00000000e-01  0.00000000e+00   1.00000000e+00
   317   7.50000000e-02  -4.25000000e-01   0.00000000e+00    334    296    298    335 
   318   2.50000000e-02  -4.75000000e-01   0.00000000e+00    335    298    299     -1      1   2.50000000e-02   2.50000000e-02  -5.00000000e-01  0.00000000e+00  -1.00000000e+00
   319   4.75000000e-01   1.25000000e-01   0.00000000e+00     -1    336    302    300      2   2.50000000e-02   5.00000000e-01   1.25000000e-01  1.00000000e+00  -0.00000000e+00
   320   4.75000000e-01  -7.50000000e-02   0.00000000e+00     -1    301    303    337      2   2.50000000e-02   5.00000000e-01  -7.50000000e-02  1.00000000e+00  -0.00000000e+00
   321   4.25000000e-01   1.75000000e-01   0.00000000e+00    336    338    304    302 
   322   4.25000000e-01  -1.25000000e-01   0.00000000e+00    337    303    305    339 
   323   3.75000000e-01   2.25000000e-01   0.00000000e+00    338    340    306    304 
   324   3.75000000e-01  -1.75000000e-01   0.00000000e+00    339    305    307    341 
   325   3.25000000e-01   2.75000000e-01   0.00000000e+00    340    342    308    306 
   326   3.25000000e-01  -2.25000000e-01   0.00000000e+00    341    307    309    343 
   327   2.75000000e-01   3.25000000e-01   0.00000000e+00    342    344    310    308 
   328   2.75000000e-01  -2.75000000e-01   0.00000000e+00    343    309    311    345 
   329   2.25000000e-01   3.75000000e-01   0.00000000e+00    344    346    312    310 
   330   2.25000000e-01  -3.25000000e-01   0.00000000e+00    345    311    313    347 
   331   1.75000000e-01   4.25000000e-01   0.00000000e+00    346    348    314    312 
   332   1.75000000e-01  -3.75000000e-01   0.00000000e+00    347    313    315    349 
   333   1.25000000e-01   4.75000000e-01   0.00000000e+00    348     -1    316    314      0   2.50000000e-02   1.25000000e-01   5.00000000e-01  0.00000000e+00   1.00000000e+00
   334   1.25000000e-01  -4.25000000e-01   0.00000000e+00    349    315    317    350 
   335   7.50000000e-02  -4.75000000e-01   0.00000000e+00    350    317    318     -1      1   2.50000000e-02   7.50000000e-02  -5.00000000e-01  0.00000000e+00  -1.00000000e+00
   336   4.75000000e-01   1.75000000e-01   0.00000000e+00     -1    351    321    319      2   2.50000000e-02   5.00000000e-01   1.75000000e-01  1.00000000e+00  -0.00000000e+00
   337   4.75000000e-01  -1.25000000e-01   0.00000000e+00     -1    320    322    352      2   2.50000000e-02   5.00000000e-01  -1.25000000e-01  1.00000000e+00  -0.00000000e+00
   338   4.25000000e-01   2.25000000e-01   0.00000000e+00    351    353    323    321 
   339   4.25000000e-01  -1.75000000e-01   0.00000000e+00    352    322    324    354 
   340   3.75000000e-01   2.75000000e-01   0.00000000e+00    353    355    325    323 
   341   3.75000000e-01  -2.25000000e-01   0.00000000e+00    354    324    326    356 
   342   3.25000000e-01   3.25000000e-01   0.00000000e+00    355    357    327    325 
   343   3.25000000e-01  -2.75000000e-01   0.00000000e+00    356    326    328    358 
   344   2.75000000e-01   3.75000000e-01   0.00000000e+00    357    359    329    327 
   345   2.75000000e-01  -3.25000000e-01   0.00000000e+00    358    328    330    360 
   346   2.25000000e-01   4.25000000e-01   0.00000000e+00    359    361    331    329 
   347   2.25000000e-01  -3.75000000e-01   0.00000000e+00    360    330    332    362 
   348   1.75000000e-01   4.75000000e-01   0.00000000e+00    361     -1    333    331      0   2.50000000e-02   1.75000000e-01   5.00000000e-01  0.00000000e+00   1.00000000e+00
   349   1.75000000e-01  -4.25000000e-01   0.00000000e+00    362    332    334    363 
   350   1.25000000e-01  -4.75000000e-01   0.00000000e+00    363    334    335     -1      1   2.50000000e-02   1.25000000e-01  -5.00000000e-01  0.00000000e+00  -1.00000000e+00
   351   4.75000000e-01   2.25000000e-01   0.00000000e+00     -1    364    338    336      2   2.50000000e-02   5.00000000e-01   2.25000000e-01  1.00000000e+00  -0.00000000e+00
   352   4.75000000e-01  -1.75000000e-01   0.00000000e+00     -1    337    339    365      2   2.50000000e-02   5.00000000e-01  -1.75000000e-01  1.00000000e+00  -0.00000000e+00
   353   4.25000000e-01   2.75000000e-01   0.00000000e+00    364    366    340    338 
   354   4.25000000e-01  -2.25000000e-01   0.00000000e+00    365    339    341    367 
   355   3.75000000e-01   3.25000000e-01   0.00000000e+00    366    368    342    340 
   356   3.75000000e-01  -2.75000000e-01   0.00000000e+00    367    341    343    369 
   357   3.25000000e-01   3.75000000e-01   0.00000000e+00    368    370    344    342 
   358   3.25000000e-01  -3.25000000e-01   0.00000000e+00    369    343    345    371 
   359   2.75000000e-01   4.25000000e-01   0.00000000e+00    370    372    346    344 
   360   2.75000000e-01  -3.75000000e-01   0.00000000e+00    371    345    347    373 
   361   2.25000000e-01   4.75000000e-01   0.00000000e+00    372     -1    348    346      0   2.50000000e-02   2.25000000e-01   5.00000000e-01  0.00000000e+00   1.00000000e+00
   362   2.25000000e-01  -4.25000000e-01   0.00000000e+00    373    347    349    374 
   363   1.75000000e-01  -4.75000000e-01   0.00000000e+00    374    349    350     -1      1   2.50000000e-02   1.75000000e-01  -5.00000000e-01  0.00000000e+00  -1.00000000e+00
   364   4.75000000e-01   2.75000000e-01   0.00000000e+00     -1    375    353    351      2   2.50000000e-02   5.00000000e-01   2.75000000e-01  1.00000000e+00  -0.00000000e+00
   365   4.75000000e-01  -2.25000000e-01   0.00000000e+00     -1    352    354    376      2   2.50000000e-02   5.00000000e-01  -2.25000000e-01  1.00000000e+00  -0.00000000e+00
   366   4.25000000e-01   3.25000000e-01   0.00000000e+00    375    377    355    353 
   367   4.25000000e-01  -2.75000000e-01   0.00000000e+00    376    354    356    378 
   368   3.75000000e-01   3.75000000e-01   0.00000000e+00    377    379    357    355 
   369   3.75000000e-01  -3.25000000e-01   0.00000000e+00    378    356    358    380 
   370   3.25000000e-01   4.25000000e-01   0.00000000e+00    379    381    359    357 
   371   3.25000000e-01  -3.75000000e-01   0.00000000e+00    380    358    360    382 
   372   2.75000000e-01   4.75000000e-01   0.00000000e+00    381     -1    361    359      0   2.50000000e-02   2.75000000e-01   5.00000000e-01  0.00000000e+00   1.00000000e+00
   373   2.75000000e-01  -4.25000000e-01   0.00000000e+00    382    360    362    383 
   374   2.25000000e-01  -4.75000000e-01   0.00000000e+00    383    362    363     -1      1   2.50000000e-02   2.25000000e-01  -5.00000000e-01  0.00000000e+00  -1.00000000e+00
   375   4.75000000e-01   3.25000000e-01   0.00000000e+00     -1    384    366    364      2   2.50000000e-02   5.00000000e-01   3.25000000e-01  1.00000000e+00  -0.00000000e+00
   376   4.75000000e-01  -2.75000000e-01   0.00000000e+00     -1    365    367    385      2   2.50000000e-02   5.00000000e-01  -2.75000000e-01  1.00000000e+00  -0.00000000e+00
   377   4.25000000e-01   3.75000000e-01   0.00000000e+00    384    386    368    366 
   378   4.25000000e-01  -3.25000000e-01   0.00000000e+00    385    367    369    387 
   379   3.75000000e-01   4.25000000e-01   0.00000000e+00    386    388    370    368 
   380   3.75000000e-01  -3.75000000e-01   0.00000000e+00    387    369    371    389 
   381   3.25000000e-01   4.75000000e-01   0.00000000e+00    388     -1    372    370      0   2.50000000e-02   3.25000000e-01   5.00000000e-01  0.00000000e+00   1.00000000e+00
   382   3.25000000e-01  -4.25000000e-01   0.00000000e+00    389    371    373    390 
   383   2.75000000e-01  -4.75000000e-01   0.00000000e+00    390    373    374     -1      1   2.50000000e-02   2.75000000e-01  -5.00000000e-01  0.00000000e+00  -1.00000000e+00
   384   4.75000000e-01   3.75000000e-01   0.00000000e+00     -1    391    377    375      2   2.50000000e-02   5.00000000e-01   3.75000000e-01  1.00000000e+00  -0.00000000e+00
   385   4.75000000e-01  -3.25000000e-01   0.00000000e+00     -1    376    378    392      2   2.50000000e-02   5.00000000e-01  -3.25000000e-01  1.00000000e+00  -0.00000000e+00
   386   4.25000000e-01   4.25000000e-01   0.00000000e+00    391    393    379    377 
   387   4.25000000e-01  -3.75000000e-01   0.00000000e+00    392    378    380    394 
   388   3.75000000e-01   4.75000000e-01   0.00000000e+00    393     -1    381    379      0   2.50000000e-02   3.75000000e-01   5.00000000e-01  0.00000000e+00   1.00000000e+00
   389   3.75000000e-01  -4.25000000e-01   0.00000000e+00    394    380    382    395 
   390   3.25000000e-01  -4.75000000e-01   0.00000000e+00    395    382    383     -1      1   2.50000000e-02   3.25000000e-01  -5.00000000e-01  0.00000000e+00  -1.00000000e+00
   391   4.75000000e-01   4.25000000e-01   0.00000000e+00     -1    396    386    384      2   2.50000000e-02   5.00000000e-01   4.25000000e-01  1.00000000e+00  -0.00000000e+00
   392   4.75000000e-01  -3.75000000e-01   0.00000000e+00     -1    385    387    397      2   2.50000000e-02   5.00000000e-01  -3.75000000e-01  1.00000000e+00  -0.00000000e+00
   393   4.25000000e-01   4.75000000e-01   0.00000000e+00    396     -1    388    386      0   2.50000000e-02   4.25000000e-01   5.00000000e-01  0.00000000e+00   1.00000000e+00
   394   4.25000000e-01  -4.25000000e-01   0.00000000e+00    397    387    389    398 
   395   3.75000000e-01  -4.75000000e-01   0.00000000e+00    398    389    390     -1      1   2.50000000e-02   3.75000000e-01  -5.00000000e-01  0.00000000e+00  -1.00000000e+00
   396   4.75000000e-01   4.75000000e-01   0.00000000e+00     -1     -1    393    391      2      0   2.50000000e-02   2.50000000e-02   5.00000000e-01   4.75000000e-01  4.75000000e-01   5.00000000e-01  1.00000000e+00  -0.00000000e+00  0.00000000e+00   1.00000000e+00
   397   4.75000000e-01  -4.25000000e-01   0.00000000e+00     -1    392    394    399      2   2.50000000e-02   5.00000000e-01  -4.25000000e-01  1.00000000e+00  -0.00000000e+00
   398   4.25000000e-01  -4.75000000e-01   0.00000000e+00    399    394    395     -1      1   2.50000000e-02   4.25000000e-01  -5.00000000e-01  0.00000000e+00  -1.00000000e+00
   399   4.75000000e-01  -4.75000000e-01   0.00000000e+00     -1    397    398     -1      2      1   2.50000000e-02   2.50000000e-02   5.00000000e-01  -4.75000000e-01  4.75000000e-01  -5.00000000e-01  1.00000000e+00  -0.00000000e+00  0.00000000e+00  -1.00000000e+00
