#2D-Boundary

POINTS
-2.0 -2.0 0.0
+2.0 -2.0 0.0
+2.0 +2.0 0.0
-2.0 +2.0 0.0
 0.0  0.0 0.0
-2.0 +1.0 0.0
-1.5 +1.0 0.0
+2.0 -1.0 0.0
1.25 -1.0 0.0
ENDPOINTS

LINES
1 2 1
2 3 3
3 4 0
4 1 3
ENDLINES

CIRCLES
5 0.625 1 3
ENDCIRCLES

CRACKS
6 7 3 3
8 9 3 3
ENDCRACKS
