<?xml version="1.0" encoding="UTF-8" standalone="no"?><svg xmlns="http://www.w3.org/2000/svg" xmlns:xlink="http://www.w3.org/1999/xlink" contentScriptType="application/ecmascript" contentStyleType="text/css" height="226px" preserveAspectRatio="none" style="width:356px;height:226px;" version="1.1" viewBox="0 0 356 226" width="356px" zoomAndPan="magnify"><defs/><g><ellipse cx="212.25" cy="20" fill="#000000" rx="10" ry="10" style="stroke: none; stroke-width: 1.0;"/><polygon fill="#FFED00" points="165.75,50,258.75,50,270.75,62,258.75,74,165.75,74,153.75,62,165.75,50" style="stroke: #00549F; stroke-width: 2.0;"/><text fill="#000000" font-family="Arial" font-size="11" font-weight="bold" lengthAdjust="spacingAndGlyphs" textLength="93" x="165.75" y="66.1733">multiprocessor?</text><text fill="#000000" font-family="Arial" font-size="11" lengthAdjust="spacingAndGlyphs" textLength="18" x="135.75" y="59.8489">yes</text><text fill="#000000" font-family="Arial" font-size="11" lengthAdjust="spacingAndGlyphs" textLength="48" x="270.75" y="59.8489">monoproc</text><rect fill="#80A9CF" height="6" rx="2.5" ry="2.5" style="stroke: #80A9CF; stroke-width: 1.0;" width="228" x="10" y="84"/><rect fill="#FFED00" height="32.6489" rx="12.5" ry="12.5" style="stroke: #00549F; stroke-width: 2.0;" width="87" x="22" y="110"/><text fill="#000000" font-family="Arial" font-size="11" font-weight="bold" lengthAdjust="spacingAndGlyphs" textLength="67" x="32" y="130.4978">Treatment 1</text><rect fill="#FFED00" height="32.6489" rx="12.5" ry="12.5" style="stroke: #00549F; stroke-width: 2.0;" width="87" x="137" y="110"/><text fill="#000000" font-family="Arial" font-size="11" font-weight="bold" lengthAdjust="spacingAndGlyphs" textLength="67" x="147" y="130.4978">Treatment 2</text><rect fill="#80A9CF" height="6" rx="2.5" ry="2.5" style="stroke: #80A9CF; stroke-width: 1.0;" width="228" x="10" y="162.6489"/><rect fill="#FFED00" height="32.6489" rx="12.5" ry="12.5" style="stroke: #00549F; stroke-width: 2.0;" width="87" x="258" y="84"/><text fill="#000000" font-family="Arial" font-size="11" font-weight="bold" lengthAdjust="spacingAndGlyphs" textLength="67" x="268" y="104.4978">Treatment 1</text><rect fill="#FFED00" height="32.6489" rx="12.5" ry="12.5" style="stroke: #00549F; stroke-width: 2.0;" width="87" x="258" y="151.6489"/><text fill="#000000" font-family="Arial" font-size="11" font-weight="bold" lengthAdjust="spacingAndGlyphs" textLength="67" x="268" y="172.1467">Treatment 2</text><polygon fill="#FFED00" points="212.25,190.2979,224.25,202.2979,212.25,214.2979,200.25,202.2979,212.25,190.2979" style="stroke: #00549F; stroke-width: 2.0;"/><line style="stroke: #00549F; stroke-width: 1.5;" x1="65.5" x2="65.5" y1="90" y2="110"/><polygon fill="#00549F" points="61.5,100,65.5,110,69.5,100,65.5,104" style="stroke: #00549F; stroke-width: 1.0;"/><line style="stroke: #00549F; stroke-width: 1.5;" x1="180.5" x2="180.5" y1="90" y2="110"/><polygon fill="#00549F" points="176.5,100,180.5,110,184.5,100,180.5,104" style="stroke: #00549F; stroke-width: 1.0;"/><line style="stroke: #00549F; stroke-width: 1.5;" x1="65.5" x2="65.5" y1="142.6489" y2="162.6489"/><polygon fill="#00549F" points="61.5,152.6489,65.5,162.6489,69.5,152.6489,65.5,156.6489" style="stroke: #00549F; stroke-width: 1.0;"/><line style="stroke: #00549F; stroke-width: 1.5;" x1="180.5" x2="180.5" y1="142.6489" y2="162.6489"/><polygon fill="#00549F" points="176.5,152.6489,180.5,162.6489,184.5,152.6489,180.5,156.6489" style="stroke: #00549F; stroke-width: 1.0;"/><line style="stroke: #00549F; stroke-width: 1.5;" x1="301.5" x2="301.5" y1="116.6489" y2="151.6489"/><polygon fill="#00549F" points="297.5,141.6489,301.5,151.6489,305.5,141.6489,301.5,145.6489" style="stroke: #00549F; stroke-width: 1.0;"/><line style="stroke: #00549F; stroke-width: 1.5;" x1="153.75" x2="123" y1="62" y2="62"/><line style="stroke: #00549F; stroke-width: 1.5;" x1="123" x2="123" y1="62" y2="84"/><polygon fill="#00549F" points="119,74,123,84,127,74,123,78" style="stroke: #00549F; stroke-width: 1.0;"/><line style="stroke: #00549F; stroke-width: 1.5;" x1="270.75" x2="301.5" y1="62" y2="62"/><line style="stroke: #00549F; stroke-width: 1.5;" x1="301.5" x2="301.5" y1="62" y2="84"/><polygon fill="#00549F" points="297.5,74,301.5,84,305.5,74,301.5,78" style="stroke: #00549F; stroke-width: 1.0;"/><line style="stroke: #00549F; stroke-width: 1.5;" x1="123" x2="123" y1="168.6489" y2="202.2979"/><line style="stroke: #00549F; stroke-width: 1.5;" x1="123" x2="200.25" y1="202.2979" y2="202.2979"/><polygon fill="#00549F" points="190.25,198.2979,200.25,202.2979,190.25,206.2979,194.25,202.2979" style="stroke: #00549F; stroke-width: 1.0;"/><line style="stroke: #00549F; stroke-width: 1.5;" x1="301.5" x2="301.5" y1="184.2979" y2="202.2979"/><line style="stroke: #00549F; stroke-width: 1.5;" x1="301.5" x2="224.25" y1="202.2979" y2="202.2979"/><polygon fill="#00549F" points="234.25,198.2979,224.25,202.2979,234.25,206.2979,230.25,202.2979" style="stroke: #00549F; stroke-width: 1.0;"/><line style="stroke: #00549F; stroke-width: 1.5;" x1="212.25" x2="212.25" y1="30" y2="50"/><polygon fill="#00549F" points="208.25,40,212.25,50,216.25,40,212.25,44" style="stroke: #00549F; stroke-width: 1.0;"/><!--MD5=[e6f3724df0be96f5da151d2b1de0f494]
@startuml
!define _dark_blue #00549F
!define _light_blue #80A9CF
!define _yellow #FFED00
!define _grey #646567

skinparam Shadowing false

skinparam Activity {
    BackgroundColor _yellow
    BorderThickness 2
    BorderColor _dark_blue
    BarColor _light_blue
    FontStyle bold
    DiamondBackgroundColor _yellow
    DiamondBorderColor _dark_blue
    DiamondFontStyle bold
}

skinparam Actor {
    BackgroundColor _dark_blue
    BorderThickness 2
    BorderColor _dark_blue
}

skinparam Agent {
    BackgroundColor _yellow
    FontStyle bold
    BorderThickness 2
    BorderColor _dark_blue
}

skinparam Arrow {
    Color _dark_blue
    Thickness 2
}

skinparam Boundary {
    BackgroundColor _yellow
    BorderThickness 2
    BorderColor _dark_blue
}

skinparam Class {
    BackgroundColor White
    BorderThickness 1
    BorderColor _dark_blue
}

skinparam Cloud {
    BackgroundColor LightGrey
    BorderThickness 2
    BorderColor _dark_blue
}

skinparam Collections {
    BackgroundColor _yellow
    BorderThickness 2
    BorderColor _dark_blue
}

skinparam Component {
    BackgroundColor _yellow
    FontStyle bold
    BorderThickness 2
    BorderColor _dark_blue
}

skinparam Control {
    BackgroundColor _yellow
    BorderThickness 2
    BorderColor _dark_blue
}

skinparam Database {
    BackgroundColor LightGrey
    BorderThickness 2
    BorderColor _dark_blue
}

skinparam Default {
    FontName Arial
    FontSize 11
    FontColor Black
    FontStyle normal
}

skinparam Entity {
    BackgroundColor _yellow
    BorderThickness 2
    BorderColor _dark_blue
}

skinparam File {
    BackgroundColor _yellow
    FontStyle bold
    BorderThickness 2
    BorderColor _dark_blue
}

skinparam Folder {
    BackgroundColor LightGrey
    BorderThickness 2
    BorderColor _dark_blue
}

skinparam Frame {
    BackgroundColor LightGrey
    BorderThickness 2
    BorderColor _dark_blue
}

skinparam Interface {
    BackgroundColor _yellow
    BorderThickness 2
    BorderColor _dark_blue
}

skinparam LifeLine {
    BackgroundColor _yellow
    BorderThickness 2
    BorderColor _dark_blue
}

skinparam Node {
    BackgroundColor LightGrey
    BorderThickness 2
    BorderColor _dark_blue
}

skinparam Object {
    BackgroundColor _yellow
    FontStyle bold
    BorderThickness 2
    BorderColor _dark_blue
}

skinparam Package {
    BackgroundColor LightGrey
    FontStyle bold
    BorderThickness 2
    BorderColor _dark_blue
}

skinparam Participant {
    BackgroundColor _yellow
    FontStyle bold
    BorderThickness 2
    BorderColor _dark_blue
}

skinparam Rectangle {
    BackgroundColor LightGrey
    BorderThickness 2
    BorderColor _dark_blue
}

skinparam Sequence {
    LifeLineBorderColor _dark_blue
    LifeLineBorderThickness 2
    LifeLineBackgroundColor _light_blue
}

skinparam State {
    BackgroundColor _yellow
    BorderThickness 2
    BorderColor _dark_blue
    FontStyle bold
}

skinparam UseCase {
    BackgroundColor _yellow
    FontStyle bold
    BorderThickness 2
    BorderColor _dark_blue
}

start

if (multiprocessor?) then (yes)
  fork
    :Treatment 1;
  fork again
    :Treatment 2;
  end fork
else (monoproc)
  :Treatment 1;
  :Treatment 2;
endif

@enduml

@startuml

skinparam Shadowing false

skinparam Activity {
    BackgroundColor #FFED00
    BorderThickness 2
    BorderColor #00549F
    BarColor #80A9CF
    FontStyle bold
    DiamondBackgroundColor #FFED00
    DiamondBorderColor #00549F
    DiamondFontStyle bold
}

skinparam Actor {
    BackgroundColor #00549F
    BorderThickness 2
    BorderColor #00549F
}

skinparam Agent {
    BackgroundColor #FFED00
    FontStyle bold
    BorderThickness 2
    BorderColor #00549F
}

skinparam Arrow {
    Color #00549F
    Thickness 2
}

skinparam Boundary {
    BackgroundColor #FFED00
    BorderThickness 2
    BorderColor #00549F
}

skinparam Class {
    BackgroundColor White
    BorderThickness 1
    BorderColor #00549F
}

skinparam Cloud {
    BackgroundColor LightGrey
    BorderThickness 2
    BorderColor #00549F
}

skinparam Collections {
    BackgroundColor #FFED00
    BorderThickness 2
    BorderColor #00549F
}

skinparam Component {
    BackgroundColor #FFED00
    FontStyle bold
    BorderThickness 2
    BorderColor #00549F
}

skinparam Control {
    BackgroundColor #FFED00
    BorderThickness 2
    BorderColor #00549F
}

skinparam Database {
    BackgroundColor LightGrey
    BorderThickness 2
    BorderColor #00549F
}

skinparam Default {
    FontName Arial
    FontSize 11
    FontColor Black
    FontStyle normal
}

skinparam Entity {
    BackgroundColor #FFED00
    BorderThickness 2
    BorderColor #00549F
}

skinparam File {
    BackgroundColor #FFED00
    FontStyle bold
    BorderThickness 2
    BorderColor #00549F
}

skinparam Folder {
    BackgroundColor LightGrey
    BorderThickness 2
    BorderColor #00549F
}

skinparam Frame {
    BackgroundColor LightGrey
    BorderThickness 2
    BorderColor #00549F
}

skinparam Interface {
    BackgroundColor #FFED00
    BorderThickness 2
    BorderColor #00549F
}

skinparam LifeLine {
    BackgroundColor #FFED00
    BorderThickness 2
    BorderColor #00549F
}

skinparam Node {
    BackgroundColor LightGrey
    BorderThickness 2
    BorderColor #00549F
}

skinparam Object {
    BackgroundColor #FFED00
    FontStyle bold
    BorderThickness 2
    BorderColor #00549F
}

skinparam Package {
    BackgroundColor LightGrey
    FontStyle bold
    BorderThickness 2
    BorderColor #00549F
}

skinparam Participant {
    BackgroundColor #FFED00
    FontStyle bold
    BorderThickness 2
    BorderColor #00549F
}

skinparam Rectangle {
    BackgroundColor LightGrey
    BorderThickness 2
    BorderColor #00549F
}

skinparam Sequence {
    LifeLineBorderColor #00549F
    LifeLineBorderThickness 2
    LifeLineBackgroundColor #80A9CF
}

skinparam State {
    BackgroundColor #FFED00
    BorderThickness 2
    BorderColor #00549F
    FontStyle bold
}

skinparam UseCase {
    BackgroundColor #FFED00
    FontStyle bold
    BorderThickness 2
    BorderColor #00549F
}

start

if (multiprocessor?) then (yes)
  fork
    :Treatment 1;
  fork again
    :Treatment 2;
  end fork
else (monoproc)
  :Treatment 1;
  :Treatment 2;
endif

@enduml

PlantUML version 1.2020.10(Sun May 17 11:35:57 CEST 2020)
(GPL source distribution)
Java Runtime: Java(TM) SE Runtime Environment
JVM: Java HotSpot(TM) 64-Bit Server VM
Java Version: 1.8.0_211-b12
Operating System: Windows 10
Default Encoding: Cp1252
Language: de
Country: DE
--></g></svg>