solid right
  facet normal -1.000000 -0.000000 0.000000
    outer loop
      vertex 0.010000 0.005000 0.007000
      vertex 0.010000 0.000000 0.000000
      vertex 0.010000 0.000000 0.007000
    endloop
  endfacet
  facet normal -1.000000 0.000000 -0.000000
    outer loop
      vertex 0.010000 0.005000 0.007000
      vertex 0.010000 0.005000 0.000000
      vertex 0.010000 0.000000 0.000000
    endloop
  endfacet
endsolid right
