% !TEX root = ../../main.tex

\input{content/pictures/tikz-macros}

\begin{tikzpicture}
	\begin{axis}[
			xlabel=\# problems,
			minor y tick num=1,
			ymode=log,
			xmin=-200,
			xmax=8000,
			ymin=0.5,
			ymax=9000000,
			xticklabel=$\pgfmathprintnumber{\tick}$k,
			scaled ticks=false,
			scaled x ticks=manual:{}{\pgfmathparse{#1/1000.0}},
			xtick = {0,2000,4000,6000,8000,10000,11447},
			ytick = {1, 10, 100, 1000, 10000, 100000, 1000000},
			height = 6cm,
			width = 0.95\textwidth,
			legend pos = north west,
			legend cell align = left,
			ymajorgrids = true,
			legend columns=2
	]

	\addplot[thick, red100, solid] table[x index=0,y index=1] {experiments/output/files-info-analyzer_cad_projection_collins_deg_sum.data};
	\addlegendentry{Collins}
	\addplot[thick, green100, dashed] table[x index=0,y index=1] {experiments/output/files-info-analyzer_cad_projection_hong_deg_sum.data};
	\addlegendentry{Hong}
	\addplot[thick, blue100, densely dotted] table[x index=0,y index=1] {experiments/output/files-info-analyzer_cad_projection_mccallum_deg_sum.data};
	\addlegendentry{McCallum}
	\addplot[thick, orange100, solid] table[x index=0,y index=1] {experiments/output/files-info-analyzer_cad_projection_lazard_deg_sum.data};
	\addlegendentry{Lazard}
	\addplot[thick, black100, dashed] table[x index=0,y index=1] {experiments/output/files-info-analyzer_cad_projection_brown_deg_sum.data};
	\addlegendentry{Brown}

	%\addlegendimage{thick,solid}
	%\addlegendentry{$\sum\deg$}
	%\addlegendimage{thick,dashed}
	%\addlegendentry{$\deg\deg$}
	\addplot[thick, black100] table[x index=0,y index=1] {experiments/output/files-info-analyzer_constraint_deg_sum.data};
	\addlegendentry{Input}

	%\addplot[thick, red!75, dashed] table[x index=0,y index=1] {experiments/output/files-info-analyzer_cad_projection_collins_deg_max.data};
	%\addplot[thick, green!75, dashed] table[x index=0,y index=1] {experiments/output/files-info-analyzer_cad_projection_hong_deg_max.data};
	%\addplot[thick, blue!75, dashed] table[x index=0,y index=1] {experiments/output/files-info-analyzer_cad_projection_mccallum_deg_max.data};
	%\addplot[thick, orange!75, dashed] table[x index=0,y index=1] {experiments/output/files-info-analyzer_cad_projection_lazard_deg_max.data};
	%\addplot[thick, black!75, dashed] table[x index=0,y index=1] {experiments/output/files-info-analyzer_cad_projection_brown_deg_max.data};


	%\addplot[thick, red, dashed] table[x index=0,y index=1] {experiments/output/files-info-analyzer_cad_projection_collins_tdeg_max.data};
	%\addplot[thick, green, dashed] table[x index=0,y index=1] {experiments/output/files-info-analyzer_cad_projection_hong_tdeg_max.data};
	%\addplot[thick, blue, dashed] table[x index=0,y index=1] {experiments/output/files-info-analyzer_cad_projection_mccallum_tdeg_max.data};
	%\addplot[thick, orange, dashed] table[x index=0,y index=1] {experiments/output/files-info-analyzer_cad_projection_lazard_tdeg_max.data};
	%\addplot[thick, dashed] table[x index=0,y index=1] {experiments/output/files-info-analyzer_cad_projection_brown_tdeg_max.data};

	%\addplot[thick, red!50, dashed] table[x index=0,y index=1] {experiments/output/files-info-analyzer_cad_projection_collins_tdeg_sum.data};
	%\addplot[thick, green!50, dashed] table[x index=0,y index=1] {experiments/output/files-info-analyzer_cad_projection_hong_tdeg_sum.data};
	%\addplot[thick, blue!50, dashed] table[x index=0,y index=1] {experiments/output/files-info-analyzer_cad_projection_mccallum_tdeg_sum.data};
	%\addplot[thick, orange!50, dashed] table[x index=0,y index=1] {experiments/output/files-info-analyzer_cad_projection_lazard_tdeg_sum.data};
	%\addplot[thick, black!50, dashed] table[x index=0,y index=1] {experiments/output/files-info-analyzer_cad_projection_brown_tdeg_sum.data};
	\end{axis}
\end{tikzpicture}
