% !TEX root = ../../slides.tex

\input{content-slides/pictures/tikz-macros.tex}

\begin{tikzpicture}
	\tikzaxis{-3}{3}{-1.5}{2.5}

	\draw[thick] (0,0.25) circle (1.5);
	\draw[thick] plot [samples=200,range=-1.6:2.6,domain=-3:3] function {1.25-0.5/(x+0.5)};

	\draw[very thick, violett100, densely dashed] (-0.5,-1.5) -- (-0.5,2.5);
	\draw[very thick, green100] (-1.5,0.25) circle (1.5mm);
	\draw[very thick, green100] (1.5,0.25) circle (1.5mm);
	\draw[very thick, cyan100] (-0.3,-1.22) circle (1.5mm);
	\draw[very thick, cyan100] (1.3,0.975) circle (1.5mm);

	\node[anchor=north, text width=6.5cm] at (0,5) {
		Example: McCallum
		\begin{align*}
			Proj(P) = & \{ \textcolor{violett100}{\Coeffs(p)}, \textcolor{green100}{\Disc(p)} \mid p \in P \} \\
			\cup & \{ \textcolor{cyan100}{\Res(p,q)} \mid p,q \in P \}
		\end{align*}
	};
\end{tikzpicture}