% !TEX root = ../../main.tex

\input{content/pictures/tikz-macros}

\begin{tikzpicture}
	\begin{axis}[
			xlabel=\# problems,
			minor y tick num=1,
			ymode=log,
			xmin=-200,
			xmax=8000,
			ymin=0.5,
			ymax=9000000,
			xticklabel=$\pgfmathprintnumber{\tick}$k,
			scaled ticks=false,
			scaled x ticks=manual:{}{\pgfmathparse{#1/1000.0}},
			xtick = {0,2000,4000,6000,8000,10000,11447},
			ytick = {1, 10, 100, 1000, 10000, 100000, 1000000},
			height = 6cm,
			width = 0.95\textwidth,
			legend pos = north west,
			legend cell align = left,
			ymajorgrids = true,
			legend columns=2
	]

	\addplot[thick, red100, solid] table[x index=0,y index=1] {experiments/output/files-info-analyzer_cad_projection_collins_size.data};
	\addlegendentry{Collins}
	\addplot[thick, green100, dashed] table[x index=0,y index=1] {experiments/output/files-info-analyzer_cad_projection_hong_size.data};
	\addlegendentry{Hong}
	\addplot[thick, blue100, densely dotted] table[x index=0,y index=1] {experiments/output/files-info-analyzer_cad_projection_mccallum_size.data};
	\addlegendentry{McCallum}
	\addplot[thick, orange100, solid] table[x index=0,y index=1] {experiments/output/files-info-analyzer_cad_projection_lazard_size.data};
	\addlegendentry{Lazard}
	\addplot[thick, black100, dashed] table[x index=0,y index=1] {experiments/output/files-info-analyzer_cad_projection_brown_size.data};
	\addlegendentry{Brown}
	\addplot[thick, black100] table[x index=0,y index=1] {experiments/output/files-info-analyzer_num_constraints.data};
	\addlegendentry{Input}
	\end{axis}
\end{tikzpicture}
