% !TEX root = ../../main.tex

\input{content/pictures/tikz-macros}

\begin{tikzpicture}[]
	\tikzgrid{-3}{0}{0}{3}
	\tikzaxis{-3}{0}{0}{3}
	\fill[pattern=north west lines, pattern color=black!50] (-3.1,-0.1) -- (-3.1,3.1) -- (0.1,-0.1) -- cycle;
	\fill[pattern=north east lines, pattern color=black!50] (-3.1,1) -- (-3.1,3.1) -- (0.1,3.1) -- (0.1,1) -- cycle;

	\draw[thick] plot [domain=-3.1:0.1] function {-x};
	\draw[thick] plot [domain=-3.1:0.1] function {1};
\end{tikzpicture}
