{
  "@context": {
    "brick": "https://brickschema.org/schema/Brick#",
    "csvw": "http://www.w3.org/ns/csvw#",
    "dbo": "https://dbpedia.org/ontology/",
    "dc": "http://purl.org/dc/elements/1.1/",
    "dcam": "http://purl.org/dc/dcam/",
    "dcat": "http://www.w3.org/ns/dcat#",
    "dcmitype": "http://purl.org/dc/dcmitype/",
    "dcterms": "http://purl.org/dc/terms/",
    "doap": "http://usefulinc.com/ns/doap#",
    "foaf": "http://xmlns.com/foaf/0.1/",
    "fst": "https://w3id.org/fst/resource/",
    "geo": "http://www.opengis.net/ont/geosparql#",
    "odrl": "http://www.w3.org/ns/odrl/2/",
    "org": "http://www.w3.org/ns/org#",
    "owl": "http://www.w3.org/2002/07/owl#",
    "prof": "http://www.w3.org/ns/dx/prof/",
    "prov": "http://www.w3.org/ns/prov#",
    "qb": "http://purl.org/linked-data/cube#",
    "quantitykind": "https://qudt.org/vocab/quantitykind/",
    "qudt": "https://qudt.org/schema/qudt/",
    "rdf": "http://www.w3.org/1999/02/22-rdf-syntax-ns#",
    "rdfs": "http://www.w3.org/2000/01/rdf-schema#",
    "schema": "https://schema.org/",
    "sh": "http://www.w3.org/ns/shacl#",
    "skos": "http://www.w3.org/2004/02/skos/core#",
    "sosa": "http://www.w3.org/ns/sosa/",
    "ssn": "http://www.w3.org/ns/ssn/",
    "ssn-system": "https://www.w3.org/ns/ssn/systems/",
    "time": "http://www.w3.org/2006/time#",
    "unit": "https://qudt.org/vocab/unit/",
    "uuid": "urn:uuid:",
    "vann": "http://purl.org/vocab/vann/",
    "void": "http://rdfs.org/ns/void#",
    "wgs": "https://www.w3.org/2003/01/geo/wgs84_pos#",
    "xsd": "http://www.w3.org/2001/XMLSchema#"
  },
  "@graph": [
    {
      "@id": "https://w3id.org/fst/resource/018dba9b-f069-7cba-99b8-a55658749382/specific_enthalpy",
      "@type": [
        "ssn:Property",
        "qudt:Quantity"
      ],
      "qudt:hasQuantityKind": {
        "@id": "quantitykind:Enthalpy"
      },
      "qudt:symbol": "h",
      "qudt:unit": {
        "@id": "unit:J-PER-KiloGM"
      },
      "rdfs:label": "enthalpy of the gas",
      "schema:dataset": {
        "@id": "https://w3id.org/fst/resource/018dba9b-f069-7cba-99b8-a55658749382/argon.hdf5/specific_enthalpy"
      },
      "ssn:isPropertyOf": {
        "@id": "fst:018dba9b-f069-7cba-99b8-a55658749382"
      }
    },
    {
      "@id": "https://w3id.org/fst/resource/018dba9b-f069-7cba-99b8-a55658749382/thermal_conductivity_gas",
      "@type": [
        "ssn:Property",
        "qudt:Quantity"
      ],
      "qudt:hasQuantityKind": {
        "@id": "quantitykind:ThermalConductivity"
      },
      "qudt:symbol": "λ",
      "qudt:unit": {
        "@id": "unit:W-PER-M-K"
      },
      "rdfs:label": "thermal conductivity gas",
      "schema:dataset": {
        "@id": "https://w3id.org/fst/resource/018dba9b-f069-7cba-99b8-a55658749382/argon.hdf5/thermal_conductivity"
      },
      "ssn:isPropertyOf": {
        "@id": "fst:018dba9b-f069-7cba-99b8-a55658749382"
      }
    },
    {
      "@id": "https://w3id.org/fst/resource/018dba9b-f069-7cba-99b8-a55658749382/c_v",
      "@type": [
        "ssn:Property",
        "qudt:Quantity"
      ],
      "qudt:hasQuantityKind": {
        "@id": "quantitykind:SpecificHeatCapacityAtConstantVolume"
      },
      "qudt:symbol": "c_v",
      "qudt:unit": {
        "@id": "unit:J-PER-KiloGM-K"
      },
      "rdfs:label": "specific heat capacity at constant volume",
      "schema:dataset": {
        "@id": "https://w3id.org/fst/resource/018dba9b-f069-7cba-99b8-a55658749382/argon.hdf5/c_v"
      },
      "ssn:isPropertyOf": {
        "@id": "fst:018dba9b-f069-7cba-99b8-a55658749382"
      }
    },
    {
      "@id": "https://w3id.org/fst/resource/018dba9b-f069-7cba-99b8-a55658749382/joule_thomson",
      "@type": [
        "ssn:Property",
        "qudt:Quantity"
      ],
      "rdfs:label": "joule thomson of the gas",
      "schema:dataset": {
        "@id": "https://w3id.org/fst/resource/018dba9b-f069-7cba-99b8-a55658749382/argon.hdf5/joule_thomson"
      },
      "ssn:isPropertyOf": {
        "@id": "fst:018dba9b-f069-7cba-99b8-a55658749382"
      }
    },
    {
      "@id": "https://w3id.org/fst/resource/018dba9b-f069-7cba-99b8-a55658749382/argon.hdf5/specific_internal_energy",
      "@type": "schema:Dataset",
      "dc:source": {
        "@id": "https://doi.org/10.18434/T4D303"
      },
      "schema:contentUrl": "/substance/n_dimensional_lookup_tables/specific_internal_energy",
      "schema:isPartOf": {
        "@id": "https://w3id.org/fst/resource/018dba9b-f069-7cba-99b8-a55658749382/argon.hdf5"
      },
      "schema:keywords": "lookup_table"
    },
    {
      "@id": "https://w3id.org/fst/resource/018dba9b-f069-7cba-99b8-a55658749382/argon.hdf5/density",
      "@type": "schema:Dataset",
      "dc:source": {
        "@id": "https://doi.org/10.18434/T4D303"
      },
      "schema:contentUrl": "/substance/n_dimensional_lookup_tables/density",
      "schema:isPartOf": {
        "@id": "https://w3id.org/fst/resource/018dba9b-f069-7cba-99b8-a55658749382/argon.hdf5"
      },
      "schema:keywords": "lookup_table"
    },
    {
      "@id": "https://w3id.org/fst/resource/018dba9b-f069-7cba-99b8-a55658749382/argon.hdf5/pressures_vector",
      "@type": "schema:Dataset",
      "schema:contentUrl": "/substance/index_vectors/pressures",
      "schema:description": "second index vector that is used to get the correct index in the lookup tables for a given pressure",
      "schema:isPartOf": {
        "@id": "https://w3id.org/fst/resource/018dba9b-f069-7cba-99b8-a55658749382/argon.hdf5"
      },
      "schema:keywords": "index_vector"
    },
    {
      "@id": "https://w3id.org/fst/resource/018dba9b-f069-7cba-99b8-a55658749382/density",
      "@type": [
        "ssn:Property",
        "qudt:Quantity"
      ],
      "qudt:hasQuantityKind": {
        "@id": "quantitykind:Density"
      },
      "qudt:symbol": "ρ",
      "qudt:unit": {
        "@id": "unit:KiloGM-PER-M3"
      },
      "rdfs:label": "density of the gas",
      "schema:dataset": {
        "@id": "https://w3id.org/fst/resource/018dba9b-f069-7cba-99b8-a55658749382/argon.hdf5/density"
      },
      "ssn:isPropertyOf": {
        "@id": "fst:018dba9b-f069-7cba-99b8-a55658749382"
      }
    },
    {
      "@id": "https://w3id.org/fst/resource/018dba9b-f069-7cba-99b8-a55658749382/isentropic_exponent",
      "@type": [
        "ssn:Property",
        "qudt:Quantity"
      ],
      "qudt:hasQuantityKind": {
        "@id": "quantitykind:IsentropicExponent"
      },
      "qudt:symbol": "κ",
      "qudt:unit": {
        "@id": "unit:UNITLESS"
      },
      "rdfs:comment": "calculated with the formula κ = c_p/c_v",
      "rdfs:label": "isentropic exponent of the gas",
      "schema:dataset": {
        "@id": "https://w3id.org/fst/resource/018dba9b-f069-7cba-99b8-a55658749382/argon.hdf5/isentropic_exponent"
      },
      "ssn:isPropertyOf": {
        "@id": "fst:018dba9b-f069-7cba-99b8-a55658749382"
      }
    },
    {
      "@id": "https://w3id.org/fst/resource/018dba9b-f069-7cba-99b8-a55658749382/argon.hdf5/joule_thomson",
      "@type": "schema:Dataset",
      "dc:source": {
        "@id": "https://doi.org/10.18434/T4D303"
      },
      "schema:contentUrl": "/substance/n_dimensional_lookup_tables/joule_thomson",
      "schema:isPartOf": {
        "@id": "https://w3id.org/fst/resource/018dba9b-f069-7cba-99b8-a55658749382/argon.hdf5"
      },
      "schema:keywords": "lookup_table"
    },
    {
      "@id": "https://w3id.org/fst/resource/018dba9b-f069-7cba-99b8-a55658749382/argon.hdf5/isentropic_exponent",
      "@type": "schema:Dataset",
      "dc:source": {
        "@id": "https://doi.org/10.18434/T4D303"
      },
      "schema:contentUrl": "/substance/n_dimensional_lookup_tables/isentropic_exponent",
      "schema:isPartOf": {
        "@id": "https://w3id.org/fst/resource/018dba9b-f069-7cba-99b8-a55658749382/argon.hdf5"
      },
      "schema:keywords": "lookup_table"
    },
    {
      "@id": "https://w3id.org/fst/resource/018dba9b-f069-7cba-99b8-a55658749382/molar_mass",
      "@type": [
        "ssn:Property",
        "qudt:Quantity"
      ],
      "qudt:hasQuantityKind": {
        "@id": "quantitykind:SpecificHeatCapacity"
      },
      "qudt:symbol": "R",
      "qudt:unit": {
        "@id": "unit:KIloGM-PER-MOL"
      },
      "qudt:value": 0.03995,
      "rdfs:label": "molar mass of the gas",
      "ssn:isPropertyOf": {
        "@id": "fst:018dba9b-f069-7cba-99b8-a55658749382"
      }
    },
    {
      "@id": "fst:018dba9b-f069-7cba-99b8-a55658749382",
      "@type": [
        "dcmitype:PhysicalObject",
        "schema:ChemicalSubstance"
      ],
      "dbo:owner": "FST",
      "dc:identifier": "018dba9b-f069-7cba-99b8-a55658749382",
      "rdfs:label": "Ar",
      "schema:chemicalComposition": "Ar",
      "schema:name": [
        {
          "@language": "en",
          "@value": "argon"
        },
        {
          "@language": "de",
          "@value": "Argon"
        }
      ],
      "ssn:hasProperty": [
        {
          "@id": "https://w3id.org/fst/resource/018dba9b-f069-7cba-99b8-a55658749382/c_v"
        },
        {
          "@id": "https://w3id.org/fst/resource/018dba9b-f069-7cba-99b8-a55658749382/c_p"
        },
        {
          "@id": "https://w3id.org/fst/resource/018dba9b-f069-7cba-99b8-a55658749382/density"
        },
        {
          "@id": "https://w3id.org/fst/resource/018dba9b-f069-7cba-99b8-a55658749382/specific_internal_energy"
        },
        {
          "@id": "https://w3id.org/fst/resource/018dba9b-f069-7cba-99b8-a55658749382/specific_enthalpy"
        },
        {
          "@id": "https://w3id.org/fst/resource/018dba9b-f069-7cba-99b8-a55658749382/specific_entropy"
        },
        {
          "@id": "https://w3id.org/fst/resource/018dba9b-f069-7cba-99b8-a55658749382/speed_of_sound"
        },
        {
          "@id": "https://w3id.org/fst/resource/018dba9b-f069-7cba-99b8-a55658749382/thermal_conductivity_gas"
        },
        {
          "@id": "https://w3id.org/fst/resource/018dba9b-f069-7cba-99b8-a55658749382/specific_volume"
        },
        {
          "@id": "https://w3id.org/fst/resource/018dba9b-f069-7cba-99b8-a55658749382/joule_thomson"
        },
        {
          "@id": "https://w3id.org/fst/resource/018dba9b-f069-7cba-99b8-a55658749382/viscosity"
        },
        {
          "@id": "https://w3id.org/fst/resource/018dba9b-f069-7cba-99b8-a55658749382/specific_gas_constant"
        },
        {
          "@id": "https://w3id.org/fst/resource/018dba9b-f069-7cba-99b8-a55658749382/molar_mass"
        },
        {
          "@id": "https://w3id.org/fst/resource/018dba9b-f069-7cba-99b8-a55658749382/isentropic_exponent"
        }
      ]
    },
    {
      "@id": "https://w3id.org/fst/resource/018dba9b-f069-7cba-99b8-a55658749382/argon.hdf5/viscosity",
      "@type": "schema:Dataset",
      "dc:source": {
        "@id": "https://doi.org/10.18434/T4D303"
      },
      "schema:contentUrl": "/substance/n_dimensional_lookup_tables/viscosity",
      "schema:isPartOf": {
        "@id": "https://w3id.org/fst/resource/018dba9b-f069-7cba-99b8-a55658749382/argon.hdf5"
      },
      "schema:keywords": "lookup_table"
    },
    {
      "@id": "https://w3id.org/fst/resource/018dba9b-f069-7cba-99b8-a55658749382/specific_internal_energy",
      "@type": [
        "ssn:Property",
        "qudt:Quantity"
      ],
      "qudt:hasQuantityKind": {
        "@id": "quantitykind:InternalEnergy"
      },
      "qudt:symbol": "u",
      "qudt:unit": {
        "@id": "unit:J-PER-KiloGM"
      },
      "rdfs:label": "internal energy of the gas",
      "schema:dataset": {
        "@id": "https://w3id.org/fst/resource/018dba9b-f069-7cba-99b8-a55658749382/argon.hdf5/specific_internal_energy"
      },
      "ssn:isPropertyOf": {
        "@id": "fst:018dba9b-f069-7cba-99b8-a55658749382"
      }
    },
    {
      "@id": "https://w3id.org/fst/resource/018dba9b-f069-7cba-99b8-a55658749382/c_p",
      "@type": [
        "ssn:Property",
        "qudt:Quantity"
      ],
      "qudt:hasQuantityKind": {
        "@id": "quantitykind:SpecificHeatCapacityAtConstantPressure"
      },
      "qudt:symbol": "c_p",
      "qudt:unit": {
        "@id": "unit:J-PER-KiloGM-K"
      },
      "rdfs:label": "specific heat capacity at constant pressure",
      "schema:dataset": {
        "@id": "https://w3id.org/fst/resource/018dba9b-f069-7cba-99b8-a55658749382/argon.hdf5/c_p"
      },
      "ssn:isPropertyOf": {
        "@id": "fst:018dba9b-f069-7cba-99b8-a55658749382"
      }
    },
    {
      "@id": "https://w3id.org/fst/resource/018dba9b-f069-7cba-99b8-a55658749382/argon.hdf5",
      "@type": "foaf:Document",
      "foaf:primaryTopic": {
        "@id": "fst:018dba9b-f069-7cba-99b8-a55658749382"
      },
      "schema:description": "'temperatures' and 'pressures' are the index vectors to the given look-up tables. To find the value for a given temperature 'T' and a pressure 'p' inside the lookup tables, you search for the index of the given temperature 'T' in 'temperatures' and the index of the given pressure 'p' in 'pressures'. Then, use these two indexes to access the lookup tables lookup_table[index_T, index_p].\nExample:\nFor argon T=273.15K and p=5MPa, you get index_T=12, index_p=49, and c_v[12, 49]=0.323189716788.",
      "schema:encodingFormat": "application/x-hdf5",
      "schema:hasPart": [
        {
          "@id": "https://w3id.org/fst/resource/018dba9b-f069-7cba-99b8-a55658749382/argon.hdf5/temperatures_vector"
        },
        {
          "@id": "https://w3id.org/fst/resource/018dba9b-f069-7cba-99b8-a55658749382/argon.hdf5/pressures_vector"
        },
        {
          "@id": "https://w3id.org/fst/resource/018dba9b-f069-7cba-99b8-a55658749382/argon.hdf5/c_v"
        },
        {
          "@id": "https://w3id.org/fst/resource/018dba9b-f069-7cba-99b8-a55658749382/argon.hdf5/c_p"
        },
        {
          "@id": "https://w3id.org/fst/resource/018dba9b-f069-7cba-99b8-a55658749382/argon.hdf5/density"
        },
        {
          "@id": "https://w3id.org/fst/resource/018dba9b-f069-7cba-99b8-a55658749382/argon.hdf5/specific_internal_energy"
        },
        {
          "@id": "https://w3id.org/fst/resource/018dba9b-f069-7cba-99b8-a55658749382/argon.hdf5/specific_enthalpy"
        },
        {
          "@id": "https://w3id.org/fst/resource/018dba9b-f069-7cba-99b8-a55658749382/argon.hdf5/specific_entropy"
        },
        {
          "@id": "https://w3id.org/fst/resource/018dba9b-f069-7cba-99b8-a55658749382/argon.hdf5/speed_of_sound"
        },
        {
          "@id": "https://w3id.org/fst/resource/018dba9b-f069-7cba-99b8-a55658749382/argon.hdf5/thermal_conductivity"
        },
        {
          "@id": "https://w3id.org/fst/resource/018dba9b-f069-7cba-99b8-a55658749382/argon.hdf5/specific_volume"
        },
        {
          "@id": "https://w3id.org/fst/resource/018dba9b-f069-7cba-99b8-a55658749382/argon.hdf5/joule_thomson"
        },
        {
          "@id": "https://w3id.org/fst/resource/018dba9b-f069-7cba-99b8-a55658749382/argon.hdf5/viscosity"
        },
        {
          "@id": "https://w3id.org/fst/resource/018dba9b-f069-7cba-99b8-a55658749382/argon.hdf5/isentropic_exponent"
        }
      ]
    },
    {
      "@id": "https://w3id.org/fst/resource/018dba9b-f069-7cba-99b8-a55658749382/rdf.json",
      "@type": "foaf:Document",
      "foaf:primaryTopic": {
        "@id": "fst:018dba9b-f069-7cba-99b8-a55658749382"
      },
      "schema:encodingFormat": [
        "application/json",
        "application/ld+json"
      ]
    },
    {
      "@id": "https://w3id.org/fst/resource/018dba9b-f069-7cba-99b8-a55658749382/argon.hdf5/specific_enthalpy",
      "@type": "schema:Dataset",
      "dc:source": {
        "@id": "https://doi.org/10.18434/T4D303"
      },
      "schema:contentUrl": "/substance/n_dimensional_lookup_tables/specific_enthalpy",
      "schema:isPartOf": {
        "@id": "https://w3id.org/fst/resource/018dba9b-f069-7cba-99b8-a55658749382/argon.hdf5"
      },
      "schema:keywords": "lookup_table"
    },
    {
      "@id": "https://w3id.org/fst/resource/018dba9b-f069-7cba-99b8-a55658749382/argon.hdf5/c_p",
      "@type": "schema:Dataset",
      "dc:source": {
        "@id": "https://doi.org/10.18434/T4D303"
      },
      "schema:contentUrl": "/substance/n_dimensional_lookup_tables/c_p",
      "schema:isPartOf": {
        "@id": "https://w3id.org/fst/resource/018dba9b-f069-7cba-99b8-a55658749382/argon.hdf5"
      },
      "schema:keywords": "lookup_table"
    },
    {
      "@id": "https://w3id.org/fst/resource/018dba9b-f069-7cba-99b8-a55658749382/argon.hdf5/c_v",
      "@type": "schema:Dataset",
      "dc:source": {
        "@id": "https://doi.org/10.18434/T4D303"
      },
      "schema:contentUrl": "/substance/n_dimensional_lookup_tables/c_v",
      "schema:isPartOf": {
        "@id": "https://w3id.org/fst/resource/018dba9b-f069-7cba-99b8-a55658749382/argon.hdf5"
      },
      "schema:keywords": "lookup_table"
    },
    {
      "@id": "https://w3id.org/fst/resource/018dba9b-f069-7cba-99b8-a55658749382/argon.hdf5/temperatures_vector",
      "@type": "schema:Dataset",
      "schema:contentUrl": "/substance/index_vectors/temperatures",
      "schema:description": "first index vector that is used to get the correct index in the lookup tables for a given temperature",
      "schema:isPartOf": {
        "@id": "https://w3id.org/fst/resource/018dba9b-f069-7cba-99b8-a55658749382/argon.hdf5"
      },
      "schema:keywords": "index_vector"
    },
    {
      "@id": "https://w3id.org/fst/resource/018dba9b-f069-7cba-99b8-a55658749382/specific_entropy",
      "@type": [
        "ssn:Property",
        "qudt:Quantity"
      ],
      "qudt:hasQuantityKind": {
        "@id": "quantitykind:Entropy"
      },
      "qudt:symbol": "s",
      "qudt:unit": {
        "@id": "unit:J-PER-KiloGM-K"
      },
      "rdfs:label": "entropy of the gas",
      "schema:dataset": {
        "@id": "https://w3id.org/fst/resource/018dba9b-f069-7cba-99b8-a55658749382/argon.hdf5/specific_entropy"
      },
      "ssn:isPropertyOf": {
        "@id": "fst:018dba9b-f069-7cba-99b8-a55658749382"
      }
    },
    {
      "@id": "https://w3id.org/fst/resource/018dba9b-f069-7cba-99b8-a55658749382/argon.hdf5/speed_of_sound",
      "@type": "schema:Dataset",
      "dc:source": {
        "@id": "https://doi.org/10.18434/T4D303"
      },
      "schema:contentUrl": "/substance/n_dimensional_lookup_tables/speed_of_sound",
      "schema:isPartOf": {
        "@id": "https://w3id.org/fst/resource/018dba9b-f069-7cba-99b8-a55658749382/argon.hdf5"
      },
      "schema:keywords": "lookup_table"
    },
    {
      "@id": "https://w3id.org/fst/resource/018dba9b-f069-7cba-99b8-a55658749382/rdf.ttl",
      "@type": [
        "foaf:Document",
        "schema:TextObject"
      ],
      "foaf:primaryTopic": {
        "@id": "fst:018dba9b-f069-7cba-99b8-a55658749382"
      },
      "schema:encodingFormat": "text/turtle"
    },
    {
      "@id": "https://w3id.org/fst/resource/018dba9b-f069-7cba-99b8-a55658749382/specific_volume",
      "@type": [
        "ssn:Property",
        "qudt:Quantity"
      ],
      "qudt:hasQuantityKind": {
        "@id": "quantitykind:SpecificVolume"
      },
      "qudt:symbol": "v",
      "qudt:unit": {
        "@id": "unit:M3-PER-KiloGM"
      },
      "rdfs:label": "specific volume of the gas",
      "schema:dataset": {
        "@id": "https://w3id.org/fst/resource/018dba9b-f069-7cba-99b8-a55658749382/argon.hdf5/specific_volume"
      },
      "ssn:isPropertyOf": {
        "@id": "fst:018dba9b-f069-7cba-99b8-a55658749382"
      }
    },
    {
      "@id": "https://w3id.org/fst/resource/018dba9b-f069-7cba-99b8-a55658749382/rdf.xml",
      "@type": "foaf:Document",
      "foaf:primaryTopic": {
        "@id": "fst:018dba9b-f069-7cba-99b8-a55658749382"
      },
      "schema:encodingFormat": [
        "text/xml",
        "application/rdf+xml"
      ]
    },
    {
      "@id": "https://w3id.org/fst/resource/018dba9b-f069-7cba-99b8-a55658749382/argon.hdf5/specific_volume",
      "@type": "schema:Dataset",
      "dc:source": {
        "@id": "https://doi.org/10.18434/T4D303"
      },
      "schema:contentUrl": "/substance/n_dimensional_lookup_tables/specific_volume",
      "schema:isPartOf": {
        "@id": "https://w3id.org/fst/resource/018dba9b-f069-7cba-99b8-a55658749382/argon.hdf5"
      },
      "schema:keywords": "lookup_table"
    },
    {
      "@id": "https://w3id.org/fst/resource/018dba9b-f069-7cba-99b8-a55658749382/argon.hdf5/thermal_conductivity",
      "@type": "schema:Dataset",
      "dc:source": {
        "@id": "https://doi.org/10.18434/T4D303"
      },
      "schema:contentUrl": "/substance/n_dimensional_lookup_tables/thermal_conductivity",
      "schema:isPartOf": {
        "@id": "https://w3id.org/fst/resource/018dba9b-f069-7cba-99b8-a55658749382/argon.hdf5"
      },
      "schema:keywords": "lookup_table"
    },
    {
      "@id": "https://w3id.org/fst/resource/018dba9b-f069-7cba-99b8-a55658749382/viscosity",
      "@type": [
        "ssn:Property",
        "qudt:Quantity"
      ],
      "qudt:hasQuantityKind": {
        "@id": "quantitykind:Viscosity"
      },
      "qudt:symbol": [
        "η",
        "μ"
      ],
      "qudt:unit": {
        "@id": "unit:PA-SEC"
      },
      "rdfs:label": "viscosity of the gas",
      "schema:dataset": {
        "@id": "https://w3id.org/fst/resource/018dba9b-f069-7cba-99b8-a55658749382/argon.hdf5/viscosity"
      },
      "ssn:isPropertyOf": {
        "@id": "fst:018dba9b-f069-7cba-99b8-a55658749382"
      }
    },
    {
      "@id": "https://w3id.org/fst/resource/018dba9b-f069-7cba-99b8-a55658749382/argon.hdf5/specific_entropy",
      "@type": "schema:Dataset",
      "dc:source": {
        "@id": "https://doi.org/10.18434/T4D303"
      },
      "schema:contentUrl": "/substance/n_dimensional_lookup_tables/specific_entropy",
      "schema:isPartOf": {
        "@id": "https://w3id.org/fst/resource/018dba9b-f069-7cba-99b8-a55658749382/argon.hdf5"
      },
      "schema:keywords": "lookup_table"
    },
    {
      "@id": "https://w3id.org/fst/resource/018dba9b-f069-7cba-99b8-a55658749382/specific_gas_constant",
      "@type": [
        "ssn:Property",
        "qudt:Quantity"
      ],
      "qudt:hasQuantityKind": {
        "@id": "quantitykind:SpecificHeatCapacity"
      },
      "qudt:symbol": "R",
      "qudt:unit": {
        "@id": "unit:J-PER-KiloGM-K"
      },
      "qudt:value": 208.1101376720901,
      "rdfs:label": "specific gas constant of the gas",
      "ssn:isPropertyOf": {
        "@id": "fst:018dba9b-f069-7cba-99b8-a55658749382"
      }
    },
    {
      "@id": "https://w3id.org/fst/resource/018dba9b-f069-7cba-99b8-a55658749382/speed_of_sound",
      "@type": [
        "ssn:Property",
        "qudt:Quantity"
      ],
      "qudt:hasQuantityKind": {
        "@id": "quantitykind:SpeedOfSound"
      },
      "qudt:symbol": "v",
      "qudt:unit": {
        "@id": "unit:M-PER-SEC"
      },
      "rdfs:label": "speed of sound of the gas",
      "schema:dataset": {
        "@id": "https://w3id.org/fst/resource/018dba9b-f069-7cba-99b8-a55658749382/argon.hdf5/speed_of_sound"
      },
      "ssn:isPropertyOf": {
        "@id": "fst:018dba9b-f069-7cba-99b8-a55658749382"
      }
    },
    {
      "@id": "https://w3id.org/fst/resource/018dba9b-f069-7cba-99b8-a55658749382/argon.hdf5/specific_gas_constant",
      "@type": "schema:Dataset",
      "dc:source": {
        "@id": "https://doi.org/10.18434/T4D303"
      },
      "schema:contentUrl": "/substance/n_dimensional_lookup_tables/specific_gas_constant",
      "schema:isPartOf": {
        "@id": "https://w3id.org/fst/resource/018dba9b-f069-7cba-99b8-a55658749382/argon.hdf5"
      },
      "schema:keywords": "lookup_table"
    }
  ]
}