{
  "@context": {
    "brick": "https://brickschema.org/schema/Brick#",
    "csvw": "http://www.w3.org/ns/csvw#",
    "dbo": "https://dbpedia.org/ontology/",
    "dc": "http://purl.org/dc/elements/1.1/",
    "dcam": "http://purl.org/dc/dcam/",
    "dcat": "http://www.w3.org/ns/dcat#",
    "dcmitype": "http://purl.org/dc/dcmitype/",
    "dcterms": "http://purl.org/dc/terms/",
    "doap": "http://usefulinc.com/ns/doap#",
    "foaf": "http://xmlns.com/foaf/0.1/",
    "fst": "https://w3id.org/fst/resource/",
    "geo": "http://www.opengis.net/ont/geosparql#",
    "odrl": "http://www.w3.org/ns/odrl/2/",
    "org": "http://www.w3.org/ns/org#",
    "owl": "http://www.w3.org/2002/07/owl#",
    "prof": "http://www.w3.org/ns/dx/prof/",
    "prov": "http://www.w3.org/ns/prov#",
    "qb": "http://purl.org/linked-data/cube#",
    "quantitykind": "https://qudt.org/vocab/quantitykind/",
    "qudt": "https://qudt.org/schema/qudt/",
    "rdf": "http://www.w3.org/1999/02/22-rdf-syntax-ns#",
    "rdfs": "http://www.w3.org/2000/01/rdf-schema#",
    "schema": "https://schema.org/",
    "sh": "http://www.w3.org/ns/shacl#",
    "skos": "http://www.w3.org/2004/02/skos/core#",
    "sosa": "http://www.w3.org/ns/sosa/",
    "ssn": "http://www.w3.org/ns/ssn/",
    "ssn-system": "https://www.w3.org/ns/ssn/systems/",
    "time": "http://www.w3.org/2006/time#",
    "unit": "https://qudt.org/vocab/unit/",
    "uuid": "urn:uuid:",
    "vann": "http://purl.org/vocab/vann/",
    "void": "http://rdfs.org/ns/void#",
    "wgs": "https://www.w3.org/2003/01/geo/wgs84_pos#",
    "xsd": "http://www.w3.org/2001/XMLSchema#"
  },
  "@graph": [
    {
      "@id": "https://w3id.org/fst/resource/0184ebd9-988c-7bbb-9f6d-fca5fbdfdd0a/rdf.json",
      "@type": [
        "foaf:Document",
        "schema:TextObject"
      ],
      "foaf:primaryTopic": {
        "@id": "fst:0184ebd9-988c-7bbb-9f6d-fca5fbdfdd0a"
      },
      "schema:encodingFormat": [
        "application/json",
        "application/ld+json"
      ]
    },
    {
      "@id": "https://w3id.org/fst/resource/0184ebd9-988c-7bbb-9f6d-fca5fbdfdd0a/SensorActuationRange",
      "@type": [
        "ssn-system:ActuationRange",
        "ssn:Property",
        "qudt:Quantity"
      ],
      "qudt:hasQuantityKind": {
        "@id": "quantitykind:Voltage"
      },
      "qudt:unit": {
        "@id": "unit:V"
      },
      "schema:maxValue": 10.0,
      "schema:minValue": 0.0,
      "schema:name": "sensor output voltage range",
      "ssn:isPropertyOf": {
        "@id": "https://w3id.org/fst/resource/0184ebd9-988c-7bbb-9f6d-fca5fbdfdd0a/SensorCapability"
      }
    },
    {
      "@id": "https://w3id.org/fst/resource/0184ebd9-988c-7bbb-9f6d-fca5fbdfdd0a/LinearityUncertainty",
      "@type": "ssn:Property",
      "dcterms:conformsTo": [
        {
          "@id": "https://doi.org/10.1007/978-3-030-78354-9"
        },
        {
          "@id": "https://dx.doi.org/10.2139/ssrn.4452038"
        }
      ],
      "rdfs:seeAlso": [
        {
          "@id": "https://doi.org/10.1007/978-3-030-78354-9"
        },
        {
          "@id": "https://dx.doi.org/10.2139/ssrn.4452038"
        }
      ],
      "schema:description": "The linearity uncertainty of the linear transfer function of a sensor.",
      "schema:name": "linearity uncertainty",
      "ssn:isPropertyOf": {
        "@id": "https://w3id.org/fst/resource/0184ebd9-988c-7bbb-9f6d-fca5fbdfdd0a/SensorCapability"
      }
    },
    {
      "@id": "fst:0184ebd9-988c-7bbb-9f6d-fca5fbdfdd0a",
      "@type": [
        "dcmitype:PhysicalObject",
        "sosa:Sensor"
      ],
      "dbo:maintainedBy": "Rexer",
      "dbo:owner": "FST",
      "dcterms:identifier": [
        "0184ebd9-988c-7bbb-9f6d-fca5fbdfdd0a",
        "fst-inv:T01"
      ],
      "dcterms:modified": "None",
      "schema:documentation": {
        "@id": "docs/"
      },
      "schema:keywords": [
        "Temperatur",
        "Pt100"
      ],
      "schema:location": "Hydropulser Schrank",
      "schema:manufacturer": "Jumo",
      "schema:name": "90.295-F74, 232137000",
      "schema:serialNumber": "97450008",
      "schema:subjectOf": {
        "@id": "docs/"
      },
      "sosa:usedProcedure": "Pt100",
      "ssn-system:hasSystemCapability": {
        "@id": "https://w3id.org/fst/resource/0184ebd9-988c-7bbb-9f6d-fca5fbdfdd0a/SensorCapability"
      }
    },
    {
      "@id": "https://w3id.org/fst/resource/0184ebd9-988c-7bbb-9f6d-fca5fbdfdd0a/MeasurementRange",
      "@type": [
        "ssn-system:MeasurementRange",
        "ssn:Property",
        "qudt:Quantity"
      ],
      "qudt:hasQuantityKind": {
        "@id": "quantitykind:Temperature"
      },
      "qudt:unit": {
        "@id": "unit:DEG_C"
      },
      "schema:maxValue": 600.0,
      "schema:minValue": -50.0,
      "schema:name": "measurement range",
      "ssn:isPropertyOf": {
        "@id": "https://w3id.org/fst/resource/0184ebd9-988c-7bbb-9f6d-fca5fbdfdd0a/SensorCapability"
      }
    },
    {
      "@id": "https://w3id.org/fst/resource/0184ebd9-988c-7bbb-9f6d-fca5fbdfdd0a/rdf.ttl",
      "@type": [
        "foaf:Document",
        "schema:TextObject"
      ],
      "foaf:primaryTopic": {
        "@id": "fst:0184ebd9-988c-7bbb-9f6d-fca5fbdfdd0a"
      },
      "schema:encodingFormat": "text/turtle"
    },
    {
      "@id": "https://w3id.org/fst/resource/0184ebd9-988c-7bbb-9f6d-fca5fbdfdd0a/rdf.xml",
      "@type": [
        "foaf:Document",
        "schema:TextObject"
      ],
      "foaf:primaryTopic": {
        "@id": "fst:0184ebd9-988c-7bbb-9f6d-fca5fbdfdd0a"
      },
      "schema:encodingFormat": "application/rdf+xml"
    },
    {
      "@id": "https://w3id.org/fst/resource/0184ebd9-988c-7bbb-9f6d-fca5fbdfdd0a/Bias/BiasUncertainty",
      "@type": "ssn:Property",
      "dcterms:conformsTo": [
        {
          "@id": "https://doi.org/10.1007/978-3-030-78354-9"
        },
        {
          "@id": "https://dx.doi.org/10.2139/ssrn.4452038"
        }
      ],
      "rdfs:seeAlso": [
        {
          "@id": "https://doi.org/10.1007/978-3-030-78354-9"
        },
        {
          "@id": "https://dx.doi.org/10.2139/ssrn.4452038"
        }
      ],
      "schema:description": "The bias uncertainty of the sensor of the linear transfer function of a sensor.",
      "schema:name": "bias uncertainty",
      "ssn:isPropertyOf": {
        "@id": "https://w3id.org/fst/resource/0184ebd9-988c-7bbb-9f6d-fca5fbdfdd0a/Bias"
      }
    },
    {
      "@id": "https://w3id.org/fst/resource/0184ebd9-988c-7bbb-9f6d-fca5fbdfdd0a/Sensitivity/SensitivityUncertainty",
      "@type": "ssn:Property",
      "dcterms:conformsTo": [
        {
          "@id": "https://doi.org/10.1007/978-3-030-78354-9"
        },
        {
          "@id": "https://dx.doi.org/10.2139/ssrn.4452038"
        }
      ],
      "rdfs:seeAlso": [
        {
          "@id": "https://doi.org/10.1007/978-3-030-78354-9"
        },
        {
          "@id": "https://dx.doi.org/10.2139/ssrn.4452038"
        }
      ],
      "schema:description": "The sensitivity uncertainty of the linear transfer function of a sensor.",
      "schema:name": "sensitivity uncertainty",
      "ssn:isPropertyOf": {
        "@id": "https://w3id.org/fst/resource/0184ebd9-988c-7bbb-9f6d-fca5fbdfdd0a/Sensitivity"
      }
    },
    {
      "@id": "https://w3id.org/fst/resource/0184ebd9-988c-7bbb-9f6d-fca5fbdfdd0a/HysteresisUncertainty",
      "@type": "ssn:Property",
      "dcterms:conformsTo": [
        {
          "@id": "https://doi.org/10.1007/978-3-030-78354-9"
        },
        {
          "@id": "https://dx.doi.org/10.2139/ssrn.4452038"
        }
      ],
      "rdfs:seeAlso": [
        {
          "@id": "https://doi.org/10.1007/978-3-030-78354-9"
        },
        {
          "@id": "https://dx.doi.org/10.2139/ssrn.4452038"
        }
      ],
      "schema:description": "The hysteresis uncertainty of the linear transfer function of a sensor.",
      "schema:name": "hysteresis uncertainty",
      "ssn:isPropertyOf": {
        "@id": "https://w3id.org/fst/resource/0184ebd9-988c-7bbb-9f6d-fca5fbdfdd0a/SensorCapability"
      }
    },
    {
      "@id": "https://w3id.org/fst/resource/0184ebd9-988c-7bbb-9f6d-fca5fbdfdd0a/SensorCapability",
      "@type": [
        "ssn:Property",
        "ssn-system:SystemCapability"
      ],
      "rdfs:comment": "sensor capabilities not regarding any conditions at this time",
      "schema:name": "sensor capabilities",
      "ssn:hasProperty": [
        {
          "@id": "https://w3id.org/fst/resource/0184ebd9-988c-7bbb-9f6d-fca5fbdfdd0a/MeasurementRange"
        },
        {
          "@id": "https://w3id.org/fst/resource/0184ebd9-988c-7bbb-9f6d-fca5fbdfdd0a/SensorActuationRange"
        },
        {
          "@id": "https://w3id.org/fst/resource/0184ebd9-988c-7bbb-9f6d-fca5fbdfdd0a/Sensitivity"
        },
        {
          "@id": "https://w3id.org/fst/resource/0184ebd9-988c-7bbb-9f6d-fca5fbdfdd0a/Bias"
        },
        {
          "@id": "https://w3id.org/fst/resource/0184ebd9-988c-7bbb-9f6d-fca5fbdfdd0a/LinearityUncertainty"
        },
        {
          "@id": "https://w3id.org/fst/resource/0184ebd9-988c-7bbb-9f6d-fca5fbdfdd0a/HysteresisUncertainty"
        }
      ]
    },
    {
      "@id": "https://w3id.org/fst/resource/0184ebd9-988c-7bbb-9f6d-fca5fbdfdd0a/Bias",
      "@type": [
        "ssn-system:SystemProperty",
        "ssn:Property"
      ],
      "qudt:unit": {
        "@id": "unit:DEG_C"
      },
      "rdfs:comment": "offset",
      "schema:name": "bias",
      "schema:value": -50.0,
      "ssn:hasProperty": {
        "@id": "https://w3id.org/fst/resource/0184ebd9-988c-7bbb-9f6d-fca5fbdfdd0a/Bias/BiasUncertainty"
      },
      "ssn:isPropertyOf": {
        "@id": "https://w3id.org/fst/resource/0184ebd9-988c-7bbb-9f6d-fca5fbdfdd0a/SensorCapability"
      }
    },
    {
      "@id": "https://w3id.org/fst/resource/0184ebd9-988c-7bbb-9f6d-fca5fbdfdd0a/Sensitivity",
      "@type": [
        "ssn-system:Sensitivity",
        "ssn:Property"
      ],
      "qudt:unit": "(°C)/(V)",
      "rdfs:comment": "gain",
      "schema:name": "sensitivity",
      "schema:value": 65.0,
      "ssn:hasProperty": {
        "@id": "https://w3id.org/fst/resource/0184ebd9-988c-7bbb-9f6d-fca5fbdfdd0a/Sensitivity/SensitivityUncertainty"
      },
      "ssn:isPropertyOf": {
        "@id": "https://w3id.org/fst/resource/0184ebd9-988c-7bbb-9f6d-fca5fbdfdd0a/SensorCapability"
      }
    }
  ]
}