{
  "@context": {
    "dbo": "http://dbpedia.org/ontology/",
    "dcat": "http://www.w3.org/ns/dcat#",
    "dcmitype": "http://purl.org/dc/dcmitype/",
    "dcterms": "http://purl.org/dc/terms/",
    "foaf": "http://xmlns.com/foaf/0.1/",
    "fst": "https://git.rwth-aachen.de/fst-tuda/.../",
    "fst1": "https://w3id.org/fst/resource/",
    "owl": "http://www.w3.org/2002/07/owl#",
    "quantitykind": "http://qudt.org/vocab/quantitykind/",
    "qudt": "http://qudt.org/schema/qudt/",
    "rdf": "http://www.w3.org/1999/02/22-rdf-syntax-ns#",
    "rdfs": "http://www.w3.org/2000/01/rdf-schema#",
    "schema": "http://schema.org/",
    "sosa": "http://www.w3.org/ns/sosa/",
    "ssn": "http://www.w3.org/ns/ssn/",
    "ssn-system": "http://www.w3.org/ns/ssn/systems/",
    "unit": "http://qudt.org/vocab/unit/",
    "uuid": "urn:uuid:",
    "xsd": "http://www.w3.org/2001/XMLSchema#"
  },
  "@graph": [
    {
      "@id": "https://w3id.org/fst/resource/0184ebd9-988c-7bbb-8f70-420d11fb31a4/MeasurementRange",
      "@type": [
        "ssn-system:MeasurementRange",
        "ssn:Property",
        "qudt:Quantity"
      ],
      "qudt:hasQuantityKind": {
        "@id": "quantitykind:Pressure"
      },
      "qudt:unit": {
        "@id": "unit:BAR"
      },
      "schema:maxValue": 10,
      "schema:minValue": 0,
      "schema:name": "measurement range",
      "schema:valueReference": "relativ",
      "ssn:isPropertyOf": {
        "@id": "https://w3id.org/fst/resource/0184ebd9-988c-7bbb-8f70-420d11fb31a4/SensorCapability"
      }
    },
    {
      "@id": "https://w3id.org/fst/resource/0184ebd9-988c-7bbb-8f70-420d11fb31a4/rdf.json",
      "@type": "foaf:Document",
      "foaf:primaryTopic": {
        "@id": "fst1:0184ebd9-988c-7bbb-8f70-420d11fb31a4"
      }
    },
    {
      "@id": "https://w3id.org/fst/resource/0184ebd9-988c-7bbb-8f70-420d11fb31a4/Bias",
      "@type": [
        "ssn-system:SystemProperty",
        "ssn:Property"
      ],
      "rdfs:comment": "offset",
      "schema:name": "bias",
      "ssn:isPropertyOf": {
        "@id": "https://w3id.org/fst/resource/0184ebd9-988c-7bbb-8f70-420d11fb31a4/SensorCapability"
      }
    },
    {
      "@id": "fst1:0184ebd9-988c-7bbb-8f70-420d11fb31a4",
      "@type": [
        "dcmitype:PhysicalObject",
        "sosa:Sensor"
      ],
      "dbo:maintainedBy": "Wetterich",
      "dbo:owner": "FST",
      "dcterms:identifier": [
        "0184ebd9-988c-7bbb-8f70-420d11fb31a4",
        "fst-inv:D123"
      ],
      "dcterms:modified": {
        "@type": "xsd:dateTime",
        "@value": "2021-02-17T00:00:00"
      },
      "schema:documentation": {
        "@id": "docs/"
      },
      "schema:keywords": [
        "Druck",
        "relativ",
        "Piezoresistiv"
      ],
      "schema:location": "Sirup Mischanlage",
      "schema:manufacturer": "Keller",
      "schema:name": "PD-33X/10bar",
      "schema:serialNumber": "1226639",
      "schema:subjectOf": {
        "@id": "docs/"
      },
      "sosa:usedProcedure": "Piezoresistiv",
      "ssn-system:hasSystemCapability": {
        "@id": "https://w3id.org/fst/resource/0184ebd9-988c-7bbb-8f70-420d11fb31a4/SensorCapability"
      }
    },
    {
      "@id": "https://w3id.org/fst/resource/0184ebd9-988c-7bbb-8f70-420d11fb31a4/SensorCapability",
      "@type": [
        "ssn:Property",
        "ssn-system:SystemCapability"
      ],
      "rdfs:comment": "sensor capabilities not regarding any conditions at this time",
      "schema:name": "sensor capabilities",
      "ssn:hasProperty": [
        {
          "@id": "https://w3id.org/fst/resource/0184ebd9-988c-7bbb-8f70-420d11fb31a4/MeasurementRange"
        },
        {
          "@id": "https://w3id.org/fst/resource/0184ebd9-988c-7bbb-8f70-420d11fb31a4/Sensitivity"
        },
        {
          "@id": "https://w3id.org/fst/resource/0184ebd9-988c-7bbb-8f70-420d11fb31a4/Bias"
        }
      ]
    },
    {
      "@id": "https://w3id.org/fst/resource/0184ebd9-988c-7bbb-8f70-420d11fb31a4/rdf.xml",
      "@type": "foaf:Document",
      "foaf:primaryTopic": {
        "@id": "fst1:0184ebd9-988c-7bbb-8f70-420d11fb31a4"
      }
    },
    {
      "@id": "https://w3id.org/fst/resource/0184ebd9-988c-7bbb-8f70-420d11fb31a4/Sensitivity",
      "@type": [
        "ssn-system:Sensitivity",
        "ssn:Property"
      ],
      "rdfs:comment": "gain",
      "schema:name": "sensitivity",
      "ssn:isPropertyOf": {
        "@id": "https://w3id.org/fst/resource/0184ebd9-988c-7bbb-8f70-420d11fb31a4/SensorCapability"
      }
    },
    {
      "@id": "https://w3id.org/fst/resource/0184ebd9-988c-7bbb-8f70-420d11fb31a4/rdf.ttl",
      "@type": "foaf:Document",
      "foaf:primaryTopic": {
        "@id": "fst1:0184ebd9-988c-7bbb-8f70-420d11fb31a4"
      }
    }
  ]
}