{
    "8881-1":{
        "item number":"8881-1",
        "item description":"Power Functions Battery Box",
        "category":"battery",
        "related items":"8882-1, 8883-1, 88003-1",
        "price [Euro]":12,
        "mass [g]":179.4,
        "environmental impact [kg CO2e /kg]":6.95,
        "delivery time [days]":3,
        "data source":"https://www.bricklink.com/v2/catalog/catalogitem.page?S=8881-1",
        "output voltage [V]":9,
        "dimensions [cm]":"8,8 x 6,3 x 3,2"
    }
}