{
	"JSON": {
		"ID": "1ee57b5f-6253-6438-a83f-4c0437beda63",
		"label": "PDC019",
		"comment": "UUID6 is used"
	},
	"probe": {
		"material": "Aluminium",
		"mass": {
			"value": 0,
			"unit": "gramm",
			"uncertainty": {
				"value": 1,
				"type": "absolut",
				"unit": "gramm"
			}
		},
		"dimensions": {
			"height": {
				"value": 40,
				"unit": "millimeter"
			},
			"diameter": {
				"value": 60,
				"unit": "millimeter"
			},
			"volume": {
				"value": 80570,
				"unit": "cubic millimeter"
			}
		}
	}
}