{
	"JSON": {
		"ID": "1ee7d44e-01cd-6c7e-9bef-cdb0fb992ba6",
		"label": "PDC030",
		"comment": "UUID6 is used"
	},
	"probe": {
		"material": "PA_6_6",
		"mass": {
			"value": 0,
			"unit": "gramm",
			"uncertainty": {
				"value": 1,
				"type": "absolut",
				"unit": "gramm"
			}
		},
		"dimensions": {
			"height": {
				"value": 40,
				"unit": "millimeter"
			},
			"diameter": {
				"value": 60,
				"unit": "millimeter"
			},
			"volume": {
				"value": 80570,
				"unit": "cubic millimeter"
			}
		}
	}
}