Pe,Nu,Nu_StdUnc,Measurement_UUID
5.91262682981922,0.972449977817565-0.15868996481629i,0.547804660590499-0.0311003580108056i,018e781f-cba0-7987-aab8-7cab3e7e5bd8
11.8232538861893,0.996872248538883-0.282042571218632i,0.511438959588659-0.316431770498328i,018e781f-cba1-795d-a2aa-227e14388a49
29.5434712361881,1.14064294154834-0.469873624376744i,0.528032093717507-0.890233675703222i,018e781f-cba2-7d5c-ad8c-fc2ec931dfd5
59.0954263355604,1.41541971744632-0.793535421459062i,0.635744747225168-1.76996378866545i,018e781f-cba3-7fd5-bc55-0d1fc0b49fb9
118.211861339187,1.74593179160122-1.31161389681575i,0.766833257902321-3.45118571297849i,018e781f-cba4-7ef0-acf3-045df277f257
295.440603401755,2.11805447616286-2.3731089382851i,0.941495796317868-8.2478914844186i,018e781f-cba5-7bc4-ae54-003a4f60ee61
590.956456844937,3.55359943382131-3.61587722051924i,1.81016246014671-15.9840929619948i,018e781f-cba6-7f8b-8467-f9cd101e3780
886.205700678325,4.70490918501068-1.71273959814842i,2.89354304382391-22.330437202596i,018e781f-cba7-7f28-ae69-da0d0c732072
1181.79262649516,6.63445314981908-2.95328909378371i,4.71877215017241-30.051210850224i,018e781f-cba8-70b7-b674-6777369e2b7d
1477.08004589071,8.13567807849408-5.78668570453858i,7.03533041661177-38.5281379784146i,018e781f-cba9-7421-899b-a88d9ba85223
1772.63193725533,9.90452724673972-3.54685150599593i,9.54674634650203-44.7486679200501i,018e781f-cbaa-7633-abb6-cfa605830f2c
2067.8635813507,11.2561542239315-3.09251216328437i,12.6164819994185-51.8781130102992i,018e781f-cbab-708f-9794-be3afe8b0cc6
2363.46194465749,12.717106364223-4.41157669752369i,16.1677455775067-59.5117285087372i,018e781f-cbac-78d3-a32f-36f02fdff41a
2658.68291568583,14.9214595834331-5.53990232527309i,20.4328554514253-67.2697590377775i,018e781f-cbad-7763-904a-30e31dbd4cd6
2954.61909711925,18.0638301638599-4.65176379103754i,24.9199585021068-74.0138810204193i,018e781f-cbae-788a-a27a-34b935cd6344
3247.88216437196,23.5110243691565-5.94458020022965i,30.9621763390669-82.1013593776915i,018e781f-cbaf-79ba-938f-d75af70c1a05
3545.31655759936,23.0852552471786-3.77166598179243i,35.746842108688-88.2928165038479i,018e781f-cbb0-7fe3-8a9a-3763545b39ca
3838.85097702165,26.5745619842463-0.500747695673132i,41.6365433738333-94.6970627200894i,018e781f-cbb1-79f8-a5bd-638fe5cb60df
4135.00809453949,26.1167687666452-3.13304357095675i,48.3589958923383-102.717078915164i,018e781f-cbb2-74ba-958c-cc0142b3dbfe
4430.67442993182,29.1577979295321-0.0470465372982704i,53.8881142498558-108.145873203561i,018e781f-cbb3-7a44-9be7-acdd28db7c90
4725.46507365273,34.7143956700198-4.14010136949236i,61.8381880817596-116.756643407075i,018e781f-cbb4-78be-a62e-0fd43bfcd1be
5021.04723531159,39.4581985618512+6.19781120031106i,68.8437431108443-120.638506187257i,018e781f-cbb5-7bb0-b61a-aa5377c4d314
5316.49354720059,46.3798141753173+2.19252928445763i,77.0172438714547-128.484717475616i,018e781f-cbb6-7b1b-915e-555f41a80a60
5611.430112718,45.3816462007144+5.70212914648796i,84.8963227102918-134.314226735868i,018e781f-cbb7-757d-9d78-6cfeadc33923
5907.09015679466,50.8584374623703-4.36809060546021i,95.9843171675001-145.314021948594i,018e781f-cbb8-7341-b857-d6a0aa1659cf
7086.76969605618,72.4096541845007+15.1542604923713i,133.251662750357-166.622862179335i,018e781f-cbb9-7533-976b-0e9a0b287243
8859.20991150249,107.871064969094+60.7460787787819i,196.734616231539-195.423605022553i,018e781f-cbba-765d-9202-6ad0881de7e0
10628.5065071148,113.519356238402+22.9450383950651i,302.417548822948-253.342019098184i,018e781f-cbbb-73ee-8293-5646efc01ec2
11809.0950854423,165.95753298779+55.4677314560157i,346.558264827854-262.357239728841i,018e781f-cbbc-7cfb-a7da-80823c78b2d4
