<?xml version="1.0" encoding="utf-8" standalone="no"?>
<!DOCTYPE svg PUBLIC "-//W3C//DTD SVG 1.1//EN" "http://www.w3.org/Graphics/SVG/1.1/DTD/svg11.dtd">
<svg xmlns:xlink="http://www.w3.org/1999/xlink" width="460.8pt" height="345.6pt" viewBox="0 0 460.8 345.6"
       xmlns="http://www.w3.org/2000/svg" version="1.1">
       <metadata>
              <rdf:RDF xmlns:dc="http://purl.org/dc/elements/1.1/" xmlns:cc="http://creativecommons.org/ns#"
                     xmlns:rdf="http://www.w3.org/1999/02/22-rdf-syntax-ns#">
                     <cc:Work>
                            <dc:type rdf:resource="http://purl.org/dc/dcmitype/StillImage" />
                            <dc:date>2024-09-15T11:49:00.440485</dc:date>
                            <dc:format>image/svg+xml</dc:format>
                            <dc:creator>
                                   <cc:Agent>
                                          <dc:title>Matplotlib v3.9.0, https://matplotlib.org/</dc:title>
                                   </cc:Agent>
                            </dc:creator>
                     </cc:Work>
              </rdf:RDF>
       </metadata>
       <defs>
              <style type="text/css">
                     * {
                            stroke-linejoin: round;
                            stroke-linecap: butt
                     }
              </style>
       </defs>
       <g id="figure_1">
              <g id="patch_1">
                     <path d="M 0 345.6 
L 460.8 345.6 
L 460.8 0 
L 0 0 
z
" style="fill: #ffffff" />
              </g>
              <g id="axes_1">
                     <g id="patch_2">
                            <path d="M 57.6 307.584 
L 414.72 307.584 
L 414.72 41.472 
L 57.6 41.472 
z
" style="fill: #ffffff" />
                     </g>
                     <g id="matplotlib.axis_1">
                            <g id="xtick_1">
                                   <g id="line2d_1">
                                          <defs>
                                                 <path id="m948287bb81" d="M 0 0 
L 0 3.5 
" style="stroke: #000000; stroke-width: 0.8" />
                                          </defs>
                                          <g>
                                                 <use xlink:href="#m948287bb81" x="73.832727" y="307.584"
                                                        style="stroke: #000000; stroke-width: 0.8" />
                                          </g>
                                   </g>
                                   <g id="text_1">
                                          <!-- −10.0 -->
                                          <g transform="translate(58.510071 322.182437) scale(0.1 -0.1)">
                                                 <defs>
                                                        <path id="DejaVuSans-2212" d="M 678 2272 
L 4684 2272 
L 4684 1741 
L 678 1741 
L 678 2272 
z
" transform="scale(0.015625)" />
                                                        <path id="DejaVuSans-31" d="M 794 531 
L 1825 531 
L 1825 4091 
L 703 3866 
L 703 4441 
L 1819 4666 
L 2450 4666 
L 2450 531 
L 3481 531 
L 3481 0 
L 794 0 
L 794 531 
z
" transform="scale(0.015625)" />
                                                        <path id="DejaVuSans-30" d="M 2034 4250 
Q 1547 4250 1301 3770 
Q 1056 3291 1056 2328 
Q 1056 1369 1301 889 
Q 1547 409 2034 409 
Q 2525 409 2770 889 
Q 3016 1369 3016 2328 
Q 3016 3291 2770 3770 
Q 2525 4250 2034 4250 
z
M 2034 4750 
Q 2819 4750 3233 4129 
Q 3647 3509 3647 2328 
Q 3647 1150 3233 529 
Q 2819 -91 2034 -91 
Q 1250 -91 836 529 
Q 422 1150 422 2328 
Q 422 3509 836 4129 
Q 1250 4750 2034 4750 
z
" transform="scale(0.015625)" />
                                                        <path id="DejaVuSans-2e" d="M 684 794 
L 1344 794 
L 1344 0 
L 684 0 
L 684 794 
z
" transform="scale(0.015625)" />
                                                 </defs>
                                                 <use xlink:href="#DejaVuSans-2212" />
                                                 <use xlink:href="#DejaVuSans-31" x="83.789062" />
                                                 <use xlink:href="#DejaVuSans-30" x="147.412109" />
                                                 <use xlink:href="#DejaVuSans-2e" x="211.035156" />
                                                 <use xlink:href="#DejaVuSans-30" x="242.822266" />
                                          </g>
                                   </g>
                            </g>
                            <g id="xtick_2">
                                   <g id="line2d_2">
                                          <g>
                                                 <use xlink:href="#m948287bb81" x="114.414545" y="307.584"
                                                        style="stroke: #000000; stroke-width: 0.8" />
                                          </g>
                                   </g>
                                   <g id="text_2">
                                          <!-- −7.5 -->
                                          <g transform="translate(102.273139 322.182437) scale(0.1 -0.1)">
                                                 <defs>
                                                        <path id="DejaVuSans-37" d="M 525 4666 
L 3525 4666 
L 3525 4397 
L 1831 0 
L 1172 0 
L 2766 4134 
L 525 4134 
L 525 4666 
z
" transform="scale(0.015625)" />
                                                        <path id="DejaVuSans-35" d="M 691 4666 
L 3169 4666 
L 3169 4134 
L 1269 4134 
L 1269 2991 
Q 1406 3038 1543 3061 
Q 1681 3084 1819 3084 
Q 2600 3084 3056 2656 
Q 3513 2228 3513 1497 
Q 3513 744 3044 326 
Q 2575 -91 1722 -91 
Q 1428 -91 1123 -41 
Q 819 9 494 109 
L 494 744 
Q 775 591 1075 516 
Q 1375 441 1709 441 
Q 2250 441 2565 725 
Q 2881 1009 2881 1497 
Q 2881 1984 2565 2268 
Q 2250 2553 1709 2553 
Q 1456 2553 1204 2497 
Q 953 2441 691 2322 
L 691 4666 
z
" transform="scale(0.015625)" />
                                                 </defs>
                                                 <use xlink:href="#DejaVuSans-2212" />
                                                 <use xlink:href="#DejaVuSans-37" x="83.789062" />
                                                 <use xlink:href="#DejaVuSans-2e" x="147.412109" />
                                                 <use xlink:href="#DejaVuSans-35" x="179.199219" />
                                          </g>
                                   </g>
                            </g>
                            <g id="xtick_3">
                                   <g id="line2d_3">
                                          <g>
                                                 <use xlink:href="#m948287bb81" x="154.996364" y="307.584"
                                                        style="stroke: #000000; stroke-width: 0.8" />
                                          </g>
                                   </g>
                                   <g id="text_3">
                                          <!-- −5.0 -->
                                          <g transform="translate(142.854957 322.182437) scale(0.1 -0.1)">
                                                 <use xlink:href="#DejaVuSans-2212" />
                                                 <use xlink:href="#DejaVuSans-35" x="83.789062" />
                                                 <use xlink:href="#DejaVuSans-2e" x="147.412109" />
                                                 <use xlink:href="#DejaVuSans-30" x="179.199219" />
                                          </g>
                                   </g>
                            </g>
                            <g id="xtick_4">
                                   <g id="line2d_4">
                                          <g>
                                                 <use xlink:href="#m948287bb81" x="195.578182" y="307.584"
                                                        style="stroke: #000000; stroke-width: 0.8" />
                                          </g>
                                   </g>
                                   <g id="text_4">
                                          <!-- −2.5 -->
                                          <g transform="translate(183.436776 322.182437) scale(0.1 -0.1)">
                                                 <defs>
                                                        <path id="DejaVuSans-32" d="M 1228 531 
L 3431 531 
L 3431 0 
L 469 0 
L 469 531 
Q 828 903 1448 1529 
Q 2069 2156 2228 2338 
Q 2531 2678 2651 2914 
Q 2772 3150 2772 3378 
Q 2772 3750 2511 3984 
Q 2250 4219 1831 4219 
Q 1534 4219 1204 4116 
Q 875 4013 500 3803 
L 500 4441 
Q 881 4594 1212 4672 
Q 1544 4750 1819 4750 
Q 2544 4750 2975 4387 
Q 3406 4025 3406 3419 
Q 3406 3131 3298 2873 
Q 3191 2616 2906 2266 
Q 2828 2175 2409 1742 
Q 1991 1309 1228 531 
z
" transform="scale(0.015625)" />
                                                 </defs>
                                                 <use xlink:href="#DejaVuSans-2212" />
                                                 <use xlink:href="#DejaVuSans-32" x="83.789062" />
                                                 <use xlink:href="#DejaVuSans-2e" x="147.412109" />
                                                 <use xlink:href="#DejaVuSans-35" x="179.199219" />
                                          </g>
                                   </g>
                            </g>
                            <g id="xtick_5">
                                   <g id="line2d_5">
                                          <g>
                                                 <use xlink:href="#m948287bb81" x="236.16" y="307.584"
                                                        style="stroke: #000000; stroke-width: 0.8" />
                                          </g>
                                   </g>
                                   <g id="text_5">
                                          <!-- 0.0 -->
                                          <g transform="translate(228.208438 322.182437) scale(0.1 -0.1)">
                                                 <use xlink:href="#DejaVuSans-30" />
                                                 <use xlink:href="#DejaVuSans-2e" x="63.623047" />
                                                 <use xlink:href="#DejaVuSans-30" x="95.410156" />
                                          </g>
                                   </g>
                            </g>
                            <g id="xtick_6">
                                   <g id="line2d_6">
                                          <g>
                                                 <use xlink:href="#m948287bb81" x="276.741818" y="307.584"
                                                        style="stroke: #000000; stroke-width: 0.8" />
                                          </g>
                                   </g>
                                   <g id="text_6">
                                          <!-- 2.5 -->
                                          <g transform="translate(268.790256 322.182437) scale(0.1 -0.1)">
                                                 <use xlink:href="#DejaVuSans-32" />
                                                 <use xlink:href="#DejaVuSans-2e" x="63.623047" />
                                                 <use xlink:href="#DejaVuSans-35" x="95.410156" />
                                          </g>
                                   </g>
                            </g>
                            <g id="xtick_7">
                                   <g id="line2d_7">
                                          <g>
                                                 <use xlink:href="#m948287bb81" x="317.323636" y="307.584"
                                                        style="stroke: #000000; stroke-width: 0.8" />
                                          </g>
                                   </g>
                                   <g id="text_7">
                                          <!-- 5.0 -->
                                          <g transform="translate(309.372074 322.182437) scale(0.1 -0.1)">
                                                 <use xlink:href="#DejaVuSans-35" />
                                                 <use xlink:href="#DejaVuSans-2e" x="63.623047" />
                                                 <use xlink:href="#DejaVuSans-30" x="95.410156" />
                                          </g>
                                   </g>
                            </g>
                            <g id="xtick_8">
                                   <g id="line2d_8">
                                          <g>
                                                 <use xlink:href="#m948287bb81" x="357.905455" y="307.584"
                                                        style="stroke: #000000; stroke-width: 0.8" />
                                          </g>
                                   </g>
                                   <g id="text_8">
                                          <!-- 7.5 -->
                                          <g transform="translate(349.953892 322.182437) scale(0.1 -0.1)">
                                                 <use xlink:href="#DejaVuSans-37" />
                                                 <use xlink:href="#DejaVuSans-2e" x="63.623047" />
                                                 <use xlink:href="#DejaVuSans-35" x="95.410156" />
                                          </g>
                                   </g>
                            </g>
                            <g id="xtick_9">
                                   <g id="line2d_9">
                                          <g>
                                                 <use xlink:href="#m948287bb81" x="398.487273" y="307.584"
                                                        style="stroke: #000000; stroke-width: 0.8" />
                                          </g>
                                   </g>
                                   <g id="text_9">
                                          <!-- 10.0 -->
                                          <g transform="translate(387.35446 322.182437) scale(0.1 -0.1)">
                                                 <use xlink:href="#DejaVuSans-31" />
                                                 <use xlink:href="#DejaVuSans-30" x="63.623047" />
                                                 <use xlink:href="#DejaVuSans-2e" x="127.246094" />
                                                 <use xlink:href="#DejaVuSans-30" x="159.033203" />
                                          </g>
                                   </g>
                            </g>
                            <g id="text_10">
                                   <!-- x -->
                                   <g transform="translate(233.200625 335.860562) scale(0.1 -0.1)">
                                          <defs>
                                                 <path id="DejaVuSans-78" d="M 3513 3500 
L 2247 1797 
L 3578 0 
L 2900 0 
L 1881 1375 
L 863 0 
L 184 0 
L 1544 1831 
L 300 3500 
L 978 3500 
L 1906 2253 
L 2834 3500 
L 3513 3500 
z
" transform="scale(0.015625)" />
                                          </defs>
                                          <use xlink:href="#DejaVuSans-78" />
                                   </g>
                            </g>
                     </g>
                     <g id="matplotlib.axis_2">
                            <g id="ytick_1">
                                   <g id="line2d_10">
                                          <defs>
                                                 <path id="m3b927a8e42" d="M 0 0 
L -3.5 0 
" style="stroke: #000000; stroke-width: 0.8" />
                                          </defs>
                                          <g>
                                                 <use xlink:href="#m3b927a8e42" x="57.6" y="295.488"
                                                        style="stroke: #000000; stroke-width: 0.8" />
                                          </g>
                                   </g>
                                   <g id="text_11">
                                          <!-- 0.000 -->
                                          <g transform="translate(21.971875 299.287219) scale(0.1 -0.1)">
                                                 <use xlink:href="#DejaVuSans-30" />
                                                 <use xlink:href="#DejaVuSans-2e" x="63.623047" />
                                                 <use xlink:href="#DejaVuSans-30" x="95.410156" />
                                                 <use xlink:href="#DejaVuSans-30" x="159.033203" />
                                                 <use xlink:href="#DejaVuSans-30" x="222.65625" />
                                          </g>
                                   </g>
                            </g>
                            <g id="ytick_2">
                                   <g id="line2d_11">
                                          <g>
                                                 <use xlink:href="#m3b927a8e42" x="57.6" y="261.940903"
                                                        style="stroke: #000000; stroke-width: 0.8" />
                                          </g>
                                   </g>
                                   <g id="text_12">
                                          <!-- 0.025 -->
                                          <g transform="translate(21.971875 265.740121) scale(0.1 -0.1)">
                                                 <use xlink:href="#DejaVuSans-30" />
                                                 <use xlink:href="#DejaVuSans-2e" x="63.623047" />
                                                 <use xlink:href="#DejaVuSans-30" x="95.410156" />
                                                 <use xlink:href="#DejaVuSans-32" x="159.033203" />
                                                 <use xlink:href="#DejaVuSans-35" x="222.65625" />
                                          </g>
                                   </g>
                            </g>
                            <g id="ytick_3">
                                   <g id="line2d_12">
                                          <g>
                                                 <use xlink:href="#m3b927a8e42" x="57.6" y="228.393805"
                                                        style="stroke: #000000; stroke-width: 0.8" />
                                          </g>
                                   </g>
                                   <g id="text_13">
                                          <!-- 0.050 -->
                                          <g transform="translate(21.971875 232.193024) scale(0.1 -0.1)">
                                                 <use xlink:href="#DejaVuSans-30" />
                                                 <use xlink:href="#DejaVuSans-2e" x="63.623047" />
                                                 <use xlink:href="#DejaVuSans-30" x="95.410156" />
                                                 <use xlink:href="#DejaVuSans-35" x="159.033203" />
                                                 <use xlink:href="#DejaVuSans-30" x="222.65625" />
                                          </g>
                                   </g>
                            </g>
                            <g id="ytick_4">
                                   <g id="line2d_13">
                                          <g>
                                                 <use xlink:href="#m3b927a8e42" x="57.6" y="194.846708"
                                                        style="stroke: #000000; stroke-width: 0.8" />
                                          </g>
                                   </g>
                                   <g id="text_14">
                                          <!-- 0.075 -->
                                          <g transform="translate(21.971875 198.645927) scale(0.1 -0.1)">
                                                 <use xlink:href="#DejaVuSans-30" />
                                                 <use xlink:href="#DejaVuSans-2e" x="63.623047" />
                                                 <use xlink:href="#DejaVuSans-30" x="95.410156" />
                                                 <use xlink:href="#DejaVuSans-37" x="159.033203" />
                                                 <use xlink:href="#DejaVuSans-35" x="222.65625" />
                                          </g>
                                   </g>
                            </g>
                            <g id="ytick_5">
                                   <g id="line2d_14">
                                          <g>
                                                 <use xlink:href="#m3b927a8e42" x="57.6" y="161.299611"
                                                        style="stroke: #000000; stroke-width: 0.8" />
                                          </g>
                                   </g>
                                   <g id="text_15">
                                          <!-- 0.100 -->
                                          <g transform="translate(21.971875 165.098829) scale(0.1 -0.1)">
                                                 <use xlink:href="#DejaVuSans-30" />
                                                 <use xlink:href="#DejaVuSans-2e" x="63.623047" />
                                                 <use xlink:href="#DejaVuSans-31" x="95.410156" />
                                                 <use xlink:href="#DejaVuSans-30" x="159.033203" />
                                                 <use xlink:href="#DejaVuSans-30" x="222.65625" />
                                          </g>
                                   </g>
                            </g>
                            <g id="ytick_6">
                                   <g id="line2d_15">
                                          <g>
                                                 <use xlink:href="#m3b927a8e42" x="57.6" y="127.752513"
                                                        style="stroke: #000000; stroke-width: 0.8" />
                                          </g>
                                   </g>
                                   <g id="text_16">
                                          <!-- 0.125 -->
                                          <g transform="translate(21.971875 131.551732) scale(0.1 -0.1)">
                                                 <use xlink:href="#DejaVuSans-30" />
                                                 <use xlink:href="#DejaVuSans-2e" x="63.623047" />
                                                 <use xlink:href="#DejaVuSans-31" x="95.410156" />
                                                 <use xlink:href="#DejaVuSans-32" x="159.033203" />
                                                 <use xlink:href="#DejaVuSans-35" x="222.65625" />
                                          </g>
                                   </g>
                            </g>
                            <g id="ytick_7">
                                   <g id="line2d_16">
                                          <g>
                                                 <use xlink:href="#m3b927a8e42" x="57.6" y="94.205416"
                                                        style="stroke: #000000; stroke-width: 0.8" />
                                          </g>
                                   </g>
                                   <g id="text_17">
                                          <!-- 0.150 -->
                                          <g transform="translate(21.971875 98.004635) scale(0.1 -0.1)">
                                                 <use xlink:href="#DejaVuSans-30" />
                                                 <use xlink:href="#DejaVuSans-2e" x="63.623047" />
                                                 <use xlink:href="#DejaVuSans-31" x="95.410156" />
                                                 <use xlink:href="#DejaVuSans-35" x="159.033203" />
                                                 <use xlink:href="#DejaVuSans-30" x="222.65625" />
                                          </g>
                                   </g>
                            </g>
                            <g id="ytick_8">
                                   <g id="line2d_17">
                                          <g>
                                                 <use xlink:href="#m3b927a8e42" x="57.6" y="60.658319"
                                                        style="stroke: #000000; stroke-width: 0.8" />
                                          </g>
                                   </g>
                                   <g id="text_18">
                                          <!-- 0.175 -->
                                          <g transform="translate(21.971875 64.457537) scale(0.1 -0.1)">
                                                 <use xlink:href="#DejaVuSans-30" />
                                                 <use xlink:href="#DejaVuSans-2e" x="63.623047" />
                                                 <use xlink:href="#DejaVuSans-31" x="95.410156" />
                                                 <use xlink:href="#DejaVuSans-37" x="159.033203" />
                                                 <use xlink:href="#DejaVuSans-35" x="222.65625" />
                                          </g>
                                   </g>
                            </g>
                            <g id="text_19">
                                   <!-- Probability Density -->
                                   <g transform="translate(15.892187 221.554563) rotate(-90) scale(0.1 -0.1)">
                                          <defs>
                                                 <path id="DejaVuSans-50" d="M 1259 4147 
L 1259 2394 
L 2053 2394 
Q 2494 2394 2734 2622 
Q 2975 2850 2975 3272 
Q 2975 3691 2734 3919 
Q 2494 4147 2053 4147 
L 1259 4147 
z
M 628 4666 
L 2053 4666 
Q 2838 4666 3239 4311 
Q 3641 3956 3641 3272 
Q 3641 2581 3239 2228 
Q 2838 1875 2053 1875 
L 1259 1875 
L 1259 0 
L 628 0 
L 628 4666 
z
" transform="scale(0.015625)" />
                                                 <path id="DejaVuSans-72" d="M 2631 2963 
Q 2534 3019 2420 3045 
Q 2306 3072 2169 3072 
Q 1681 3072 1420 2755 
Q 1159 2438 1159 1844 
L 1159 0 
L 581 0 
L 581 3500 
L 1159 3500 
L 1159 2956 
Q 1341 3275 1631 3429 
Q 1922 3584 2338 3584 
Q 2397 3584 2469 3576 
Q 2541 3569 2628 3553 
L 2631 2963 
z
" transform="scale(0.015625)" />
                                                 <path id="DejaVuSans-6f" d="M 1959 3097 
Q 1497 3097 1228 2736 
Q 959 2375 959 1747 
Q 959 1119 1226 758 
Q 1494 397 1959 397 
Q 2419 397 2687 759 
Q 2956 1122 2956 1747 
Q 2956 2369 2687 2733 
Q 2419 3097 1959 3097 
z
M 1959 3584 
Q 2709 3584 3137 3096 
Q 3566 2609 3566 1747 
Q 3566 888 3137 398 
Q 2709 -91 1959 -91 
Q 1206 -91 779 398 
Q 353 888 353 1747 
Q 353 2609 779 3096 
Q 1206 3584 1959 3584 
z
" transform="scale(0.015625)" />
                                                 <path id="DejaVuSans-62" d="M 3116 1747 
Q 3116 2381 2855 2742 
Q 2594 3103 2138 3103 
Q 1681 3103 1420 2742 
Q 1159 2381 1159 1747 
Q 1159 1113 1420 752 
Q 1681 391 2138 391 
Q 2594 391 2855 752 
Q 3116 1113 3116 1747 
z
M 1159 2969 
Q 1341 3281 1617 3432 
Q 1894 3584 2278 3584 
Q 2916 3584 3314 3078 
Q 3713 2572 3713 1747 
Q 3713 922 3314 415 
Q 2916 -91 2278 -91 
Q 1894 -91 1617 61 
Q 1341 213 1159 525 
L 1159 0 
L 581 0 
L 581 4863 
L 1159 4863 
L 1159 2969 
z
" transform="scale(0.015625)" />
                                                 <path id="DejaVuSans-61" d="M 2194 1759 
Q 1497 1759 1228 1600 
Q 959 1441 959 1056 
Q 959 750 1161 570 
Q 1363 391 1709 391 
Q 2188 391 2477 730 
Q 2766 1069 2766 1631 
L 2766 1759 
L 2194 1759 
z
M 3341 1997 
L 3341 0 
L 2766 0 
L 2766 531 
Q 2569 213 2275 61 
Q 1981 -91 1556 -91 
Q 1019 -91 701 211 
Q 384 513 384 1019 
Q 384 1609 779 1909 
Q 1175 2209 1959 2209 
L 2766 2209 
L 2766 2266 
Q 2766 2663 2505 2880 
Q 2244 3097 1772 3097 
Q 1472 3097 1187 3025 
Q 903 2953 641 2809 
L 641 3341 
Q 956 3463 1253 3523 
Q 1550 3584 1831 3584 
Q 2591 3584 2966 3190 
Q 3341 2797 3341 1997 
z
" transform="scale(0.015625)" />
                                                 <path id="DejaVuSans-69" d="M 603 3500 
L 1178 3500 
L 1178 0 
L 603 0 
L 603 3500 
z
M 603 4863 
L 1178 4863 
L 1178 4134 
L 603 4134 
L 603 4863 
z
" transform="scale(0.015625)" />
                                                 <path id="DejaVuSans-6c" d="M 603 4863 
L 1178 4863 
L 1178 0 
L 603 0 
L 603 4863 
z
" transform="scale(0.015625)" />
                                                 <path id="DejaVuSans-74" d="M 1172 4494 
L 1172 3500 
L 2356 3500 
L 2356 3053 
L 1172 3053 
L 1172 1153 
Q 1172 725 1289 603 
Q 1406 481 1766 481 
L 2356 481 
L 2356 0 
L 1766 0 
Q 1100 0 847 248 
Q 594 497 594 1153 
L 594 3053 
L 172 3053 
L 172 3500 
L 594 3500 
L 594 4494 
L 1172 4494 
z
" transform="scale(0.015625)" />
                                                 <path id="DejaVuSans-79" d="M 2059 -325 
Q 1816 -950 1584 -1140 
Q 1353 -1331 966 -1331 
L 506 -1331 
L 506 -850 
L 844 -850 
Q 1081 -850 1212 -737 
Q 1344 -625 1503 -206 
L 1606 56 
L 191 3500 
L 800 3500 
L 1894 763 
L 2988 3500 
L 3597 3500 
L 2059 -325 
z
" transform="scale(0.015625)" />
                                                 <path id="DejaVuSans-20" transform="scale(0.015625)" />
                                                 <path id="DejaVuSans-44" d="M 1259 4147 
L 1259 519 
L 2022 519 
Q 2988 519 3436 956 
Q 3884 1394 3884 2338 
Q 3884 3275 3436 3711 
Q 2988 4147 2022 4147 
L 1259 4147 
z
M 628 4666 
L 1925 4666 
Q 3281 4666 3915 4102 
Q 4550 3538 4550 2338 
Q 4550 1131 3912 565 
Q 3275 0 1925 0 
L 628 0 
L 628 4666 
z
" transform="scale(0.015625)" />
                                                 <path id="DejaVuSans-65" d="M 3597 1894 
L 3597 1613 
L 953 1613 
Q 991 1019 1311 708 
Q 1631 397 2203 397 
Q 2534 397 2845 478 
Q 3156 559 3463 722 
L 3463 178 
Q 3153 47 2828 -22 
Q 2503 -91 2169 -91 
Q 1331 -91 842 396 
Q 353 884 353 1716 
Q 353 2575 817 3079 
Q 1281 3584 2069 3584 
Q 2775 3584 3186 3129 
Q 3597 2675 3597 1894 
z
M 3022 2063 
Q 3016 2534 2758 2815 
Q 2500 3097 2075 3097 
Q 1594 3097 1305 2825 
Q 1016 2553 972 2059 
L 3022 2063 
z
" transform="scale(0.015625)" />
                                                 <path id="DejaVuSans-6e" d="M 3513 2113 
L 3513 0 
L 2938 0 
L 2938 2094 
Q 2938 2591 2744 2837 
Q 2550 3084 2163 3084 
Q 1697 3084 1428 2787 
Q 1159 2491 1159 1978 
L 1159 0 
L 581 0 
L 581 3500 
L 1159 3500 
L 1159 2956 
Q 1366 3272 1645 3428 
Q 1925 3584 2291 3584 
Q 2894 3584 3203 3211 
Q 3513 2838 3513 2113 
z
" transform="scale(0.015625)" />
                                                 <path id="DejaVuSans-73" d="M 2834 3397 
L 2834 2853 
Q 2591 2978 2328 3040 
Q 2066 3103 1784 3103 
Q 1356 3103 1142 2972 
Q 928 2841 928 2578 
Q 928 2378 1081 2264 
Q 1234 2150 1697 2047 
L 1894 2003 
Q 2506 1872 2764 1633 
Q 3022 1394 3022 966 
Q 3022 478 2636 193 
Q 2250 -91 1575 -91 
Q 1294 -91 989 -36 
Q 684 19 347 128 
L 347 722 
Q 666 556 975 473 
Q 1284 391 1588 391 
Q 1994 391 2212 530 
Q 2431 669 2431 922 
Q 2431 1156 2273 1281 
Q 2116 1406 1581 1522 
L 1381 1569 
Q 847 1681 609 1914 
Q 372 2147 372 2553 
Q 372 3047 722 3315 
Q 1072 3584 1716 3584 
Q 2034 3584 2315 3537 
Q 2597 3491 2834 3397 
z
" transform="scale(0.015625)" />
                                          </defs>
                                          <use xlink:href="#DejaVuSans-50" />
                                          <use xlink:href="#DejaVuSans-72" x="58.552734" />
                                          <use xlink:href="#DejaVuSans-6f" x="97.416016" />
                                          <use xlink:href="#DejaVuSans-62" x="158.597656" />
                                          <use xlink:href="#DejaVuSans-61" x="222.074219" />
                                          <use xlink:href="#DejaVuSans-62" x="283.353516" />
                                          <use xlink:href="#DejaVuSans-69" x="346.830078" />
                                          <use xlink:href="#DejaVuSans-6c" x="374.613281" />
                                          <use xlink:href="#DejaVuSans-69" x="402.396484" />
                                          <use xlink:href="#DejaVuSans-74" x="430.179688" />
                                          <use xlink:href="#DejaVuSans-79" x="469.388672" />
                                          <use xlink:href="#DejaVuSans-20" x="528.568359" />
                                          <use xlink:href="#DejaVuSans-44" x="560.355469" />
                                          <use xlink:href="#DejaVuSans-65" x="637.357422" />
                                          <use xlink:href="#DejaVuSans-6e" x="698.880859" />
                                          <use xlink:href="#DejaVuSans-73" x="762.259766" />
                                          <use xlink:href="#DejaVuSans-69" x="814.359375" />
                                          <use xlink:href="#DejaVuSans-74" x="842.142578" />
                                          <use xlink:href="#DejaVuSans-79" x="881.351562" />
                                   </g>
                            </g>
                     </g>
                     <g id="line2d_18">
                            <path d="M 73.832727 295.488 
L 142.728387 295.377092 
L 146.95312 295.139442 
L 149.877936 294.762772 
L 152.152793 294.248263 
L 154.10267 293.5702 
L 155.727568 292.773979 
L 157.352465 291.703354 
L 158.652383 290.601728 
L 159.952301 289.237892 
L 161.252219 287.56699 
L 162.552138 285.54118 
L 163.852056 283.110637 
L 165.151974 280.224869 
L 166.451892 276.83432 
L 167.75181 272.892244 
L 169.376708 267.125932 
L 171.001605 260.367386 
L 172.626503 252.575058 
L 174.2514 243.737663 
L 176.201278 231.789949 
L 178.151155 218.489779 
L 180.750991 199.00604 
L 184.325766 170.154997 
L 189.200459 130.807408 
L 191.800295 111.686975 
L 193.750172 98.817307 
L 195.700049 87.467321 
L 197.324947 79.277054 
L 198.949844 72.284339 
L 200.249762 67.55521 
L 201.549681 63.580452 
L 202.849599 60.334066 
L 204.149517 57.780435 
L 205.124455 56.294176 
L 206.099394 55.153354 
L 207.074333 54.336679 
L 208.049271 53.822204 
L 209.02421 53.587746 
L 209.999148 53.611271 
L 210.974087 53.87122 
L 211.949025 54.346783 
L 213.248943 55.282134 
L 214.548862 56.521811 
L 216.173759 58.439096 
L 217.798657 60.701505 
L 219.748534 63.79071 
L 222.023391 67.808801 
L 224.948206 73.479404 
L 228.198002 80.278512 
L 232.097756 88.945019 
L 236.972449 100.336989 
L 243.14706 115.355668 
L 267.520524 175.287707 
L 273.045176 187.946659 
L 277.919869 198.588782 
L 282.469582 208.015074 
L 286.694316 216.293959 
L 290.91905 224.092179 
L 294.818804 230.850543 
L 298.718559 237.179866 
L 302.618313 243.078812 
L 306.518067 248.550589 
L 310.092842 253.197257 
L 313.667617 257.499239 
L 317.242391 261.466884 
L 320.817166 265.112347 
L 324.391941 268.449268 
L 327.966716 271.492454 
L 331.541491 274.25758 
L 335.116265 276.760916 
L 339.01602 279.212778 
L 342.915774 281.394557 
L 346.815528 283.327801 
L 351.040262 285.16617 
L 355.264996 286.763628 
L 359.814709 288.243 
L 364.689402 289.583103 
L 369.889075 290.769906 
L 375.413726 291.796704 
L 381.588337 292.706169 
L 388.412907 293.474359 
L 396.212416 294.114879 
L 398.487273 294.263293 
L 398.487273 294.263293 
" clip-path="url(#pf2ba56ef01)" style="fill: none; stroke: #1f77b4; stroke-width: 1.5; stroke-linecap: square" />
                     </g>
                     <g id="patch_3">
                            <path d="M 57.6 307.584 
L 57.6 41.472 
" style="fill: none; stroke: #000000; stroke-width: 0.8; stroke-linejoin: miter; stroke-linecap: square" />
                     </g>
                     <g id="patch_4">
                            <path d="M 414.72 307.584 
L 414.72 41.472 
" style="fill: none; stroke: #000000; stroke-width: 0.8; stroke-linejoin: miter; stroke-linecap: square" />
                     </g>
                     <g id="patch_5">
                            <path d="M 57.6 307.584 
L 414.72 307.584 
" style="fill: none; stroke: #000000; stroke-width: 0.8; stroke-linejoin: miter; stroke-linecap: square" />
                     </g>
                     <g id="patch_6">
                            <path d="M 57.6 41.472 
L 414.72 41.472 
" style="fill: none; stroke: #000000; stroke-width: 0.8; stroke-linejoin: miter; stroke-linecap: square" />
                     </g>
              </g>
       </g>
       <defs>
              <clipPath id="pf2ba56ef01">
                     <rect x="57.6" y="41.472" width="357.12" height="266.112" />
              </clipPath>
       </defs>
</svg>