{
	"JSON": {
		"ID": "1ee8239a-489e-66bc-932e-2587341b8ad5",
		"label": "",
		"comment": "UUID6 is used"
	},
	"actor": {
		"name": "brushless_DC_motor",
		"type": "57BLF03",
		"manufacturer": "ACT-Motor",
		"max rpms": "3000",
		"power_supply": {
			"voltage": "24",
			"type": "DC voltage"
		}
	}
}