{
	"JSON": {
		"ID": "1ee57b26-cc42-6a6e-b609-c4f6b4a81128",
		"label": "PDC001",
		"comment": "UUID6 is used"
	},
	"probe": {
		"material": "Edelstahl",
		"mass": {
			"value": 630,
			"unit": "gramm",
			"uncertainty": {
				"value": 1,
				"type": "absolut",
				"unit": "gramm"
			}
		},
		"dimensions": {
			"height": {
				"value": 40,
				"unit": "millimeter"
			},
			"diameter": {
				"value": 60,
				"unit": "millimeter"
			},
			"volume": {
				"value": 80570,
				"unit": "cubic millimeter"
			}
		}
	}
}