-----
CHR01 Rubi (23/Female)
Actions;Times of execution in the simulation period;Sunday;Monday;Tuesday;Wednesday;Thursday;Friday;Saturday;Basic Tagging;Tagging Set For Planning;Wo bleibt die Zeit;
clean the bath;91;7;12;11;15;12;13;21;cleaning;clean the bath;Unpaid Work;
do laundry at 30°C (by variable);112;16;15;12;19;16;16;18;cleaning;do laundry at 30°C (by variable);Unpaid Work;
do laundry at 60°C (by variable);28;4;2;4;4;4;6;4;cleaning;do laundry at 60°C (by variable);Unpaid Work;
iron Clothes;11;0;2;1;1;4;3;0;cleaning;iron Clothes;Unpaid Work;
iron and watch TV with Sat Reciever (1 h);59;9;4;4;8;8;12;14;cleaning;iron and watch TV with Sat Reciever (1 h);Unpaid Work;
run the dishwasher (triggered);212;42;24;21;28;33;28;36;cleaning;run the dishwasher (triggered);Unpaid Work;
run the dryer with wet laundry (by variable);140;17;15;12;18;25;26;27;cleaning;run the dryer with wet laundry (by variable);Unpaid Work;
bake a cake;83;17;8;7;11;16;12;12;cooking;bake a cake;Food;
bake bread;86;14;11;9;10;16;13;13;cooking;bake bread;Food;
cook for Christmas with Baking (5 h);2;0;0;0;0;0;1;1;cooking;cook for Christmas with Baking (5 h);Food;
cook pasta and eat it;47;2;16;14;1;4;6;4;cooking;cook pasta and eat it;Food;
cook weekend lunch for the family;86;40;0;0;0;0;0;46;cooking;cook weekend lunch for the family;Food;
eat breakfast (1 h);264;48;32;33;32;34;37;48;cooking;eat breakfast (1 h);Food;
eat icecream from from freezer;15;1;5;2;0;2;2;3;cooking;eat icecream from from freezer;Food;
fry two eggs and eat them with toast;66;12;5;9;11;10;10;9;cooking;fry two eggs and eat them with toast;Food;
heat up leftovers;68;6;11;3;15;10;12;11;cooking;heat up leftovers;Food;
make and drink tea (15 min);36;2;8;7;4;9;3;3;cooking;make and drink tea (15 min);Food;
make frozen pizza and eat it;71;12;6;9;12;10;12;10;cooking;make frozen pizza and eat it;Food;
make smoothie;87;14;6;8;16;17;11;15;cooking;make smoothie;Food;
make soup;133;20;17;17;17;21;18;23;cooking;make soup;Food;
get ready in the morning (women);303;48;41;39;42;41;44;48;hygiene;get ready in the morning (women);Hygiene;
go to the toilet;1216;187;166;151;155;174;173;210;hygiene;go to the toilet;Hygiene;
run humidifier (3 h);197;34;24;22;22;29;25;41;hygiene;run humidifier (3 h);Unpaid Work;
take a shower with hair washing (women) (20 min hair drying);88;18;11;13;9;14;9;14;hygiene;take a shower with hair washing (women) (20 min hair drying);Hygiene;
take a shower with hair washing (women) (5 min hair drying);83;7;13;13;15;10;16;9;hygiene;take a shower with hair washing (women) (5 min hair drying);Hygiene;
take a shower without hair washing (women);161;23;23;22;22;23;23;25;hygiene;take a shower without hair washing (women);Hygiene;
Replacement Activity A;3662;520;415;373;447;518;624;765;recreation;Replacement Activity A;Media Use;
Replacement Activity B;3600;508;411;366;415;513;613;774;recreation;Replacement Activity B;Media Use;
Replacement Activity C;3551;518;421;351;428;492;600;741;recreation;Replacement Activity C;Media Use;
Replacement Activity D;3586;516;413;356;405;549;607;740;recreation;Replacement Activity D;Media Use;
do garden work every day;37;0;7;3;4;11;4;8;recreation;do garden work every day;Hobby;
exercise on cross trainer (30 min);309;55;41;40;34;43;39;57;recreation;exercise on cross trainer (30 min);Sport;
go to a dancing class;24;24;0;0;0;0;0;0;recreation;go to a dancing class;Events;
invite friends for coffee;45;0;12;8;7;9;9;0;recreation;invite friends for coffee;Contacts;
play board games (1 h);74;10;11;12;9;11;13;8;recreation;play board games (1 h);Games;
read a book on the couch only 9:00 to 22:00;4;1;0;0;1;1;0;1;recreation;read a book on the couch only 9:00 to 22:00;Hobby;
read a magazine;10;1;2;2;1;2;1;1;recreation;read a magazine;Media Use;
read a newspaper for 30min;15;2;3;3;1;3;2;1;recreation;read a newspaper for 30min;Media Use;
watch TV (1 h);215;32;28;26;16;44;25;44;recreation;watch TV (1 h);Media Use;
watch a movie for 1 h 30 min;186;27;23;19;26;19;36;36;recreation;watch a movie for 1 h 30 min;Media Use;
watch a movie for 2 h;183;38;26;23;16;19;26;35;recreation;watch a movie for 2 h;Media Use;
watch sports on TV with SAT Reciever (2 h);186;39;28;24;28;23;18;26;recreation;watch sports on TV with SAT Reciever (2 h);Media Use;
watch the news;180;36;26;17;21;20;27;33;recreation;watch the news;Media Use;
go shopping for food in the supermarket (1_5 h);80;0;10;9;18;9;9;25;shopping;go shopping for food in the supermarket (1_5 h);Unpaid Work;
read a book on the couch all the time;4;0;1;2;0;0;1;0;shopping;read a book on the couch all the time;Entertainment;
sleep bed 02 (08 h);335;48;46;48;47;48;50;48;sleeping;sleep bed 02 (08 h);Sleep;
take a nap;11;1;3;2;1;2;1;1;sleeping;take a nap;Sleep;
take nap on the weekend (2 h);2;1;0;0;0;0;0;1;sleeping;take nap on the weekend (2 h);Sleep;
taking a vacation;2;0;1;0;1;0;0;0;vacation;vacation;vacation;
go to museum (3 h);15;11;0;0;1;2;0;1;work;go to museum (3 h);Events;
work as teacher;129;0;24;30;29;21;25;0;work;work as teacher;Work / School;
-----
CHR01 Sami (25/Male)
Actions;Times of execution in the simulation period;Sunday;Monday;Tuesday;Wednesday;Thursday;Friday;Saturday;Basic Tagging;Tagging Set For Planning;Wo bleibt die Zeit;
clean the windows;16;3;1;1;2;3;3;3;cleaning;clean the windows;Unpaid Work;
dust the house;47;6;3;2;7;5;12;12;cleaning;dust the house;Unpaid Work;
run vacuum cleaner robot;61;5;8;6;11;12;8;11;cleaning;run vacuum cleaner robot;Unpaid Work;
shovel snow;36;8;5;5;4;6;3;5;cleaning;shovel snow;Unpaid Work;
cook coffee;262;46;33;32;36;36;32;47;cooking;cook coffee;Food;
eat breakfast (1 h);283;48;38;38;39;31;41;48;cooking;eat breakfast (1 h);Food;
make and drink tea (15 min);20;3;3;0;3;7;0;4;cooking;make and drink tea (15 min);Food;
make smoothie;354;45;48;56;49;51;56;49;cooking;make smoothie;Food;
clean eye glasses;197;25;31;23;31;24;29;34;hygiene;clean eye glasses;Hygiene;
get ready in the morning (men);300;46;41;41;44;40;41;47;hygiene;get ready in the morning (men);Hygiene;
go to the toilet;1207;179;164;168;174;160;161;201;hygiene;go to the toilet;Hygiene;
take a shower (men);451;64;65;61;64;60;65;72;hygiene;take a shower (men);Hygiene;
Replacement Activity A;854;122;83;83;158;189;94;125;recreation;Replacement Activity A;Media Use;
Replacement Activity B;843;117;76;82;148;194;99;127;recreation;Replacement Activity B;Media Use;
Replacement Activity C;834;114;93;69;146;176;96;140;recreation;Replacement Activity C;Media Use;
Replacement Activity D;860;129;82;66;154;204;97;128;recreation;Replacement Activity D;Media Use;
do garden work every day;38;0;6;10;4;4;6;8;recreation;do garden work every day;Hobby;
exercise for 30 min on the treadmill;266;40;40;41;35;31;36;43;recreation;exercise for 30 min on the treadmill;Sport;
go to a dancing class;25;25;0;0;0;0;0;0;recreation;go to a dancing class;Events;
play Playstation;293;47;39;39;38;43;40;47;recreation;play Playstation;Games;
play board games (1 h);75;9;7;13;14;4;11;17;recreation;play board games (1 h);Games;
read a book on the couch only 9:00 to 22:00;183;30;21;24;20;31;22;35;recreation;read a book on the couch only 9:00 to 22:00;Hobby;
read a magazine;5;1;1;0;0;2;0;1;recreation;read a magazine;Media Use;
read a newspaper for 30min;6;1;2;0;1;1;0;1;recreation;read a newspaper for 30min;Media Use;
run air conditioner for 3 h;2;0;1;0;0;0;1;0;recreation;run air conditioner for 3 h;Unpaid Work;
use the laptop (1 h);494;78;64;63;69;68;63;89;recreation;use the laptop (1 h);Media Use;
use the laptop (1_5 h);473;74;60;68;62;57;71;81;recreation;use the laptop (1_5 h);Media Use;
use the laptop for Internet, Movie, Music, News (2 h);466;76;62;69;70;51;65;73;recreation;use the laptop for Internet, Movie, Music, News (2 h);Media Use;
watch TV (1 h);1;0;0;0;0;1;0;0;recreation;watch TV (1 h);Media Use;
watch a movie for 1 h 30 min;2;0;1;0;0;0;0;1;recreation;watch a movie for 1 h 30 min;Media Use;
watch a movie for 2 h;2;0;1;0;1;0;0;0;recreation;watch a movie for 2 h;Media Use;
watch sports on TV with SAT Reciever (2 h);1;0;0;0;0;1;0;0;recreation;watch sports on TV with SAT Reciever (2 h);Media Use;
watch the news;1;1;0;0;0;0;0;0;recreation;watch the news;Media Use;
go shopping for food on the market (2 h);73;0;11;11;12;10;11;18;shopping;go shopping for food on the market (2 h);Unpaid Work;
read a book on the couch all the time;96;12;13;12;19;9;13;18;shopping;read a book on the couch all the time;Entertainment;
sleep bed 01 (08 h);335;49;47;48;49;46;50;46;sleeping;sleep bed 01 (08 h);Sleep;
take a nap;6;1;1;0;1;2;0;1;sleeping;take a nap;Sleep;
take nap on the weekend (2 h);2;1;0;0;0;0;0;1;sleeping;take nap on the weekend (2 h);Sleep;
taking a vacation;2;0;1;0;1;0;0;0;vacation;vacation;vacation;
go to museum (3 h);12;8;0;0;0;0;2;2;work;go to museum (3 h);Events;
work at the office (09 h);90;0;20;15;15;22;18;0;work;work at the office (09 h);Work / School;
