-----
Destatis Water Usage Statistics
Tag;Energy Used [kWh];Percentage;Reference Value;
NoWater;0,054035994890304424;0,9054;;
Dishwashing;0,0037544101946794185;0,0629;;
Laundry;0,0018919910469495428;0,0317;;

Sum;0,05968239613193338;1;
-----
Energieagentur.NRW Tags
Tag;Energy Used [kWh];Percentage;Reference Value;
Light;0,001335120751538588;0,0224;;
Office;0,0033108349868390414;0,0555;;
Cooling;0,002852157525568049;0,0478;;
TV/Audio;0,012265916460617471;0,2055;;
Cooking;0,013643386634004632;0,2286;;
Freezing;0,002747191569737559;0,0460;;
Other;0,011995231338975733;0,2010;;
Washing;0,003569126509702884;0,0598;;
Dish washing;0,0037544101946794185;0,0629;;
Drying;0,004209020160270027;0,0705;;

Sum;0,05968239613193338;1;
