-----
Destatis Water Usage Statistics
Tag;Energy Used [L];Percentage;Reference Value;
Toilet;35720;0,6882;;
NoWater;5371,91549843697;0,1035;;
Dishwashing;3498;0,0674;;
Laundry;7310;0,1408;;

Sum;51899,91549843697;1;
-----
Energieagentur.NRW Tags
Tag;Energy Used [L];Percentage;Reference Value;
Washing;43030;0,8291;;
Cooking;5371,91549843697;0,1035;;
Dish washing;3498;0,0674;;

Sum;51899,91549843697;1;
