-----
Destatis Water Usage Statistics
Tag;Energy Used [kWh];Percentage;Reference Value;
NoWater;0,04785129375803297;0,9014;;
Dishwashing;0,003436237303578937;0,0647;;
Laundry;0,0017973914946020656;0,0339;;

Sum;0,05308492255621398;1;
-----
Energieagentur.NRW Tags
Tag;Energy Used [kWh];Percentage;Reference Value;
Light;0,0012683647139616983;0,0239;301,3;
Office;0,002010626998487859;0,0379;414,8;
Cooling;0,0015949248219818744;0,0300;333,1;
TV/Audio;0,010891073449565475;0,2052;399,7;
Cooking;0,013267355140403763;0,2499;329,1;
Freezing;0,002609831991250686;0,0492;157,3;
Other;0,011395469772026934;0,2147;212,7;
Washing;0,002612469212700232;0,0492;136,8;
Dish washing;0,003436237303578937;0,0647;145,9;
Drying;0,003998569152256528;0,0753;155;

Sum;0,05308492255621398;1;
