Survived,Pclass,Name,Sex,Age,Siblings/Spouses Aboard,Parents/Children Aboard,Fare
0,3,Mr. Owen Harris Braund,male,22.0,1,0,7.25
1,3,Miss. Laina Heikkinen,female,26.0,0,0,7.925
0,3,Mr. William Henry Allen,male,35.0,0,0,8.05
0,3,Mr. James Moran,male,27.0,0,0,8.4583
0,3,Master. Gosta Leonard Palsson,male,2.0,3,1,21.075
1,3,Mrs. Oscar W (Elisabeth Vilhelmina Berg) Johnson,female,27.0,0,2,11.1333
1,3,Miss. Marguerite Rut Sandstrom,female,4.0,1,1,16.7
0,3,Mr. William Henry Saundercock,male,20.0,0,0,8.05
0,3,Mr. Anders Johan Andersson,male,39.0,1,5,31.275
0,3,Miss. Hulda Amanda Adolfina Vestrom,female,14.0,0,0,7.8542
0,3,Master. Eugene Rice,male,2.0,4,1,29.125
0,3,Mrs. Julius (Emelia Maria Vandemoortele) Vander Planke,female,31.0,1,0,18.0
1,3,Mrs. Fatima Masselmani,female,22.0,0,0,7.225
1,3,Miss. Anna McGowan,female,15.0,0,0,8.0292
0,3,Miss. Torborg Danira Palsson,female,8.0,3,1,21.075
1,3,Mrs. Carl Oscar (Selma Augusta Emilia Johansson) Asplund,female,38.0,1,5,31.3875
0,3,Mr. Farred Chehab Emir,male,26.0,0,0,7.225
1,3,Miss. Ellen O'Dwyer,female,24.0,0,0,7.8792
0,3,Mr. Lalio Todoroff,male,23.0,0,0,7.8958
1,3,Miss. Mary Agatha Glynn,female,18.0,0,0,7.75
1,3,Mr. Hanna Mamee,male,18.0,0,0,7.2292
0,3,Mr. Ernest Charles Cann,male,21.0,0,0,8.05
0,3,Miss. Augusta Maria Vander Planke,female,18.0,2,0,18.0
1,3,Miss. Jamila Nicola-Yarred,female,14.0,1,0,11.2417
0,3,Mrs. Johan (Johanna Persdotter Larsson) Ahlin,female,40.0,1,0,9.475
1,3,Miss. Margaret Delia Devaney,female,19.0,0,0,7.8792
0,3,Mr. William John Rogers,male,30.0,0,0,8.05
0,3,Mr. Denis Lennon,male,20.0,1,0,15.5
1,3,Miss. Bridget O'Driscoll,female,27.0,0,0,7.75
0,3,Mr. Youssef Samaan,male,16.0,2,0,21.6792
0,3,Mrs. Josef (Josefine Franchi) Arnold-Franchi,female,18.0,1,0,17.8
0,3,Master. Juha Niilo Panula,male,7.0,4,1,39.6875
0,3,Mr. Richard Cater Nosworthy,male,21.0,0,0,7.8
0,3,Mr. Mansouer Novel,male,28.5,0,0,7.2292
0,3,Master. William Frederick Goodwin,male,11.0,5,2,46.9
0,3,Mr. Orsen Sirayanian,male,22.0,0,0,7.2292
0,3,Master. Harald Skoog,male,4.0,3,2,27.9
1,3,Master. Gerios Moubarek,male,7.0,1,1,15.2458
0,3,Mr. Ernest James Crease,male,19.0,0,0,8.1583
1,3,Miss. Erna Alexandra Andersson,female,17.0,4,2,7.925
0,3,Mr. Vincenz Kink,male,26.0,2,0,8.6625
0,3,Miss. Lillian Amy Goodwin,female,16.0,5,2,46.9
0,3,Mr. Apostolos Chronopoulos,male,26.0,1,0,14.4542
1,3,Mr. Lee Bing,male,32.0,0,0,56.4958
0,3,Mr. Sigurd Hansen Moen,male,25.0,0,0,7.65
0,3,Mr. Ivan Staneff,male,23.0,0,0,7.8958
0,3,Mr. Rahamin Haim Moutal,male,28.0,0,0,8.05
1,3,Miss. Elizabeth Dowdell,female,30.0,0,0,12.475
0,3,Mr. Achille Waelens,male,22.0,0,0,9.0
1,3,Mr. Jan Baptist Sheerlinck,male,29.0,0,0,9.5
1,3,Miss. Brigdet Delia McDermott,female,31.0,0,0,7.7875
1,3,Mrs. Karl Alfred (Maria Mathilda Gustafsson) Backstrom,female,33.0,3,0,15.85
0,3,Mr. William Neal Ford,male,16.0,1,3,34.375
0,3,Mr. Selman Francis Slocovski,male,20.0,0,0,8.05
0,3,Mr. Francesco Celotti,male,24.0,0,0,8.05
0,3,Mr. Emil Christmann,male,29.0,0,0,8.05
0,3,Mr. Paul Edvin Andreasson,male,20.0,0,0,7.8542
0,3,Mr. Bertram Frank Dean,male,26.0,1,2,20.575
0,3,Mr. Daniel Coxon,male,59.0,0,0,7.25
0,3,Mr. Charles Joseph Shorney,male,22.0,0,0,8.05
0,3,Miss. Matilda Petranec,female,28.0,0,0,7.8958
0,3,Mr. Pastcho Petroff,male,29.0,0,0,7.8958
0,3,Mr. Gustaf Joel Johansson,male,33.0,0,0,8.6542
0,3,Mr. Anders Vilhelm Gustafsson,male,37.0,2,0,7.925
0,3,Mr. Stoytcho Mionoff,male,28.0,0,0,7.8958
1,3,Miss. Anna Kristine Salkjelsvik,female,21.0,0,0,7.65
1,3,Mr. Albert Johan Moss,male,29.0,0,0,7.775
0,3,Mr. Tido Rekic,male,38.0,0,0,7.8958
1,3,Miss. Bertha Moran,female,28.0,1,0,24.15
0,3,Miss. Hileni Zabour,female,14.5,1,0,14.4542
0,3,Mr. David John Barton,male,22.0,0,0,8.05
0,3,Miss. Katriina Jussila,female,20.0,1,0,9.825
0,3,Miss. Malake Attalah,female,17.0,0,0,14.4583
0,3,Mr. Edvard Pekoniemi,male,21.0,0,0,7.925
0,3,Mr. Patrick Connors,male,70.5,0,0,7.75
0,3,Miss. Ellis Anna Maria Andersson,female,2.0,4,2,31.275
0,3,Mr. Leonard Charles Moore,male,19.0,0,0,8.05
1,3,Master. Elias Nicola-Yarred,male,12.0,1,0,11.2417
0,3,Mr. Martin McMahon,male,19.0,0,0,7.75
1,3,Mr. Fridtjof Arne Madsen,male,24.0,0,0,7.1417
1,3,Miss. Anna Peter,female,2.0,1,1,22.3583
0,3,Mr. Johan Ekstrom,male,45.0,0,0,6.975
0,3,Mr. Jozef Drazenoic,male,33.0,0,0,7.8958
0,3,Mr. Domingos Fernandeo Coelho,male,20.0,0,0,7.05
0,3,Mrs. Alexander A (Grace Charity Laury) Robins,female,47.0,1,0,14.5
0,3,Mr. Olaf Elon Osen,male,16.0,0,0,9.2167
0,3,Mrs. Joseph (Sultana) Boulos,female,40.0,0,2,15.2458
1,3,Miss. Anna Sofia Nysten,female,22.0,0,0,7.75
1,3,Mrs. Pekka Pietari (Elin Matilda Dolck) Hakkarainen,female,24.0,1,0,15.85
0,3,Mr. Jeremiah Burke,male,19.0,0,0,6.75
1,3,Mr. August Edvard Andersson,male,27.0,0,0,7.7958
0,3,Miss. Robina Maggie Ford,female,9.0,2,2,34.375
0,3,Mr. Alfonzo Meo,male,55.5,0,0,8.05
0,3,Mr. Austin Blyler van Billiard,male,40.5,0,2,14.5
0,3,Mr. Ole Martin Olsen,male,27.0,0,0,7.3125
1,3,Miss. Katherine Gilnagh,female,16.0,0,0,7.7333
0,3,Mr. Harry Corn,male,30.0,0,0,8.05
0,3,Mr. Mile Smiljanic,male,37.0,0,0,8.6625
0,3,Master. Thomas Henry Sage,male,5.0,8,2,69.55
0,3,Mr. John Hatfield Cribb,male,44.0,0,1,16.1
0,3,Mr. John Viktor Bengtsson,male,26.0,0,0,7.775
0,3,Mr. Jovo Calic,male,17.0,0,0,8.6625
0,3,Master. Eino Viljami Panula,male,1.0,4,1,39.6875
1,3,Master. Frank John William Goldsmith,male,9.0,0,2,20.525
0,3,Mrs. William (Anna Bernhardina Karlsson) Skoog,female,45.0,1,4,27.9
0,3,Mr. Lee Ling,male,28.0,0,0,56.4958
0,3,Master. Arthur Rice,male,4.0,4,1,29.125
1,3,Miss. Eleanor Ileen Johnson,female,1.0,1,1,11.1333
0,3,Mr. Antti Wilhelm Sivola,male,21.0,0,0,7.925
0,3,Mr. Klas Albin Klasen,male,18.0,1,1,7.8542
0,3,Master. Henry Forbes Lefebre,male,5.0,3,1,25.4667
0,3,Mr. Lionel Leonard,male,36.0,0,0,0.0
0,3,Miss. Constance Gladys Sage,female,8.0,8,2,69.55
0,3,Master. Clarence Gustaf Hugo Asplund,male,9.0,4,2,31.3875
1,3,Miss. Luise Gretchen Kink-Heilmann,female,4.0,0,2,22.025
1,3,Mrs. Thomas (Johanna Godfrey) O'Brien,female,26.0,1,0,15.5
0,3,Mr. John Bourke,male,40.0,1,1,15.5
0,3,Mr. Stjepan Turcin,male,36.0,0,0,7.8958
1,3,Miss. Carla Christine Nielsine Andersen-Jensen,female,19.0,1,0,7.8542
0,3,Mr. Robert Mernagh,male,28.0,0,0,7.75
0,3,Mr. Karl Siegwart Andreas Olsen,male,42.0,0,1,8.4042
1,3,Miss. Margaret Madigan,female,21.0,0,0,7.75
0,3,Mr. Nestor Cyriel Vande Walle,male,28.0,0,0,9.5
0,3,Mr. Frederick Sage,male,17.0,8,2,69.55
0,3,Mr. Jakob Alfred Johanson,male,34.0,0,0,6.4958
0,3,Mr. Gerious Youseff,male,45.5,0,0,7.225
1,3,Mr. Gurshon Cohen,male,18.0,0,0,8.05
0,3,Miss. Telma Matilda Strom,female,2.0,0,1,10.4625
0,3,Mr. Karl Alfred Backstrom,male,32.0,1,0,15.85
1,3,Mr. Nassef Cassem Albimona,male,26.0,0,0,18.7875
1,3,Miss. Helen Carr,female,16.0,0,0,7.75
0,3,Mr. Ahmed Ali,male,24.0,0,0,7.05
0,3,Mr. John Henry Perkin,male,22.0,0,0,7.25
0,3,Mr. Philip Kiernan,male,22.0,1,0,7.75
1,3,Miss. Eliina Honkanen,female,27.0,0,0,7.925
1,3,Mr. Victor Francis Sunderland,male,16.0,0,0,8.05
0,3,Mr. George Henry Green,male,51.0,0,0,8.05
0,3,Mr. Christo Nenkoff,male,22.0,0,0,7.8958
0,3,Mr. Karl Ivar Sven Berglund,male,22.0,0,0,9.35
0,3,Mr. John Hall Lovell,male,20.5,0,0,7.25
0,3,Miss. Mathilde Lefebre,female,12.0,3,1,25.4667
0,3,Mr. Bengt Edvin Larsson,male,29.0,0,0,7.775
1,3,Miss. Lillian Gertrud Asplund,female,5.0,4,2,31.3875
0,3,Miss. Alice Phoebe Harknett,female,21.0,0,0,7.55
0,3,Miss. Thamine Zabour,female,19.0,1,0,14.4542
1,3,Miss. Katherine Murphy,female,18.0,1,0,15.5
0,3,Mr. Matti Alexanteri Maenpaa,male,22.0,0,0,7.125
0,3,Mr. Sleiman Attalah,male,30.0,0,0,7.225
0,3,Miss. Agda Thorilda Viktoria Lindahl,female,25.0,0,0,7.775
0,3,Mr. James George Reed,male,18.0,0,0,7.25
0,3,Mrs. Wilhelm (Elna Matilda Persson) Strom,female,29.0,1,1,10.4625
0,3,Mr. William Arthur Lobb,male,30.0,1,0,16.1
0,3,Mrs. Viktor (Helena Wilhelmina) Rosblom,female,41.0,0,2,20.2125
1,3,Mrs. Darwis (Hanne Youssef Razi) Touma,female,29.0,0,2,15.2458
1,3,Master. Edvin Rojj Felix Asplund,male,3.0,4,2,31.3875
0,3,Miss. Delia Henry,female,21.0,0,0,7.75
0,3,Mr. Ernesti Arvid Panula,male,16.0,4,1,39.6875
1,3,Mr. Ernst Ulrik Persson,male,25.0,1,0,7.775
1,3,Mr. William Henry Tornquist,male,25.0,0,0,0.0
1,3,Miss. Hanora Healy,female,33.0,0,0,7.75
0,3,Miss. Augusta Charlotta Lindblom,female,45.0,0,0,7.75
0,3,Master. Eric Rice,male,7.0,4,1,29.125
1,3,Mrs. Stanton (Rosa Hunt) Abbott,female,35.0,1,1,20.25
0,3,Mr. Frank Duane,male,65.0,0,0,7.75
0,3,Mr. Nils Johan Goransson Olsson,male,28.0,0,0,7.8542
0,3,Mr. Alfons de Pelsmaeker,male,16.0,0,0,9.5
1,3,Mr. Edward Arthur Dorking,male,19.0,0,0,8.05
0,3,Mr. Ivan Stankovic,male,33.0,0,0,8.6625
1,3,Mr. Theodore de Mulder,male,30.0,0,0,9.5
0,3,Mr. Penko Naidenoff,male,22.0,0,0,7.8958
1,3,Miss. Kate Connolly,female,22.0,0,0,7.75
0,3,Miss. Aloisia Haas,female,24.0,0,0,8.85
0,3,Mr. Ivan Mineff,male,24.0,0,0,7.8958
0,3,Mr. Mansour Hanna,male,23.5,0,0,7.2292
1,3,Miss. Anna Katherine Kelly,female,20.0,0,0,7.75
1,3,Mr. Bernard McCoy,male,24.0,2,0,23.25
0,3,Mr. William Cahoone Jr Johnson,male,19.0,0,0,0.0
0,3,Mr. Howard Hugh Williams,male,28.0,0,0,8.05
0,3,Mr. Ignjac Hendekovic,male,28.0,0,0,7.8958
1,3,Miss. Helmina Josefina Nilsson,female,26.0,0,0,7.8542
0,3,Mr. Samuel Dennis,male,22.0,0,0,7.25
0,3,Mr. Yoto Danoff,male,27.0,0,0,7.8958
0,3,Mr. George John Jr Sage,male,20.0,8,2,69.55
0,3,Mr. Johan Hansen Nysveen,male,61.0,0,0,6.2375
1,3,Mrs. Frank John (Emily Alice Brown) Goldsmith,female,31.0,1,1,20.525
1,3,Miss. Agnes McCoy,female,28.0,2,0,23.25
0,3,Mr. Leo Edmondus Vander Planke,male,16.0,2,0,18.0
0,3,Mr. Mitto Denkoff,male,30.0,0,0,7.8958
1,3,Mr. Karl Edwart Dahl,male,45.0,0,0,8.05
1,3,Mrs. Thomas Henry (Mary E Finck) Davison,female,34.0,1,0,16.1
1,3,Master. William Loch Coutts,male,3.0,1,1,15.9
0,3,Mr. Jovan Dimic,male,42.0,0,0,8.6625
0,3,Mr. Nils Martin Odahl,male,23.0,0,0,9.225
0,3,Mr. Tannous Elias,male,15.0,1,1,7.2292
0,3,Mr. Josef Arnold-Franchi,male,25.0,1,0,17.8
0,3,Mr. Wazli Yousif,male,23.0,0,0,7.225
0,3,Mr. Leo Peter Vanden Steen,male,28.0,0,0,9.5
1,3,Miss. Mary McGovern,female,22.0,0,0,7.8792
1,3,Miss. Helen Mary Mockler,female,23.0,0,0,7.8792
0,3,Mr. Wilhelm Skoog,male,40.0,1,4,27.9
0,3,Mrs. (Catherine David) Barbara,female,45.0,0,1,14.4542
0,3,Mr. Adola Asim,male,35.0,0,0,7.05
0,3,Mr. Thomas O'Brien,male,27.0,1,0,15.5
0,3,Mr. Mauritz Nils Martin Adahl,male,30.0,0,0,7.25
1,3,Mrs. (Mantoura Boulos) Moussa,female,35.0,0,0,7.2292
1,3,Miss. Annie Jermyn,female,22.0,0,0,7.75
0,3,Mr. Jakob Alfred Wiklund,male,18.0,1,0,6.4958
0,3,Mr. William Thomas Beavan,male,19.0,0,0,8.05
0,3,Miss. Stina Viola Palsson,female,3.0,3,1,21.075
1,3,Miss. Aurora Adelia Landergren,female,22.0,0,0,7.25
0,3,Mr. Tannous Betros,male,20.0,0,0,4.0125
0,3,Mr. Karl Gideon Gustafsson,male,19.0,0,0,7.775
1,3,Miss. Maria Nakid,female,1.0,0,2,15.7417
0,3,Mr. Juho Tikkanen,male,32.0,0,0,7.925
0,3,Mr. Vasil Plotcharsky,male,27.0,0,0,7.8958
0,3,Master. Sidney Leonard Goodwin,male,1.0,5,2,46.9
0,3,Mr. Matthew Sadlier,male,19.0,0,0,7.7292
1,3,Mr. Carl Olof Jansson,male,21.0,0,0,7.7958
0,3,Mr. Johan Birger Gustafsson,male,28.0,2,0,7.925
1,3,Mrs. Hjalmar (Agnes Charlotta Bengtsson) Sandstrom,female,24.0,0,2,16.7
0,3,Mr. Erik Johansson,male,22.0,0,0,7.7958
0,3,Miss. Elina Olsson,female,31.0,0,0,7.8542
1,3,Mr. Juha Niskanen,male,39.0,0,0,7.925
0,3,Mr. John Adams,male,26.0,0,0,8.05
0,3,Miss. Mari Aina Jussila,female,21.0,1,0,9.825
0,3,Mr. Pekka Pietari Hakkarainen,male,28.0,1,0,15.85
0,3,Miss. Marija Oreskovic,female,20.0,0,0,8.6625
0,3,Mr. Carl/Charles Peter Widegren,male,51.0,0,0,7.75
0,3,Mr. Hans Martin Monsen Birkeland,male,21.0,0,0,7.775
0,3,Miss. Ida Lefebre,female,3.0,3,1,25.4667
0,3,Mr. Todor Sdycoff,male,42.0,0,0,7.8958
0,3,Mr. Henry Hart,male,27.0,0,0,6.8583
1,3,Mr. Johan Julian Sundman,male,44.0,0,0,7.925
0,3,Mrs. Thomas (Annie Louise Rowley) Meek,female,32.0,0,0,8.05
0,3,Miss. Catharina Van Impe,female,10.0,0,2,24.15
0,3,Mr. David Charters,male,21.0,0,0,7.7333
0,3,Mr. Leo Zimmerman,male,29.0,0,0,7.875
0,3,Mrs. Ernst Gilbert (Anna Sigrid Maria Brogren) Danbom,female,28.0,1,1,14.4
0,3,Mr. Viktor Richard Rosblom,male,18.0,1,1,20.2125
0,3,Mr. Phillippe Wiseman,male,54.0,0,0,7.25
0,3,Mr. James Flynn,male,28.0,0,0,7.75
1,3,Mr. Berk (Berk Trembisky) Pickard,male,32.0,0,0,8.05
1,3,Mrs. Percival (Florence Kate White) Thorneycroft,female,33.0,1,0,16.1
0,3,Mr. Nikolai Erland Kallio,male,17.0,0,0,7.125
0,3,Miss. Doolina Margaret Ford,female,21.0,2,2,34.375
0,3,Mr. Leon Hampe,male,20.0,0,0,9.5
0,3,Mr. Johan Emil Petterson,male,25.0,1,0,7.775
1,3,Mr. Bernt Johannesen-Bratthammer,male,29.0,0,0,8.1125
1,3,Miss. Marie Catherine Baclini,female,5.0,2,1,19.2583
0,3,Mr. Ingvald Olai Olsen Hagland,male,28.0,1,0,19.9667
0,3,Mr. Joseph Peduzzi,male,24.0,0,0,8.05
1,3,Mr. Ivan Jalsevac,male,29.0,0,0,7.8958
0,3,Mr. Maurice O'Connor,male,17.0,0,0,7.75
0,3,Mr. William Morley,male,34.0,0,0,8.05
0,3,Mr. Simon Maisner,male,34.0,0,0,8.05
0,3,Mr. Manuel Estanslas Goncalves,male,38.0,0,0,7.05
0,3,Mr. James Scanlan,male,22.0,0,0,7.725
1,3,Miss. Helene Barbara Baclini,female,0.75,2,1,19.2583
0,3,Mr. Arthur Keefe,male,39.0,0,0,7.25
0,3,Mr. Luka Cacic,male,38.0,0,0,8.6625
0,3,Miss. Ida Sofia Strandberg,female,22.0,0,0,9.8375
0,3,Mr. Lewis Richard Braund,male,29.0,1,0,7.0458
0,3,Mr. Nils August Karlsson,male,22.0,0,0,7.5208
1,3,Miss. Hildur E Hirvonen,female,2.0,0,1,12.2875
0,3,Master. Harold Victor Goodwin,male,9.0,5,2,46.9
0,3,Mr. Richard Henry Rouse,male,50.0,0,0,8.05
1,3,Mrs. (Hedwig) Turkula,female,63.0,0,0,9.5875
0,3,Miss. Jeannie Lefebre,female,8.0,3,1,25.4667
0,3,Mr. Francis William Somerton,male,30.0,0,0,8.05
1,3,Master. Eden Leslie Coutts,male,9.0,1,1,15.9
0,3,Mr. Konrad Mathias Reiersen Hagland,male,19.0,1,0,19.9667
0,3,Mr. Einar Windelov,male,21.0,0,0,7.25
0,3,Mr. Edward Roland Stanley,male,21.0,0,0,8.05
0,3,Mr. Gerious Yousseff,male,26.0,0,0,14.4583
0,3,Mr. Frederick William Shellard,male,55.0,0,0,15.1
0,3,Mr. Olof Svensson,male,24.0,0,0,7.7958
0,3,Mr. Petar Calic,male,17.0,0,0,8.6625
0,3,Miss. Mary Canavan,female,21.0,0,0,7.75
0,3,Miss. Bridget Mary O'Sullivan,female,21.0,0,0,7.6292
0,3,Miss. Kristina Sofia Laitinen,female,37.0,0,0,9.5875
0,3,Mr. Henry Margido Olsen,male,28.0,0,0,22.525
1,3,Mr. Fang Lang,male,26.0,0,0,56.4958
1,3,Mr. Eugene Patrick Daly,male,29.0,0,0,7.75
0,3,Mr. James Webber,male,66.0,0,0,8.05
0,3,Mr. Satio Coleff,male,24.0,0,0,7.4958
0,3,Mr. Patrick Ryan,male,30.0,0,0,24.15
0,3,Mr. Stefo Pavlovic,male,32.0,0,0,7.8958
0,3,Mr. Janko Vovk,male,22.0,0,0,7.8958
0,3,Mr. Sarkis Lahoud,male,35.0,0,0,7.225
0,3,Mr. Fared Kassem,male,18.0,0,0,7.2292
0,3,Mr. James Farrell,male,40.5,0,0,7.75
0,3,Mr. Johan Werner Salonen,male,39.0,0,0,7.925
0,3,Mr. Nakli Toufik,male,17.0,0,0,7.2292
0,3,Mr. Joseph Jr Elias,male,17.0,1,1,7.2292
1,3,Mrs. Catherine (Catherine Rizk) Peter,female,24.0,0,2,22.3583
0,3,Miss. Marija Cacic,female,30.0,0,0,8.6625
0,3,Mr. Samuel Beard Risien,male,69.0,0,0,14.5
0,3,Miss. Ingeborg Constanzia Andersson,female,9.0,4,2,31.275
0,3,Miss. Sigrid Elisabeth Andersson,female,11.0,4,2,31.275
0,3,Mr. Frank John Goldsmith,male,33.0,1,1,20.525
0,3,Mr. Timothy O'Brien,male,21.0,0,0,7.8292
1,3,Mr. Fahim Leeni,male,22.0,0,0,7.225
1,3,Miss. Velin Ohman,female,22.0,0,0,7.775
1,3,Mrs. Guillaume Joseph (Emma) de Messemaeker,female,36.0,1,0,17.4
0,3,Mr. Thomas Rowan Morrow,male,30.0,0,0,7.75
0,3,Mr. Husein Sivic,male,40.0,0,0,7.8958
0,3,Mr. John Simmons,male,40.0,0,0,8.05
0,3,Miss. (Marion Ogden) Meanwell,female,62.0,0,0,8.05
0,3,Mr. Alfred J Davies,male,24.0,2,0,24.15
0,3,Mr. Ilia Stoytcheff,male,19.0,0,0,7.8958
0,3,Mrs. Nils (Alma Cornelia Berglund) Palsson,female,29.0,0,4,21.075
0,3,Mr. Tannous Doharr,male,28.0,0,0,7.2292
1,3,Mr. Carl Jonsson,male,32.0,0,0,7.8542
1,3,Miss. Mary Kelly,female,22.0,0,0,7.75
0,3,Mr. Alfred George John Rush,male,16.0,0,0,8.05
0,3,Mr. George Patchett,male,19.0,0,0,14.5
0,3,Mrs. Joseph (Maria Elias) Caram,female,18.0,1,0,14.4583
1,3,Mr. Eiriik Jussila,male,32.0,0,0,7.925
0,3,Mr. Uscher Paulner,male,16.0,0,0,8.7125
0,3,Mr. Eliezer Gilinski,male,22.0,0,0,8.05
0,3,Mr. Joseph Murdlin,male,22.0,0,0,8.05
0,3,Mr. Matti Rintamaki,male,35.0,0,0,7.125
0,3,Mr. William James Elsbury,male,47.0,0,0,7.25
0,3,Miss. Mary Bourke,female,40.0,0,2,7.75
0,3,Mr. Jean Baptiste Van Impe,male,36.0,1,1,24.15
0,3,Mr. Alfred Johnson,male,49.0,0,0,0.0
0,3,Mr. Hanna Boulos,male,18.0,0,0,7.225
0,3,Mr. Petco Slabenoff,male,42.0,0,0,7.8958
0,3,Mr. Ernst William Torber,male,44.0,0,0,8.05
0,3,Mr. Edvard Bengtsson Lindell,male,36.0,1,0,15.55
0,3,Mr. Milan Karaic,male,30.0,0,0,7.8958
0,3,Mrs. Anders Johan (Alfrida Konstantia Brogren) Andersson,female,39.0,1,5,31.275
0,3,Mr. Jose Neto Jardin,male,21.0,0,0,7.05
1,3,Miss. Margaret Jane Murphy,female,18.0,1,0,15.5
0,3,Mr. John Horgan,male,22.0,0,0,7.75
0,3,Mr. William Alfred Brocklebank,male,35.0,0,0,8.05
0,3,Mr. Ernst Gilbert Danbom,male,34.0,1,1,14.4
0,3,Mrs. William Arthur (Cordelia K Stanlick) Lobb,female,26.0,1,0,16.1
0,3,Mr. Antoni Yasbeck,male,27.0,1,0,14.4542
1,3,Mr. Sahid Nakid,male,20.0,1,1,15.7417
0,3,Mr. Henry Damsgaard Hansen,male,21.0,0,0,7.8542
0,3,Mr. David John Bowen,male,21.0,0,0,16.1
0,3,Mr. Guentcho Bostandyeff,male,26.0,0,0,7.8958
0,3,Mr. Patrick D O'Connell,male,18.0,0,0,7.7333
0,3,Mr. Johan Svensson Lundahl,male,51.0,0,0,7.0542
0,3,Miss. Mabel Skoog,female,9.0,3,2,27.9
0,3,Mr. Antti Gustaf Leinonen,male,32.0,0,0,7.925
0,3,Mrs. Juha (Maria Emilia Ojala) Panula,female,41.0,0,5,39.6875
0,3,Mr. Percival Thorneycroft,male,37.0,1,0,16.1
0,3,Mr. Hans Peder Jensen,male,20.0,0,0,7.8542
0,3,Miss. Margit Elizabeth Skoog,female,2.0,3,2,27.9
1,3,Mr. Choong Foo,male,32.0,0,0,56.4958
1,3,Miss. Eugenie Baclini,female,0.75,2,1,19.2583
0,3,Mr. Liudevit Cor,male,19.0,0,0,7.8958
0,3,Mr. Edward Willey,male,21.0,0,0,7.55
1,3,Miss. Amy Zillah Elsie Stanley,female,23.0,0,0,7.55
0,3,Mr. Mito Mitkoff,male,23.0,0,0,7.8958
0,3,Mr. Johannes Halvorsen Kalvik,male,21.0,0,0,8.4333
1,3,Miss. Hanora O'Leary,female,16.0,0,0,7.8292
0,3,Miss. Hanora Hegarty,female,18.0,0,0,6.75
0,3,Mr. Alexander Radeff,male,27.0,0,0,7.8958
0,3,Mrs. John (Catherine) Bourke,female,32.0,1,1,15.5
0,3,Mr. Mohamed Badt,male,40.0,0,0,7.225
0,3,Mr. Peju Coleff,male,36.0,0,0,7.4958
1,3,Mr. Eino William Lindqvist,male,20.0,1,0,7.925
0,3,Mr. Knud Paust Rommetvedt,male,49.0,0,0,7.775
0,3,Mr. Jacob Cook,male,43.0,0,0,8.05
0,3,Mr. Gustaf Hjalmar Edvardsson,male,18.0,0,0,7.775
0,3,Mr. Frederick Charles Sawyer,male,24.5,0,0,8.05
1,3,Miss. Anna Sofia Turja,female,18.0,0,0,9.8417
0,3,Mrs. Frederick (Augusta Tyler) Goodwin,female,43.0,1,6,46.9
0,3,Miss. Katie Peters,female,28.0,0,0,8.1375
0,3,Mr. Thor Anderson Olsvigen,male,20.0,0,0,9.225
0,3,Mr. Charles Edward Goodwin,male,14.0,5,2,46.9
0,3,Mr. Jaako Arnold Panula,male,14.0,4,1,39.6875
0,3,Mr. Branko Dakic,male,19.0,0,0,10.1708
0,3,Mr. Eberhard Thelander Fischer,male,18.0,0,0,7.7958
1,3,Miss. Manca Karun,female,4.0,0,1,13.4167
1,3,Mr. Ali Lam,male,37.0,0,0,56.4958
0,3,Mr. Khalil Saad,male,25.0,0,0,7.225
0,3,Mr. James Kelly,male,44.0,0,0,8.05
1,3,Miss. Katherine Mullens,female,19.0,0,0,7.7333
0,3,Mr. Adolf Mathias Nicolai Olsen Humblen,male,42.0,0,0,7.65
0,3,Miss. Saiide Barbara,female,18.0,0,1,14.4542
0,3,Mr. Martin Gallagher,male,25.0,0,0,7.7417
0,3,Mr. Henrik Juul Hansen,male,26.0,1,0,7.8542
1,3,Master. Halim Gonios Moubarek,male,4.0,1,1,15.2458
0,3,Mr. August Viktor Larsson,male,29.0,0,0,9.4833
0,3,Mr. Peter Andreas Lauritz Andersen Soholt,male,19.0,0,0,7.65
0,3,Mr. Malkolm Joackim Johnson,male,33.0,0,0,7.775
0,3,Mr. Svend Lauritz Jensen,male,17.0,1,0,7.0542
0,3,Mr. Luka Oreskovic,male,20.0,0,0,8.6625
1,3,Miss. Margareth Mannion,female,28.0,0,0,7.7375
0,3,Miss. Pieta Sofia Ilmakangas,female,25.0,1,0,7.925
0,3,Mr. Houssein G N Hassan,male,11.0,0,0,18.7875
0,3,Mr. Leslie Williams,male,28.5,0,0,16.1
0,3,Mrs. Edward (Margaret Ann Watson) Ford,female,48.0,1,3,34.375
0,3,Mr. Kanio Ivanoff,male,20.0,0,0,7.8958
0,3,Mr. Minko Nankoff,male,32.0,0,0,7.8958
0,3,Mr. Neal McNamee,male,24.0,1,0,16.1
1,3,Mr. Juho Stranden,male,31.0,0,0,7.925
0,3,Mr. Rossmore Edward Abbott,male,16.0,1,1,20.25
0,3,Mr. Michael Connaghton,male,31.0,0,0,7.75
1,3,Master. Meier Moor,male,6.0,0,1,12.475
0,3,Mr. Johannes Joseph Vande Velde,male,33.0,0,0,9.5
0,3,Mr. Lalio Jonkoff,male,23.0,0,0,7.8958
0,3,Mr. August Sigfrid Carlsson,male,28.0,0,0,7.7958
0,3,Mr. Thomas Leonard Theobald,male,34.0,0,0,8.05
0,3,Mr. John Garfirth,male,23.0,0,0,14.5
0,3,Mr. Iisakki Antino Aijo Nirva,male,41.0,0,0,7.125
1,3,Mr. Hanna Assi Barah,male,20.0,0,0,7.2292
0,3,Mr. Hans Linus Eklund,male,16.0,0,0,7.775
0,3,Miss. Mary Mangan,female,30.5,0,0,7.75
0,3,Mr. Daniel J Moran,male,28.0,1,0,24.15
0,3,Mr. Daniel Danielsen Gronnestad,male,32.0,0,0,8.3625
0,3,Mr. Rene Aime Lievens,male,24.0,0,0,9.5
0,3,Mr. Niels Peder Jensen,male,48.0,0,0,7.8542
0,3,Mr. Dibo Elias,male,29.0,0,0,7.225
0,3,Mr. Pehr Fabian Oliver Malkolm Myhrman,male,18.0,0,0,7.75
0,3,Mr. Roger Tobin,male,20.0,0,0,7.75
1,3,Miss. Virginia Ethel Emanuel,female,5.0,0,0,12.475
0,3,Mr. Thomas J Kilgannon,male,22.0,0,0,7.7375
1,3,Miss. Banoura Ayoub,female,13.0,0,0,7.2292
0,3,Mr. Andrew G Johnston,male,35.0,1,2,23.45
0,3,Mr. William Ali,male,25.0,0,0,7.05
0,3,Mr. Abraham (David Lishin) Harmer,male,25.0,0,0,7.25
1,3,Miss. Anna Sofia Sjoblom,female,18.0,0,0,7.4958
0,3,Master. George Hugh Rice,male,8.0,4,1,29.125
1,3,Master. Bertram Vere Dean,male,1.0,1,2,20.575
0,3,Mr. Andrew Keane,male,20.0,0,0,7.75
0,3,Miss. Stella Anna Sage,female,21.0,8,2,69.55
0,3,Mr. Ristiu Dantcheff,male,25.0,0,0,7.8958
1,3,Mrs. Mara Osman,female,31.0,0,0,8.6833
0,3,Mr. Yousseff Ibrahim Shawah,male,30.0,0,0,7.2292
0,3,Mrs. Jean Baptiste (Rosalie Paula Govaert) Van Impe,female,30.0,1,1,24.15
1,3,Master. Assad Alexander Thomas,male,0.42,0,1,8.5167
1,3,Mr. Oskar Arvid Hedman,male,27.0,0,0,6.975
0,3,Mr. Karl Johan Johansson,male,31.0,0,0,7.775
0,3,Miss. Ellen Natalia Pettersson,female,18.0,0,0,7.775
0,3,Mr. William Alexander,male,26.0,0,0,7.8875
0,3,Mr. James Lester,male,39.0,0,0,24.15
0,3,Miss. Ebba Iris Alfrida Andersson,female,6.0,4,2,31.275
0,3,Mr. Ernest Portage Tomlin,male,30.5,0,0,8.05
0,3,Miss. Wendla Maria Heininen,female,23.0,0,0,7.925
0,3,Mr. John Fredrik Alexander Holm,male,43.0,0,0,6.45
0,3,Master. Karl Thorsten Skoog,male,10.0,3,2,27.9
1,3,Mr. Nikola Lulic,male,27.0,0,0,8.6625
1,3,Mrs. (Beila) Moor,female,27.0,0,1,12.475
0,3,Master. Urho Abraham Panula,male,2.0,4,1,39.6875
0,3,Mr. John Flynn,male,36.0,0,0,6.95
0,3,Mr. Len Lam,male,23.0,0,0,56.4958
1,3,Mr. Thomas Joseph McCormack,male,19.0,0,0,7.75
1,3,Mrs. Antoni (Selini Alexander) Yasbeck,female,15.0,1,0,14.4542
0,3,Mr. Amin Saad,male,30.0,0,0,7.2292
0,3,Mr. Albert Augustsson,male,23.0,0,0,7.8542
0,3,Mr. Owen George Allum,male,18.0,0,0,8.3
0,3,Mr. Jakob Pasic,male,21.0,0,0,8.6625
0,3,Mr. Maurice Sirota,male,20.0,0,0,8.05
1,3,Mr. Chang Chip,male,32.0,0,0,56.4958
0,3,Mr. Ilmari Rudolf Alhomaki,male,20.0,0,0,7.925
0,3,Mr. Peter L Lemberopolous,male,34.5,0,0,6.4375
0,3,Mr. Jeso Culumovic,male,17.0,0,0,8.6625
0,3,Mr. Anthony Abbing,male,42.0,0,0,7.55
0,3,Mr. Douglas Bullen Sage,male,18.0,8,2,69.55
0,3,Mr. Marin Markoff,male,35.0,0,0,7.8958
0,3,Master. Sigvard Harald Elias Andersson,male,4.0,4,2,31.275
0,3,Mr. Johan Svensson,male,74.0,0,0,7.775
0,3,Miss. Nourelain Boulos,female,9.0,1,1,15.2458
1,3,Mrs. Sam (Leah Rosen) Aks,female,18.0,0,1,9.35
1,3,Mrs. Solomon (Latifa Qurban) Baclini,female,24.0,0,3,19.2583
0,3,Mr. Raihed Razi,male,30.0,0,0,7.2292
0,3,Mr. Claus Peter Hansen,male,41.0,2,0,14.1083
0,3,Miss. Dorothy Edith Sage,female,14.0,8,2,69.55
0,3,Mr. Philemon van Melkebeke,male,23.0,0,0,9.5
1,3,Master. Harold Theodor Johnson,male,4.0,1,1,11.1333
0,3,Mr. Cerin Balkic,male,26.0,0,0,7.8958
0,3,Mr. Victor Vander Cruyssen,male,47.0,0,0,9.0
1,3,Miss. Adele Kiamie Najib,female,15.0,0,0,7.225
0,3,Mr. Alfred Ossian Gustafsson,male,20.0,0,0,9.8458
0,3,Mr. Nedelio Petroff,male,19.0,0,0,7.8958
0,3,Mr. Kristo Laleff,male,23.0,0,0,7.8958
0,3,Mr. Johann Markun,male,33.0,0,0,7.8958
0,3,Miss. Gerda Ulrika Dahlberg,female,22.0,0,0,10.5167
0,3,Mr. Henry Jr Sutehall,male,25.0,0,0,7.05
0,3,Mrs. William (Margaret Norton) Rice,female,39.0,0,5,29.125
0,3,Miss. Catherine Helen Johnston,female,7.0,1,2,23.45
0,3,Mr. Patrick Dooley,male,32.0,0,0,7.75