Survived,Pclass,Name,Sex,Age,Siblings/Spouses Aboard,Parents/Children Aboard,Fare
T,2,Master. Viljo Hamalainen,male,0.67,1,1,14.5
T,2,Master. Alden Gates Caldwell,male,0.83,0,2,29.0
T,2,Master. George Sibley Richards,male,0.83,1,1,18.75
T,2,Master. Andre Mallet,male,1.0,0,2,37.0042
T,2,Master. Richard F Becker,male,1.0,2,1,39.0
T,2,Miss. Phyllis May Quick,female,2.0,1,1,26.0
T,2,Master. Edmond Roger Navratil,male,2.0,1,1,26.0
T,2,Master. Michel M Navratil,male,3.0,1,1,26.0
T,2,Miss. Simonne Marie Anne Andree Laroche,female,3.0,1,2,41.5792
T,2,Master. William Rowe Richards,male,3.0,1,1,18.75
T,2,Miss. Marion Louise Becker,female,4.0,2,1,39.0
T,2,Miss. Joan Wells,female,4.0,1,1,23.0
T,2,Miss. Constance Mirium West,female,5.0,1,2,27.75
T,2,Miss. Annie Jessie Harper,female,6.0,0,1,33.0
T,2,Miss. Eva Miriam Hart,female,7.0,0,2,26.25
T,2,Miss. Marjorie Collyer,female,8.0,0,2,26.25
T,2,Master. John Morgan Jr Davies,male,8.0,1,1,36.75
T,2,Miss. Madeleine Violet Mellinger,female,13.0,0,1,19.5
T,2,Mrs. Nicholas (Adele Achem) Nasser,female,14.0,1,0,30.0708
F,2,Mr. Thomas Charles Mudd,male,16.0,0,0,10.5
F,2,Mr. Alfred Gaskell,male,16.0,0,0,26.0
T,2,Miss. Bertha Lehmann,female,17.0,0,0,12.0
T,2,Miss. Bertha Ilett,female,17.0,0,0,10.5
F,2,Mr. Arne Jonas Fahlstrom,male,18.0,0,0,13.0
T,2,Miss. Elsie Doling,female,18.0,0,1,23.0
T,2,Miss. Lyyli Karoliina Silven,female,18.0,0,2,13.0
F,2,Mr. Charles Henry Davies,male,18.0,0,0,73.5
F,2,Mr. Edgardo Samuel Andrew,male,18.0,0,0,11.5
F,2,Mr. Percy Andrew Bailey,male,18.0,0,0,11.5
T,2,Miss. Kate Florence Phillips,female,19.0,0,0,26.0
F,2,Mr. Ennis Hastings Watson,male,19.0,0,0,0.0
T,2,Mrs. Edward (Ethel Clarke) Beane,female,19.0,1,0,26.0
F,2,Mr. William Carbines,male,19.0,0,0,13.0
F,2,Mr. Joseph Charles Nicholls,male,19.0,1,1,36.75
F,2,Mr. Frederick William Pengelly,male,19.0,0,0,10.5
T,2,Mr. William John Mellors,male,19.0,0,0,10.5
F,2,Mr. William Campbell,male,21.0,0,0,0.0
F,2,Mr. Francis Parkes,male,21.0,0,0,0.0
F,2,Mr. Frederick Edward Giles,male,21.0,1,0,11.5
T,2,Miss. Emily Rugg,female,21.0,0,0,10.5
F,2,Mr. Stanley George Hickman,male,21.0,2,0,73.5
F,2,Mr. Ambrose Jr Hood,male,21.0,0,0,73.5
T,2,Mrs. Joseph (Juliette Marie Louise Lafargue) Laroche,female,22.0,1,2,41.5792
F,2,Mr. Alfred Fleming Cunningham,male,22.0,0,0,0.0
T,2,Mrs. Albert Francis (Sylvia Mae Harbaugh) Caldwell,female,22.0,1,1,29.0
F,2,Dr. Alfred Pain,male,23.0,0,0,10.5
T,2,Mr. Charles Eugene Williams,male,23.0,0,0,13.0
T,2,Mrs. Amin S (Marie Marthe Thuillard) Jerwan,female,23.0,0,0,13.7917
F,2,Mr. George Floyd Eitemiller,male,23.0,0,0,13.0
F,2,Mr. Emile Richard,male,23.0,0,0,15.0458
F,2,Mr. Richard George Hocking,male,23.0,2,1,11.5
F,2,Mr. Moses Aaron Troupiansky,male,23.0,0,0,13.0
F,2,Mr. William John Berriman,male,23.0,0,0,13.0
T,2,Mrs. Sidney (Emily Hocking) Richards,female,24.0,2,3,18.75
T,2,Miss. Amelia Brown,female,24.0,0,0,13.0
T,2,Mrs. Sidney Samuel (Amy Frances Christy) Jacobsohn,female,24.0,2,1,27.0
F,2,Mr. Robert William Norman Leyson,male,24.0,0,0,10.5
T,2,Mrs. Sinai (Miriam Sternin) Kantor,female,24.0,1,0,26.0
F,2,Mr. John William Gill,male,24.0,0,0,13.0
F,2,Miss. Henriette Yrois,female,24.0,0,0,13.0
T,2,Miss. Alice Herman,female,24.0,1,2,65.0
F,2,Mr. Leonard Mark Hickman,male,24.0,2,0,73.5
T,2,Mrs. William (Anna) Hamalainen,female,24.0,0,2,14.5
F,2,Mr. Joseph Philippe Lemercier Laroche,male,25.0,1,2,41.5792
F,2,Mr. Reginald Fenton Butler,male,25.0,0,0,13.0
F,2,Mr. Kurt Arnold Gottfrid Bryhl,male,25.0,1,0,26.0
T,2,Mrs. William (Imanita Parrish Hall) Shelley,female,25.0,0,1,26.0
F,2,Mr. Charles Frederick Waddington Sedgwick,male,25.0,0,0,13.0
T,2,Miss. Julie Rachel Christy,female,25.0,1,1,30.0
F,2,Mr. Samuel James Hayden Sobey,male,25.0,0,0,13.0
F,2,Mrs. William (Anna Sylfven) Lahtinen,female,26.0,1,1,26.0
F,2,Mr. Lawrence Gavey,male,26.0,0,0,10.5
F,2,Mr. Percival James R Sharp,male,27.0,0,0,26.0
T,2,Miss. Edwina Celia Troutt,female,27.0,0,0,10.5
T,2,Miss. Asuncion Duran y More,female,27.0,1,0,13.8583
T,2,Mr. Julian Padro y Manent,male,27.0,0,0,13.8625
F,2,Rev. Juozas Montvila,male,27.0,0,0,13.0
F,2,Mrs. William John Robert (Dorothy Ann Wonnacott) Turpin,female,27.0,1,0,21.0
F,2,Mr. James H Bracken,male,27.0,0,0,13.0
T,2,Miss. Mary Davis,female,28.0,0,0,13.0
F,2,Rev. John Harper,male,28.0,0,1,33.0
F,2,Mr. Frederick James Banfield,male,28.0,0,0,10.5
T,2,Mrs. Charles V (Ada Maria Winfield) Clarke,female,28.0,1,0,26.0
F,2,Mr. Erik Gustaf Collander,male,28.0,0,0,13.0
T,2,Ms. Encarnacion Reynaldo,female,28.0,0,0,13.0
T,2,Mrs. William H (Jessie L) Trout,female,28.0,0,0,12.65
F,2,Mr. Robert Douglas Norman,male,28.0,0,0,13.5
T,2,Mrs. Samuel (Hannah Wizosky) Abelson,female,28.0,1,0,24.0
F,2,Mr. Sebastiano del Carlo,male,29.0,1,0,27.7208
F,2,Mr. William John Robert Turpin,male,29.0,1,0,21.0
T,2,Mrs. (Elizabeth Ramell) Nye,female,29.0,0,0,10.5
T,2,Mrs. Lizzie (Elizabeth Anne Wilkinson) Faunthorpe,female,29.0,1,0,26.0
T,2,Mrs. Leopold (Mathilde Francoise Pede) Weisz,female,29.0,1,0,26.0
F,2,Mr. Reginald Charles Coleridge,male,29.0,0,0,10.5
F,2,Mr. Hans Kristensen Givard,male,30.0,0,0,13.0
F,2,Mr. Reginald Hale,male,30.0,0,0,13.0
F,2,Mr. Walter Harris,male,30.0,0,0,10.5
T,2,Miss. Hilda Mary Slayter,female,30.0,0,0,12.35
T,2,Miss. Anna Sinkkonen,female,30.0,0,0,13.0
T,2,Mrs. Peter Henry (Lillian Jefferys) Renouf,female,30.0,3,0,21.0
F,2,Mr. William John Matthews,male,30.0,0,0,13.0
F,2,Mr. Samuel Abelson,male,30.0,1,0,24.0
F,2,Mr. Johan Henrik Johannesson Kvillner,male,31.0,0,0,10.5
T,2,Mr. Charles Wilhelms,male,31.0,0,0,13.0
F,2,Mr. Harvey Collyer,male,31.0,1,1,26.25
T,2,Miss. Jessie Wills Leitch,female,31.0,0,0,33.0
F,2,Mr. Albert Mallet,male,31.0,1,1,37.0042
T,2,Mrs. Harvey (Charlotte Annie Tate) Collyer,female,31.0,1,1,26.25
F,2,Mr. Stephen Curnow Jenkin,male,32.0,0,0,10.5
T,2,Mr. Edward Beane,male,32.0,1,0,26.0
F,2,Mr. Lewis Hickman,male,32.0,2,0,73.5
T,2,Mrs. (Rosa) Pinsky,female,32.0,0,0,13.0
F,2,Mr. Nicholas Nasser,male,32.5,1,0,30.0708
T,2,Miss. Susan Webber,female,32.5,0,0,13.0
T,2,Mrs. Frederick Charles (Jane Richards) Quick,female,33.0,0,2,26.0
T,2,Mrs. Edwy Arthur (Ada Mary Worth) West,female,33.0,1,2,27.75
F,2,Mr. George Henry Hunt,male,33.0,0,0,12.275
F,2,Mr. Sinai Kantor,male,34.0,1,0,26.0
T,2,Mrs. John T (Ada Julia Bone) Doling,female,34.0,0,1,23.0
F,2,Mr. Martin Ponesell,male,34.0,0,0,13.0
T,2,Mr. Lawrence Beesley,male,34.0,0,0,13.0
F,2,Mr. Shadrach Gale,male,34.0,1,0,21.0
T,2,Mrs. James Vivian (Lulu Thorne Christian) Drew,female,34.0,1,1,32.5
T,2,Mrs. (Amelia Milley) Lemore,female,34.0,0,0,10.5
F,2,Mr. Peter Henry Renouf,male,34.0,1,0,21.0
T,2,Miss. Ethel Garside,female,34.0,0,0,13.0
F,2,Mr. William Henry Gillespie,male,34.0,0,0,13.0
T,2,Miss. Clear Annie Cameron,female,35.0,0,0,21.0
F,2,Mr. Richard James Slemen,male,35.0,0,0,10.5
F,2,Mr. Joseph J Fynney,male,35.0,0,0,26.0
F,2,Mr. Edwy Arthur West,male,36.0,1,2,27.75
T,2,Miss. Kate Buss,female,36.0,0,0,13.0
F,2,Mr. David Reeves,male,36.0,0,0,10.5
F,2,Mr. Stanley Hubert Fox,male,36.0,0,0,13.0
T,2,Mrs. William A (Florence Agnes Hughes) Angle,female,36.0,1,0,26.0
T,2,Mrs. (Ada E Hall) Ball,female,36.0,0,0,13.0
F,2,Mr. Rene Jacques Levy,male,36.0,0,0,12.875
F,2,Mr. Michel Navratil,male,36.5,0,2,26.0
F,2,Mr. Anthony Wood Frost,male,37.0,0,0,0.0
F,2,Mr. John Henry Chapman,male,37.0,1,0,26.0
F,2,Miss. Annie Clemmer Funk,female,38.0,0,0,13.0
F,2,Mr. Rene Pernot,male,39.0,0,0,15.05
F,2,Mr. Henry Samuel Morley,male,39.0,0,0,26.0
F,2,Mr. August Meyer,male,39.0,0,0,13.0
F,2,Mr. Richard Otter,male,39.0,0,0,13.0
T,2,Mrs. James (Elizabeth Inglis Milne) Watt,female,40.0,0,0,15.75
T,2,Mrs. Thomas William Solomon (Elizabeth Catherine Ford) Brown,female,40.0,1,1,39.0
T,2,Miss. Marion Elsie Smith,female,40.0,0,0,13.0
T,2,Mrs. (Elizabeth Anne Maidment) Mellinger,female,41.0,0,1,19.5
F,2,Mr. Robert J Knight,male,41.0,0,0,0.0
T,2,Mrs. (Karolina) Bystrom,female,42.0,0,0,13.0
T,2,Mrs. Charles Alexander (Alice Adelaide Slow) Louch,female,42.0,1,0,26.0
F,2,Rev. Thomas Roussel Davids Byles,male,42.0,0,0,13.0
T,2,Mr. Masabumi Hosono,male,42.0,0,0,13.0
F,2,Mr. Sidney Samuel Jacobsohn,male,42.0,1,0,27.0
F,2,Mr. Benjamin Hart,male,43.0,1,1,26.25
F,2,Mr. Stephen Hold,male,44.0,1,0,26.0
F,2,Mrs. Ernest Courtenay (Lilian Hughes) Carter,female,44.0,1,0,26.0
T,2,Mrs. Benjamin (Esther Ada Bloomfield) Hart,female,45.0,1,1,26.25
T,2,Mrs. Florence Kelly,female,45.0,0,0,13.5
T,2,Miss. Nora A Keane,female,46.0,0,0,12.35
F,2,Mr. Peter David McKane,male,46.0,0,0,26.0
F,2,Mr. John Denzil Jarvis,male,47.0,0,0,15.0
F,2,Mr. Jacob Christian Milling,male,48.0,0,0,13.0
T,2,Mrs. Samuel (Jane Laver) Herman,female,48.0,1,2,65.0
T,2,Mrs. (Lutie Davis) Parrish,female,50.0,0,1,26.0
T,2,Miss. Lucy Ridsdale,female,50.0,0,0,10.5
T,2,Miss. Ellen Toomey,female,50.0,0,0,10.5
F,2,Mr. Henry Price Hodges,male,50.0,0,0,13.0
F,2,Rev. Robert James Bateman,male,51.0,0,0,12.525
F,2,Mr. Samuel Greenberg,male,52.0,0,0,13.0
F,2,Mr. Charles Henry Chapman,male,52.0,0,0,13.5
F,2,Mr. William James Downton,male,54.0,0,0,26.0
T,2,Mrs. Elizabeth (Eliza Needs) Hocking,female,54.0,1,3,23.0
F,2,Rev. Ernest Courtenay Carter,male,54.0,1,0,26.0
F,2,Dr. Ernest Moraweck,male,54.0,0,0,14.0
T,2,Mrs. (Mary D Kingcome) Hewlett,female,55.0,0,0,16.0
F,2,Rev. Charles Leonard Kirkland,male,57.0,0,0,12.35
F,2,Mrs. (Mary) Mack,female,57.0,0,0,10.5
F,2,Mr. Ernst Adolf Sjostedt,male,59.0,0,0,13.5
F,2,Mr. Thomas William Solomon Brown,male,60.0,1,1,39.0
T,2,Mr. George Harris,male,62.0,0,0,10.5
F,2,Mr. Edward H Wheadon,male,66.0,0,0,10.5
F,2,Mr. Henry Michael Mitchell,male,70.0,0,0,10.5