Survived,Pclass,Name,Sex,Age,Siblings/Spouses Aboard,Parents/Children Aboard,Fare
1,1,Mrs. John Bradley (Florence Briggs Thayer) Cumings,female,38.0,1,0,71.2833
1,1,Mrs. Jacques Heath (Lily May Peel) Futrelle,female,35.0,1,0,53.1
0,1,Mr. Timothy J McCarthy,male,54.0,-,0,51.8625
1,1,Miss. Elizabeth Bonnell,female,58.0,-,0,26.55
1,1,Mr. William Thompson Sloper,male,28.0,-,0,35.5
0,1,Mr. Charles Alexander Fortune,male,19.0,3,2,263.0
0,1,Don. Manuel E Uruchurtu,male,40.0,-,0,27.7208
1,1,Mrs. William Augustus (Marie Eugenie) Spencer,female,48.0,1,0,146.5208
0,1,Mr. Edgar Joseph Meyer,male,28.0,1,0,82.1708
0,1,Mr. Alexander Oskar Holverson,male,42.0,1,0,52.0
1,1,Mrs. Henry Sleeper (Myna Haxtun) Harper,female,49.0,1,0,76.7292
0,1,Mr. Engelhart Cornelius Ostby,male,65.0,-,1,61.9792
1,1,Mr. Hugh Woolner,male,46.0,-,0,35.5
1,1,Miss. Amelie Icard,female,38.0,-,0,80.0
0,1,Mr. Henry Birkhardt Harris,male,45.0,1,0,83.475
0,1,Mr. Albert A Stewart,male,64.0,-,0,27.7208
0,1,Mr. Francisco M Carrau,male,28.0,-,0,47.1
1,1,Miss. Mabel Helen Fortune,female,23.0,3,2,263.0
0,1,Mr. Herbert Fuller Chaffee,male,46.0,1,0,61.175
0,1,Mr. George B Goldschmidt,male,71.0,-,0,34.6542
1,1,Mr. William Bertram Greenfield,male,23.0,-,1,63.3583
0,1,Mr. Richard Frasar White,male,21.0,-,1,77.2875
0,1,Mr. Walter Chamberlain Porter,male,47.0,-,0,52.0
0,1,Mr. Quigg Edmond Baxter,male,24.0,-,1,247.5208
0,1,Mr. Percival Wayland White,male,54.0,-,1,77.2875
1,1,Miss. Helen Monypeny Newsom,Female,19.0,-,2,26.2833
0,1,Mr. Jacques Heath Futrelle,male,37.0,1,0,53.1
0,1,Mr. Victor Giglio,male,24.0,-,0,79.2
1,1,Mrs. Thomas (Edith Wearne) Pears,female,22.0,1,0,66.6
0,1,Mr. Charles Duane Williams,male,51.0,-,1,61.3792
1,1,Mrs. (Edith Martha Bowerman) Chibnall,female,,-,1,55.0
0,1,Mr. John D Baumann,male,60.0,-,0,25.925
0,1,Mr. Wyckoff Van der hoef,male,61.0,-,0,33.5
0,1,Mr. James Clinch Smith,male,56.0,-,0,30.6958
0,1,Miss. Ann Elizabeth Isham,female,50.0,-,0,28.7125
0,1,Mr. Hugh Roscoe Rood,M,39.0,-,0,50.0
1,1,Mr. Charles Hallace Romaine,male,45.0,-,0,26.55
1,1,"Mrs. James Joseph (Margaret Tobin) Brown. From Wikipedia: Margaret Brown (nÃ©e Tobin; July 18, 1867 â€“ October 26, 1932), posthumously known as ""The Unsinkable Molly Brown"", was an American socialite and philanthropist. She was a passenger on the RMS Titanic which sank in 1912 and she unsuccessfully urged the crew in Lifeboat No. 6 to return to the debris field to look for survivors.

    During her lifetime, her friends called her ""Maggie"", but by her death, obituaries referred to her as the ""Unsinkable Mrs. Brown"". Gene Fowler referred to her as ""Molly Brown"" in his 1933 book Timberline. The following year, she was referred to as ""The Unsinkable Mrs. Brown"" and ""Molly Brown"" in newspapers. ",female,44.0,-,0,27.7208
1,1,Miss. Elise Lurette,female,58.0,-,0,146.5208
1,1,Mr. Henry Blank,male,40.0,-,0,31.0
1,1,Miss. Madeleine Newell,F,31.0,1,0,113.275
1,1,Miss. Albina Bazzani,female,32.0,-,0,76.2917
1,1,Mr. Frederick Maxfield Hoyt,male,38.0,1,0,90.0
1,1,Mrs. Henry Birkhardt (Irene Wallach) Harris,Female,35.0,1,0,83.475
0,1,Dr. William Edward Minahan,male,44.0,2,0,90.0
1,1,Mr. Richard Leonard Beckwith,male,37.0,1,1,52.5542
0,1,Mr. William Thomas Stead,Male,62.0,-,0,26.55
1,1,Mrs. Gertrude Maybelle Thorne,female,38.0,-,0,79.2
1,1,Miss. Gladys Cherry,Female,30.0,-,0,86.5
1,1,Miss. Anna Ward,female,35.0,-,0,512.3292
0,1,Mr. Emil Taussig,male,52.0,1,1,79.65
0,1,Mr. William Harrison,male,40.0,-,0,0.0
1,1,Mrs. William Thompson (Edith Junkins) Graham,Female,58.0,-,1,153.4625
1,1,Miss. Amelia Bissette,female,35.0,-,0,135.6333
0,1,Mr. Alexander Cairns,male,28.0,-,0,31.0
0,1,Miss. Susan Parker Ryerson,male,37.0,-,1,29.7
1,1,Miss. Kornelia Theodosia Andrews,Female,63.0,1,0,77.9583
0,1,Mr. Richard William Smith,male,57.0,-,0,26.0
1,1,Miss. Ellen Barber,female,26.0,-,0,78.85
1,1,Mrs. Dickinson H (Helen Walton) Bishop,female,19.0,1,0,91.0792
0,1,Mr. Ervin G Lewy,male,30.0,-,0,27.7208
0,1,Miss. Helen Loraine Allison,female,2.0,1,2,151.55
1,1,Mr. Adolphe Saalfeld,male,47.0,-,0,30.5
1,1,Mrs. James (Helene DeLaudeniere Chaput) Baxter,female,50.0,-,1,247.5208
1,1,Master. Hudson Trevor Allison,male,0.92,1,2,151.55
1,1,Miss. Margaret Fleming,female,42.0,-,0,110.8833
1,1,Mrs. Victor de Satode (Maria Josefa Perez de Soto y Vallejo) Penasco y Castellana,female,17.0,1,0,108.9
1,1,Miss. Laura Mabel Francatelli,female,30.0,-,0,56.9292
1,1,Miss. Margaret Bechstein Hays,female,24.0,-,0,83.1583
1,1,Miss. Emily Borie Ryerson,female,18.0,2,2,262.375
1,1,Miss. Mary Natalie Wick,Female,31.0,-,2,164.8667
1,1,Mrs. Frederic Oakley (Margaretta Corning Stone) Spedden,Female,40.0,1,1,134.5
1,1,Miss. Marie Grice Young,female,36.0,-,0,135.6333
1,1,Miss. Jean Gertrude Hippach,female,16.0,-,1,57.9792
0,1,Mr. Austen Partner,male,45.5,-,0,28.5
0,1,Mr. George Edward Graham,Male,38.0,-,1,153.4625
1,1,Mrs. Henry William (Clara Heinsheimer) Frauenthal,female,42.0,1,0,133.65
0,1,Mr. Thomas Clinton Pears,male,29.0,1,0,66.6
1,1,Miss. Elizabeth Margaret Burns,female,41.0,-,0,134.5
0,1,Mr. Stephen Weart Blackwell,male,45.0,-,0,3355.0
1,1,Miss. Alice Elizabeth Fortune,female,24.0,3,2,263.0
0,1,Mr. Fletcher Fellows Williams-Lambert,male,43.0,-,0,35.0
1,1,Miss. Elsie Edith Bowerman,female,22.0,-,1,55.0
1,1,Mrs. Frank Manley (Anna Sophia Atkinson) Warren,female,60.0,1,0,75.25
1,1,Mme. Leontine Pauline Aubart,female,24.0,-,0,69.3
1,1,Mr. George Achilles Harder,male,25.0,1,0,55.4417
0,1,Mr. Sante Ringhini,male,22.0,-,0,135.6333
1,1,Mrs. Edgar Joseph (Leila Saks) Meyer,female,25.0,1,0,82.1708
0,1,Mr. Harry Elkins Widener,male,27.0,-,2,211.5
1,1,Miss. Rosalie Bidois,female,42.0,-,0,227.525
1,1,Mrs. Alexander Oskar (Mary Aline Towner) Holverson,female,35.0,1,0,52.0
1,1,Mr. William Ernest Carter,male,36.0,1,2,120.0
1,1,Miss. Marjorie Newell,female,23.0,1,0,113.275
1,1,Miss. Daisy E Minahan,female,33.0,1,0,90.0
1,1,Mr. Mauritz Hakan Bjornstrom-Steffansson,male,28.0,-,0,26.55
0,1,Mr. William Baird Silvey,male,50.0,1,0,55.9
1,1,Miss. Lucile Polk Carter,female,14.0,1,2,120.0
0,1,Mr. Mark Fortune,Male,64.0,1,4,263.0
1,1,Master. Washington Dodge,male,4.0,-,2,81.8583
1,1,Mr. Frederic Kimber Seward,male,34.0,-,0,26.55
1,1,Major. Arthur Godfrey Peuchen,male,52.0,-,0,30.5
0,1,Mr. Benjamin Laventall Foreman,male,30.0,-,0,27.75
1,1,Mr. Samuel L Goldenberg,Male,49.0,1,0,89.1042
0,1,Mr. Francis Davis Millet,male,65.0,-,0,26.55
1,1,Mrs. Frederick R (Marion) Kenyon,Female,41.0,1,0,51.8625
1,1,Mr. Harry Anderson,Male,48.0,-,0,26.55
0,1,Mr. Arthur H Gee,male,47.0,-,0,38.5
0,1,Mr. John Montgomery Smart,male,56.0,-,0,26.55
0,1,Mr. George Quincy Clifford,male,40.0,-,0,52.0
1,1,Mr. Dickinson H Bishop,Male,25.0,1,0,91.0792
1,1,Mrs. Frederick Maxfield (Jane Anne Forby) Hoyt,Female,35.0,1,0,90.0
0,1,Mr. Edward Austin Kent,male,58.0,-,0,29.7
0,1,Mr. Harry Markland Molson,M,55.0,-,0,30.5
0,1,Mr. Ramon Artagaveytia,male,71.0,-,0,49.5042
1,1,Miss. Elizabeth Mussey Eustis,female,54.0,1,0,78.2667
0,1,Mrs. Hudson J C (Bessie Waldo Daniels) Allison,female,25.0,1,2,151.55
1,1,Miss. Roberta Maioni,female,16.0,-,0,86.5
0,1,Mr. Victor de Satode Penasco y Castellana,M,18.0,1,0,108.9
1,1,Mr. George Bradley,male,43.5,-,0,26.55
1,1,Mr. James Robert McGough,male,36.0,-,0,26.2875
1,1,Mrs. Martin (Elizabeth L. Barrett) Rothschild,female,54.0,1,0,59.4
0,1,Mr. William Anderson Walker,male,47.0,-,0,34.0208
1,1,Miss. Anne Perreault,female,30.0,-,0,93.5
1,1,Mrs. Louis Albert (Ida Sophia Fischer) Hippach,female,44.0,-,1,57.9792
0,1,Mr. John Farthing,M,49.0,-,0,221.7792
0,1,Major. Archibald Willingham Butt,M,45.0,-,0,26.55
1,1,Miss. Bertha LeRoy,female,30.0,-,0,106.425
1,1,Miss. Hedwig Margaritha Frolicher,Female,unknown,-,2,49.5
1,1,Miss. Harriet R Crosby,Female,36.0,-,2,71.0
0,1,Mr. Walter Donald Douglas,Male,50.0,1,0,106.425
0,1,Mr. Arthur Ernest Nicholson,male,64.0,-,0,26.0
1,1,Mr. John Borland Jr Thayer,male,17.0,-,2,110.8833
0,1,Mr. George Wright,M,62.0,-,0,26.55
1,1,Lady. (Lucille Christiana Sutherland)Duff Gordon,female,48.0,1,0,39.6
0,1,Mr. Victor Robbins,Male,45.0,-,0,227.525
1,1,Mrs. Emil (Tillie Mandelbaum) Taussig,female,39.0,1,1,79.65
1,1,Mrs. Edward Dale (Charlotte Lamson) Appleton,Female,53.0,2,0,51.4792
1,1,Mr. John Irwin Flynn,male,36.0,-,0,26.3875
1,1,Mrs. William Baird (Alice Munger) Silvey,female,39.0,1,0,55.9
1,1,Mrs. John Borland (Marian Longstreth Morris) Thayer,Female,39.0,1,1,110.8833
0,1,Mr. John Hugo Ross,male,36.0,-,0,40.125
1,1,Miss. Ruth Taussig,F,18.0,-,2,79.65
1,1,Mr. Maxmillian Frolicher-Stehli,Male,60.0,1,1,79.2
1,1,Mrs. Walter Bertram (Martha Eustis) Stephenson,female,52.0,1,0,78.2667
1,1,Sir. Cosmo Edmund Duff Gordon,Male,49.0,1,0,56.9292
0,1,Mr. Charles H Harrington,male,37.0,-,0,42.4
1,1,Mr. Harry Homer,male,35.0,-,0,26.55
1,1,Mr. Robert Williams Daniel,male,27.0,-,0,30.5
1,1,Miss. Elizabeth W Shutes,female,40.0,-,0,153.4625
10,1,Mr. Edwin Nelson Jr Kimball,Male,42.0,1,0,52.5542
0,1,Mr. Frederick Sutton,male,61.0,-,0,32.3208
1,1,Miss. Gretchen Fiske Longley,female,21.0,-,0,77.9583
1,1,Mr. Algernon Henry Wilson Barkworth,Male,80.0,-,0,30.0
1,1,Dr. Max Stahelin-Maeglin,male,32.0,-,0,30.5
0,1,Mr. William Henry Marsh Parr,male,30.0,-,0,0.0
1,1,Mlle. Emma Sagesser,female,24.0,-,0,69.3
1,1,Mr. Henry Sleeper Harper,male,48.0,1,0,76.7292
1,1,Col. Oberst Alfons Simonius-Blumer,male,56.0,-,0,35.5
0,1,Mr. Arthur Webster Newell,male,58.0,-,2,113.275
1,1,Dr. Henry William Frauenthal,Male,50.0,2,0,133.65
0,1,Mr. Edward Pomeroy Colley,male,47.0,-,0,25.5875
1,1,Mrs. Elmer Zebley (Juliet Cummins Wright) Taylor,female,48.0,1,0,52.0
0,1,Mr. Thornton Davidson,male,31.0,1,0,52.0
1,1,Mr. Thomas Drake Martinez Cardeza,male,36.0,-,1,512.3292
1,1,Mr. Hammad Hassab,male,27.0,-,0,76.7292
1,1,Miss. Georgette Alexandra Madill,female,15.0,-,1,211.3375
1,1,Mr. Albert Adrian Dick,male,31.0,1,0,57.0
0,1,Col. John Weir,male,60.0,-,0,26.55
0,1,Mr. John Borland Thayer,male,49.0,1,1,110.8833
1,1,Mrs. John Jacob (Madeleine Talmadge Force) Astor,F,18.0,1,0,227.525
1,1,Mr. Spencer Victor Silverthorne,male,35.0,-,0,26.2875
1,1,Mr. Edward Pennington Calderhead,male,42.0,-,0,26.2875
1,1,Miss. Alice Cleaver,F,22.0,-,0,151.55
1,1,Mlle. Berthe Antonine Mayne,female,24.0,-,0,49.5042
0,1,Mr. Herman Klaber,Male,41.0,-,0,26.55
1,1,Mr. Elmer Zebley Taylor,male,48.0,1,0,52.0
1,1,Miss. Caroline Louise Endres,female,38.0,-,0,227.525
1,1,,male,27.0,1,0,53.1
1,1,Miss. Elisabeth Walton Allen,female,29.0,-,0,211.3375
1,1,Mr. Gustave J Lesurer,male,35.0,-,0,512.3292
1,1,Mr. Walter James Hawksford,male,45.0,-,0,30.0
0,1,Mr. Tyrell William Cavendish,male,36.0,1,0,78.85
1,1,Miss. Susan Parker Ryerson,female,21.0,2,2,262.375
0,1,Capt. Edward Gifford Crosby,male,70.0,1,1,-71.0
0,1,Mr. Daniel Warner Marvin,male,19.0,1,0,53.1
1,1,the Countess. of (Lucy Noel Martha Dyer-Edwards) Rothes,female,33.0,-,0,86.5
1,1,Mrs. William Ernest (Lucile Polk) Carter,F,36.0,1,2,120.0
1,1,Mrs. John C (Anna Andrews) Hogeboom,Female,51.0,1,0,77.9583
0,1,Dr. Arthur Jackson Brewe,male,46.0,-,0,39.6
1,1,Mrs. Edward Scott (Elisabeth Walton McMillan) Robert,Female,43.0,-,1,211.3375
1,1,Mrs. Albert Adrian (Vera Gillespie) Dick,female,17.0,1,0,57.0
0,1,Mr. Milton Clyde Long,male,29.0,-,0,30.0
0,1,Mr. Benjamin Guggenheim,male,46.0,-,0,79.2
0,1,Mr. William Fisher Hoyt,male,43.0,-,0,30.6958
1,1,Dr. Alice (Farnham) Leader,female,49.0,-,0,25.9292
1,1,Master. William Thornton II Carter,male,11.0,1,2,120.0
0,1,Mr. Thomas Jr Andrews,male,39.0,-,0,0.0
1,1,Mrs. Norman Campbell (Bertha Griggs) Chambers,female,33.0,1,0,53.1
0,1,Mr. Richard Fry,male,39.0,-,0,0.0
1,1,Mrs. Charles Melville (Clara Jennings Gregg) Hays,F,52.0,1,1,93.5
0,1,Jonkheer. John George Reuchlin,male,38.0,-,0,0.0
1,1,Mrs. George Nelson (Martha Evelyn) Stone,female,62.0,-,0,80.0
1,1,Miss. Sara Rebecca Compton,Female,39.0,1,1,83.1583
1,1,Mr. Pierre Marechal,male,29.0,-,0,29.7
1,1,Miss. Augusta Serepeca,female,30.0,-,0,31.0
1,1,Mrs. Samuel L (Edwiga Grabowska) Goldenberg,female,40.0,1,0,89.1042
1,1,Miss. Mary Conover Lines,female,16.0,-,1,39.4
1,1,Mrs. George Dennick (Mary Hitchcock) Wick,female,45.0,1,1,164.8667
1,1,Mr. Peter Denis Daly,male,51.0,-,0,26.55
1,1,Mrs. Frederick Joel (Margaret Welles Barron) Swift,female,48.0,-,0,25.9292
0,1,"Washington Augustus Roebling, Mr.",male,31.0,-,0,50.4958
1,1,Mrs. Richard Leonard (Sallie Monypeny) Beckwith,female,47.0,1,1,52.5542
0,1,Mr. Frans Olof Carlsson,male,33.0,-,0,5.0
1,1,Mrs. Thomas Jr (Lily Alexenia Wilson) Potter,female,56.0,-,1,83.1583
1,1,Miss. Margaret Edith Graham,Female,19.0,-,0,30.0
1,1,Mr. Karl Howell Behr,male,26.0,-,0,30.0