{
    "fields": [
        {
            "name": "Survived", 
            "type": "boolean",
            "trueValues": ["1"],
            "falseValues": ["0"]
        },
        {
            "name": "Pclass", 
            "type": "integer",
            "constraints": {
                "required": true,
                "enum": [1, 2, 3]
            }
        },
        {
            "name": "Name", 
            "type": "string",
            "constraints": {
                "required": true,
                "unique": true, 
                "minLength": 5,
                "maxLength": 100,
                "pattern": "^[A-Z][a-z]+\\. (.*)$"
            }
        },
        {
            "name": "Sex", 
            "type": "string",
            "constraints": {
                "required": true,
                "enum": ["male", "female"]
            }
        },
        {
            "name": "Age", 
            "type": "number",
            "constraints": {
                "required": true,
                "unique": false,
                "minimum": 0,
                "maximum": 125
            }
        },
        {
            "name": "Siblings/Spouses Aboard", 
            "type": "integer",
            "constraints": {
                "required": false,
                "unique": false,
                "minimum": 0,
                "maximum": 20
            }
        },
        {
            "name": "Parents/Children Aboard", 
            "type": "integer",
            "constraints": {
                "required": true,
                "unique": false,
                "minimum": 0,
                "maximum": 20
            }
        },
        {
            "name": "Fare", 
            "type": "number",
            "constraints": {
                "required": false,
                "unique": false,
                "minimum": 0,
                "maximum": 1000
            }
        }
    ],
    "missingValues": ["-", ""]
}