{
	"JSON": {
		"ID": "1ee4d7f7-565f-6f82-8db2-2cf8a3c4cb18",
		"label": "",
		"comment": "UUID6 is used"
	},
	"group": {
		"number": "01",
		"author": "Gruppe 01",
		"members": "Carina Seifert, Fabian Rösch, Martin Kröker",
		"experiment": "lavalrotor",
		"testrig_number": "04"
	}
}