{
	"JSON": {
		"ID": "1ee7d443-5a29-6863-bb97-27e7763ee3fd",
		"label": "PDC023",
		"comment": "UUID6 is used"
	},
	"probe": {
		"material": "ABS",
		"mass": {
			"value": 0,
			"unit": "gramm",
			"uncertainty": {
				"value": 1,
				"type": "absolut",
				"unit": "gramm"
			}
		},
		"dimensions": {
			"height": {
				"value": 40,
				"unit": "millimeter"
			},
			"diameter": {
				"value": 60,
				"unit": "millimeter"
			},
			"volume": {
				"value": 80570,
				"unit": "cubic millimeter"
			}
		}
	}
}