{
	"JSON": {
		"ID": "1ee863e1-1ad7-6b4d-9c4d-94fecc574080",
		"label": "",
		"comment": "UUID6 is used"
	},
	"instrument": {
		"name": "raspberry_pi",
		"type": "single_board_computer",
		"manufacturer": "Raspberry Pi Foundation",
		"model": "Raspeberry Pi 4/400 B",
		"serial": "10000000b6f21124",
		"operating_system": "Raspberry Pi OS",
		"comment": "to get model and serial number put this code in the terminal: cat /proc/cpuinfo"
	}
}