{
    "assembly": {
        "uuid": "kpi-2af871f9-e028-40d8-b8c2-7c557ec55cd1",
        "properties": {
            "label": "car_2",
            "manufacturer": "TU Darmstadt",
            "comment": "LIGHTning McSpeed ... now even lighter and cheaper",
            "mass [g]": 271.29999999999995,
            "cost [\u20ac]": 23.720000000000006,
            "total deliverytime [days]": 12,
            "locking torque [Ncm]": 11,
            "idle speed per mass [rev per g*min]": 1.4928123848138595
        },
        "layer": "kpi-SYSTEM",
        "components": [
            {
                "component": {
                    "uuid": "kpi-31439abe-c7b1-47d8-b838-947fbe61813e",
                    "properties": {
                        "label": "battery",
                        "item number": "2847c01",
                        "item description": "Electric 9V Battery Box",
                        "category": "battery",
                        "price [Euro]": 2,
                        "mass [g]": 172.7,
                        "delivery time [days]": 3,
                        "data source": "https://www.bricklink.com/v2/catalog/catalogitem.page?P=2847c01&name=Electric%209V%20Battery%20Box%204%20x%2014%20x%204%20with%20Red%20Buttons%20and%20Contact%20Plate%20with%20Dark%20Gray%20Base%20(2846%20/%202847c00)&category=%5BElectric,%20Battery%20Box%5D#T=S&O={%22iconly%22:0}",
                        "output voltage [V]": 9.0,
                        "dimensions [cm]": "11,2 x 3,2 x 3,2",
                        "color": "grey"
                    },
                    "layer": "kpi-COMPONENT"
                }
            }
        ],
        "assemblies": [
            {
                "assembly": {
                    "uuid": "kpi-0485efe0-d94a-4a40-9015-57b82b5fbaea",
                    "properties": {
                        "label": "chassis subassembly",
                        "assembly_method": "stick together like lego blocks"
                    },
                    "layer": "kpi-SUBASSEMBLY",
                    "components": [
                        {
                            "component": {
                                "uuid": "kpi-54b3762a-96c5-419e-bfb9-7d6ca3d318a7",
                                "properties": {
                                    "label": "front frame",
                                    "item number": 32532,
                                    "item description": "Technic, Brick 6 x 8 Open Center",
                                    "category": "frame",
                                    "price [Euro]": 0.18,
                                    "mass [g]": 8.0,
                                    "delivery time [days]": 3,
                                    "data source": "https://www.bricklink.com/v2/catalog/catalogitem.page?P=32532#T=C",
                                    "dimension [studs]": "6 x 8 x 1",
                                    "color": "grey"
                                },
                                "layer": "kpi-COMPONENT"
                            }
                        },
                        {
                            "component": {
                                "uuid": "kpi-a3e03b64-57bc-4d08-bd4c-0ca7d66f1810",
                                "properties": {
                                    "label": "middle frame",
                                    "item number": 32532,
                                    "item description": "Technic, Brick 6 x 8 Open Center",
                                    "category": "frame",
                                    "price [Euro]": 0.18,
                                    "mass [g]": 8.0,
                                    "delivery time [days]": 3,
                                    "data source": "https://www.bricklink.com/v2/catalog/catalogitem.page?P=32532#T=C",
                                    "dimension [studs]": "6 x 8 x 1",
                                    "color": "grey"
                                },
                                "layer": "kpi-COMPONENT"
                            }
                        },
                        {
                            "component": {
                                "uuid": "kpi-0e0e7d8b-fc2e-4bc3-84d7-e4c1e6821da2",
                                "properties": {
                                    "label": "back frame",
                                    "item number": 32532,
                                    "item description": "Technic, Brick 6 x 8 Open Center",
                                    "category": "frame",
                                    "price [Euro]": 0.18,
                                    "mass [g]": 8.0,
                                    "delivery time [days]": 3,
                                    "data source": "https://www.bricklink.com/v2/catalog/catalogitem.page?P=32532#T=C",
                                    "dimension [studs]": "6 x 8 x 1",
                                    "color": "grey"
                                },
                                "layer": "kpi-COMPONENT"
                            }
                        },
                        {
                            "component": {
                                "uuid": "kpi-e20be82a-48c6-4e99-8ce4-9c28a7a16999",
                                "properties": {
                                    "label": "front Pinconnector",
                                    "item number": 48989,
                                    "item description": "Technic, Pin Connector Perpendicular 3L with 4 Pins",
                                    "category": "frame",
                                    "price [Euro]": 0.01,
                                    "mass [g]": 1.22,
                                    "delivery time [days]": 5,
                                    "data source": "https://www.bricklink.com/v2/catalog/catalogitem.page?P=48989&name=Technic,%20Pin%20Connector%20Perpendicular%203L%20with%204%20Pins&category=%5BTechnic,%20Connector%5D#T=S&O={%22iconly%22:0}",
                                    "dimension [studs]": "3 x 3 x 1",
                                    "color": "red"
                                },
                                "layer": "kpi-COMPONENT"
                            }
                        },
                        {
                            "component": {
                                "uuid": "kpi-e75973c0-d9a8-44fe-9f1c-0792be5452df",
                                "properties": {
                                    "label": "front left pin",
                                    "item number": 3673,
                                    "item description": "Technic, Pin without Friction Ridges",
                                    "category": "frame",
                                    "price [Euro]": 0.01,
                                    "mass [g]": 0.16,
                                    "delivery time [days]": 3,
                                    "data source": "https://www.bricklink.com/v2/catalog/catalogitem.page?P=3673&name=Technic,%20Pin%20without%20Friction%20Ridges&category=%5BTechnic,%20Pin%5D#T=S&O={%22iconly%22:0}",
                                    "dimension [studs]": 1,
                                    "color": "grey"
                                },
                                "layer": "kpi-COMPONENT"
                            }
                        },
                        {
                            "component": {
                                "uuid": "kpi-e9a09b07-930c-44af-aff7-8fa195f5836c",
                                "properties": {
                                    "label": "front left pin",
                                    "item number": 3673,
                                    "item description": "Technic, Pin without Friction Ridges",
                                    "category": "frame",
                                    "price [Euro]": 0.01,
                                    "mass [g]": 0.16,
                                    "delivery time [days]": 3,
                                    "data source": "https://www.bricklink.com/v2/catalog/catalogitem.page?P=3673&name=Technic,%20Pin%20without%20Friction%20Ridges&category=%5BTechnic,%20Pin%5D#T=S&O={%22iconly%22:0}",
                                    "dimension [studs]": 1,
                                    "color": "grey"
                                },
                                "layer": "kpi-COMPONENT"
                            }
                        },
                        {
                            "component": {
                                "uuid": "kpi-5bf51445-c215-4e5d-a3d3-5cd76a0809d4",
                                "properties": {
                                    "label": "back left pin",
                                    "item number": 3673,
                                    "item description": "Technic, Pin without Friction Ridges",
                                    "category": "frame",
                                    "price [Euro]": 0.01,
                                    "mass [g]": 0.16,
                                    "delivery time [days]": 3,
                                    "data source": "https://www.bricklink.com/v2/catalog/catalogitem.page?P=3673&name=Technic,%20Pin%20without%20Friction%20Ridges&category=%5BTechnic,%20Pin%5D#T=S&O={%22iconly%22:0}",
                                    "dimension [studs]": 1,
                                    "color": "grey"
                                },
                                "layer": "kpi-COMPONENT"
                            }
                        },
                        {
                            "component": {
                                "uuid": "kpi-2f46d858-5f15-4be0-893a-09884a1aff93",
                                "properties": {
                                    "label": "back right pin",
                                    "item number": 3673,
                                    "item description": "Technic, Pin without Friction Ridges",
                                    "category": "frame",
                                    "price [Euro]": 0.01,
                                    "mass [g]": 0.16,
                                    "delivery time [days]": 3,
                                    "data source": "https://www.bricklink.com/v2/catalog/catalogitem.page?P=3673&name=Technic,%20Pin%20without%20Friction%20Ridges&category=%5BTechnic,%20Pin%5D#T=S&O={%22iconly%22:0}",
                                    "dimension [studs]": 1,
                                    "color": "grey"
                                },
                                "layer": "kpi-COMPONENT"
                            }
                        }
                    ],
                    "assemblies": []
                }
            },
            {
                "assembly": {
                    "uuid": "kpi-cbf3293e-c4e0-4c0a-99e5-79f734e6ed4a",
                    "properties": {
                        "label": "drivetrain subassembly",
                        "assembly_method": "stick together like lego blocks"
                    },
                    "layer": "kpi-SUBASSEMBLY",
                    "components": [
                        {
                            "component": {
                                "uuid": "kpi-489c4dda-a415-4657-83ce-1e4484457eca",
                                "properties": {
                                    "label": "main motor",
                                    "item number": "8883-1",
                                    "item description": "Power Functions M-Motor",
                                    "category": "motor",
                                    "related items": "8881, 8878, 45517, 88000",
                                    "idle current [mA]": 65,
                                    "idle speed [rev per min]": 405,
                                    "locking torque [Ncm]": 11,
                                    "price [Euro]": 20,
                                    "mass [g]": 35.0,
                                    "delivery time [days]": 5,
                                    "data source": "https://www.bricklink.com/v2/catalog/catalogitem.page?S=8883-1&name=Power%20Functions%20M-Motor&category=%5BPower%20Functions%5D#T=S&O={%22iconly%22:0}",
                                    "compatible battery": "8881, 8878, 45517, 88000",
                                    "input voltage [V]": 9,
                                    "dimensions [cm]": "13.8 x 11.9 x 2.3",
                                    "color": "grey"
                                },
                                "layer": "kpi-COMPONENT"
                            }
                        },
                        {
                            "component": {
                                "uuid": "kpi-99987d5d-3d35-4700-a229-5e35d1052895",
                                "properties": {
                                    "label": "motor axle",
                                    "item number": 3707,
                                    "item description": "Axle 8 studs",
                                    "category": "axle",
                                    "price [Euro]": 0.01,
                                    "mass [g]": 1.18,
                                    "delivery time [days]": 3,
                                    "data source": "https://www.bricklink.com/v2/catalog/catalogitem.page?P=3707#T=S&O={%22iconly%22:0}",
                                    "dimension [studs]": 8,
                                    "color": "grey"
                                },
                                "layer": "kpi-COMPONENT"
                            }
                        },
                        {
                            "component": {
                                "uuid": "kpi-5c6cb9ac-2efd-41a2-9fb8-795688880753",
                                "properties": {
                                    "label": "worm gear",
                                    "item number": 4716,
                                    "item description": "Gear Worm Screw",
                                    "category": "gear",
                                    "price [Euro]": 0.54,
                                    "mass [g]": 0.6,
                                    "delivery time [days]": 12,
                                    "data source": "https://www.bricklink.com/v2/catalog/catalogitem.page?P=4716#T=C",
                                    "color": "grey"
                                },
                                "layer": "kpi-COMPONENT"
                            }
                        },
                        {
                            "component": {
                                "uuid": "kpi-4686532a-5511-4306-9e04-c3a45efb00f0",
                                "properties": {
                                    "label": "tooth gear",
                                    "item number": 3648,
                                    "item description": "Gear 24 Tooth",
                                    "category": "gear",
                                    "price [Euro]": 0.32,
                                    "mass [g]": 1.17,
                                    "delivery time [days]": 11,
                                    "data source": "https://www.bricklink.com/v2/catalog/catalogitem.page?P=3648#T=C",
                                    "color": "grey"
                                },
                                "layer": "kpi-COMPONENT"
                            }
                        },
                        {
                            "component": {
                                "uuid": "kpi-4b09f3c7-05cd-4eb6-9692-5e221d51c214",
                                "properties": {
                                    "label": "front axle",
                                    "item number": 60485,
                                    "item description": "Axle 9 studs",
                                    "category": "axle",
                                    "price [Euro]": 0.01,
                                    "mass [g]": 1.3,
                                    "delivery time [days]": 7,
                                    "data source": "https://www.bricklink.com/v2/catalog/catalogitem.page?P=60485#T=S&O={%22iconly%22:0}",
                                    "dimension [studs]": 9,
                                    "color": "grey"
                                },
                                "layer": "kpi-COMPONENT"
                            }
                        },
                        {
                            "component": {
                                "uuid": "kpi-8367ce5c-592d-412b-be04-72591920bdb4",
                                "properties": {
                                    "label": "front left wheel",
                                    "item number": "3482c01",
                                    "item description": "wheel 24",
                                    "category": "wheel",
                                    "related items": 3483,
                                    "price [Euro]": 0.01,
                                    "mass [g]": 3.0,
                                    "delivery time [days]": 5,
                                    "data source": "https://www.bricklink.com/v2/catalog/catalogitem.page?P=3482c01#T=C",
                                    "diameter [mm]": 24.0,
                                    "color": "grey"
                                },
                                "layer": "kpi-COMPONENT"
                            }
                        },
                        {
                            "component": {
                                "uuid": "kpi-1ef8bdc8-f0a9-46b0-ab5f-567a3a8da644",
                                "properties": {
                                    "label": "front right wheel",
                                    "item number": "3482c01",
                                    "item description": "wheel 24",
                                    "category": "wheel",
                                    "related items": 3483,
                                    "price [Euro]": 0.01,
                                    "mass [g]": 3.0,
                                    "delivery time [days]": 5,
                                    "data source": "https://www.bricklink.com/v2/catalog/catalogitem.page?P=3482c01#T=C",
                                    "diameter [mm]": 24.0,
                                    "color": "grey"
                                },
                                "layer": "kpi-COMPONENT"
                            }
                        },
                        {
                            "component": {
                                "uuid": "kpi-820604bd-14de-4819-9d31-203ccefe0197",
                                "properties": {
                                    "label": "back axle",
                                    "item number": 3737,
                                    "item description": "Axle 10 studs",
                                    "category": "axle",
                                    "price [Euro]": 0.01,
                                    "mass [g]": 1.49,
                                    "delivery time [days]": 7,
                                    "data source": "https://www.bricklink.com/v2/catalog/catalogitem.page?P=3737#T=S&O={%22iconly%22:0}",
                                    "dimension [studs]": 10,
                                    "color": "grey"
                                },
                                "layer": "kpi-COMPONENT"
                            }
                        },
                        {
                            "component": {
                                "uuid": "kpi-91e83160-255a-4b50-a33f-96428ffd6d18",
                                "properties": {
                                    "label": "back left wheel",
                                    "item number": "56904c02",
                                    "item description": "wheel 43,2",
                                    "category": "wheel",
                                    "related items": 30699,
                                    "price [Euro]": 0.11,
                                    "mass [g]": 13.0,
                                    "delivery time [days]": 5,
                                    "data source": "https://www.bricklink.com/v2/catalog/catalogitem.page?P=56904c02#T=C",
                                    "diameter [mm]": 43.2,
                                    "color": "grey"
                                },
                                "layer": "kpi-COMPONENT"
                            }
                        },
                        {
                            "component": {
                                "uuid": "kpi-e193b947-e995-4915-bdbf-41f86d6820a5",
                                "properties": {
                                    "label": "front right wheel",
                                    "item number": "56904c02",
                                    "item description": "wheel 43,2",
                                    "category": "wheel",
                                    "related items": 30699,
                                    "price [Euro]": 0.11,
                                    "mass [g]": 13.0,
                                    "delivery time [days]": 5,
                                    "data source": "https://www.bricklink.com/v2/catalog/catalogitem.page?P=56904c02#T=C",
                                    "diameter [mm]": 43.2,
                                    "color": "grey"
                                },
                                "layer": "kpi-COMPONENT"
                            }
                        }
                    ],
                    "assemblies": []
                }
            }
        ]
    }
}