{
    "3647":{
        "item number":3647,
        "item description":"Gear 8 Tooth",
        "category":"gear",
        "price [Euro]":0.14,
        "mass [g]":0.16,
        "delivery time [days]":11,
        "data source":"https://www.bricklink.com/v2/catalog/catalogitem.page?P=3647#T=C"
    },
    "94925":{
        "item number":94925,
        "item description":"Gear 16 Tooth",
        "category":"gear",
        "price [Euro]":0.2,
        "mass [g]":0.7,
        "delivery time [days]":12,
        "data source":"https://www.bricklink.com/v2/catalog/catalogitem.page?P=94925#T=C"
    },
    "32269":{
        "item number":32269,
        "item description":"Gear 20 Tooth",
        "category":"gear",
        "price [Euro]":0.36,
        "mass [g]":1.4,
        "delivery time [days]":13,
        "data source":"https://www.bricklink.com/v2/catalog/catalogitem.page?P=32269#T=C"
    },
    "3648":{
        "item number":3648,
        "item description":"Gear 24 Tooth",
        "category":"gear",
        "price [Euro]":0.32,
        "mass [g]":1.17,
        "delivery time [days]":11,
        "data source":"https://www.bricklink.com/v2/catalog/catalogitem.page?P=3648#T=C"
    },
    "3650":{
        "item number":3650,
        "item description":"Gear 24 Tooth Crown",
        "category":"gear",
        "price [Euro]":0.09,
        "mass [g]":1.03,
        "delivery time [days]":13,
        "data source":"https://www.bricklink.com/v2/catalog/catalogitem.page?P=3650#T=C"
    },
    "3649":{
        "item number":3649,
        "item description":"Gear 40 Tooth",
        "category":"gear",
        "price [Euro]":0.81,
        "mass [g]":3.76,
        "delivery time [days]":11,
        "data source":"https://www.bricklink.com/v2/catalog/catalogitem.page?P=3649#T=C"
    },
    "32498":{
        "item number":32498,
        "item description":"Gear 36 Tooth",
        "category":"gear",
        "price [Euro]":0.88,
        "mass [g]":3.5,
        "delivery time [days]":12,
        "data source":"https://www.bricklink.com/v2/catalog/catalogitem.page?P=32498#T=C"
    },
    "6588":{
        "item number":6588,
        "item description":"Gear Worm Gearbox",
        "category":"gear",
        "price [Euro]":1.63,
        "mass [g]":4.5,
        "delivery time [days]":11,
        "data source":"https://www.bricklink.com/v2/catalog/catalogitem.page?P=6588#T=C"
    },
    "4716":{
        "item number":4716,
        "item description":"Gear Worm Screw",
        "category":"gear",
        "price [Euro]":0.54,
        "mass [g]":0.6,
        "delivery time [days]":12,
        "data source":"https://www.bricklink.com/v2/catalog/catalogitem.page?P=4716#T=C"
    }
}