{
	"JSON": {
		"ID": "1eeaed1b-c159-6ebd-9689-a46b77b541ad",
		"label": "probe_handy",
		"comment": "UUID6 is used"
	},
	"probe": {
		"name": "handy",
		"type": "7 pro",
		"manufacturer": "OnePlus"
	}
}
