{
	"JSON": {
		"ID": "1eeaed25-f545-6d62-b626-c64f4de11bb9",
		"label": "probe_Ukulele",
		"comment": "UUID6 is used"
	},
	"probe": {
		"name": "Ukulele",
		"type": "Sopran",
		"manufacturer": "Mugig"
	}
}
