{
	"JSON": {
		"ID": "1ee847be-fddd-6ee4-892a-68c4555b0981",
		"label": "",
		"comment": "UUID6 is used"
	},
	"sensor": {
		"name": "accelerometer",
		"type": "ADXL345",
		"range": {
			"config_1": {
				"min": -2,
				"max": 2,
				"units": "standard_gravity"
			},
			"config_2": {
				"min": -4,
				"max": 4,
				"units": "standard_gravity"
			},
			"config_3": {
				"min": -8,
				"max": 8,
				"units": "standard_gravity"
			},
			"config_4": {
				"min": -16,
				"max": 16,
				"units": "standard_gravity"
			}
		},
		"frequency": {
			"config_1": {
				"value": 3200,
				"units": "Hertz"
			},
			"config_2": {
				"value": 1600,
				"units": "Hertz"
			},
			"config_3": {
				"value": 800,
				"units": "Hertz"
			},
			"config_4": {
				"value": 400,
				"units": "Hertz"
			},
			"config_5": {
				"value": 200,
				"units": "Hertz"
			},
			"config_6": {
				"value": 100,
				"units": "Hertz"
			},
			"config_7": {
				"value": 50,
				"units": "Hertz"
			},
			"config_8": {
				"value": 25,
				"units": "Hertz"
			},
			"config_9": {
				"value": 12.5,
				"units": "Hertz"
			},
			"config_10": {
				"value": 6.25,
				"units": "Hertz"
			},
			"config_11": {
				"value": 3.13,
				"units": "Hertz"
			},
			"config_12": {
				"value": 1.56,
				"units": "Hertz"
			},
			"config_13": {
				"value": 0.78,
				"units": "Hertz"
			},
			"config_14": {
				"value": 0.39,
				"units": "Hertz"
			},
			"config_15": {
				"value": 0.20,
				"units": "Hertz"
			},
			"config_16": {
				"value": 0.10,
				"units": "Hertz"
			}
		},
		"resolution": {
			"value": 4,
			"unit": "milli_standard_gravity_per_LSB",
			"comment": "LSB = least significant bit)"
		},
		"0g-offset": {
			"x-axes" : {
				"min": -150,
				"max": 150,
				"units": "milli_standard_gravity"
			},
			"y-axes" : {
				"min": -150,
				"max": 150,
				"units": "milli_standard_gravity"
			},
			"z-axes" : {
				"min": -250,
				"max": 250,
				"units": "milli_standard_gravity"
			}
		},
		"comment": ""
	}
}
