{
	"JSON": {
		"ID": "1ee80962-28b1-6c2d-bd36-e631200fd8d2",
		"label": "setup_newton",
		"comment": "UUID6 is used"
	},
    "comment": "setup for the Newton's law of cooling experiment at home",
	"setup": {
		"1ee8095a-1dce-6611-8348-72e1635f94ae": {
            "type": "group_info",
			"name": "group_info",
            "comment": ""
        },
		"1ee8095b-4755-628d-9bd0-d960aed06dbb": {
            "type": "instrument",
			"name": "raspberry_pi",
            "comment": ""
        },
		"1ee80933-b1de-6061-95bf-7315bfd3f80f": {
            "type": "sensor",
			"name": " sensor_temperature_cup",
            "comment": ""
        },
		"1ee80935-9058-68c6-9ead-cef58130afc6": {
            "type": "sensor",
			"name": "sensor_temperature_environment",
            "comment": ""
        },
		"1ee8095f-8a82-65d0-8736-54f944155861": {
            "type": "probe",
			"name": "probe_newton",
            "comment": ""
        }
	}
}