{
	"JSON": {
		"ID": "1ee80960-688b-6540-aeb8-6c8527317f99",
		"label": "setup_heat_capacity",
		"comment": "UUID6 is used"
	},
    "comment": "here you can write down something important about this setup file",
    "info": "List below ALL components, you used in your experiment. By using the UUID there is no possibility to mix something up.",
	"setup": {
		"1ee8095a-1dce-6611-8348-72e1635f94ae": {
            "type": "group_info",
			"name": "group_info",
            "comment": ""
        },
		"1ee8095b-4755-628d-9bd0-d960aed06dbb": {
            "type": "instrument",
			"name": "raspberry_pi",
            "comment": ""
        },
		"1ee80933-b1de-6061-95bf-7315bfd3f80f": {
            "type": "sensor",
			"name": "sensor_temperature_hot_cup",
            "comment": ""
        },
		"1ee80935-9058-68c6-9ead-cef58130afc6": {
            "type": "sensor",
			"name": "sensor_temperature_cold_cup",
            "comment": ""
        },
		"1ee8095e-13f9-61ae-bfe8-e48785a30f82": {
            "type": "probe",
			"name": "probe_heat_capacity",
            "comment": ""
        }
	}
}