Block	B	Bx	By	Bz	Units	Temperature	Timestamp	Serial No.	Comment
0	0.000176	0.000125	-0.000106	-6.360034E-5	T	29357	2017.09.19 14:01:20.433433882	0000678	
0	0.000196	0.000154	-0.000116	-3.479630E-5	T	29357	2017.09.19 14:01:20.443433882	0000678	
0	0.000186	0.000135	-0.000120	-4.362454E-5	T	29357	2017.09.19 14:01:20.453433882	0000678	
0	0.000184	0.000144	-0.000111	-2.473600E-5	T	29357	2017.09.19 14:01:20.463433882	0000678	
0	0.000164	0.000116	-9.665087E-5	-6.356438E-5	T	29357	2017.09.19 14:01:20.473433882	0000678	
0	0.000174	0.000130	-0.000111	-2.962175E-5	T	29357	2017.09.19 14:01:20.483433882	0000678	
0	0.000172	0.000125	-0.000102	-5.861715E-5	T	29357	2017.09.19 14:01:20.493433882	0000678	
0	0.000186	0.000144	-0.000106	-4.875575E-5	T	29357	2017.09.19 14:01:20.503433882	0000678	
0	0.000223	0.000173	-0.000116	-7.794928E-5	T	29357	2017.09.19 14:01:20.513433882	0000678	
0	0.000179	0.000140	-9.689571E-5	-5.376031E-5	T	29357	2017.09.19 14:01:20.523433882	0000678	
1	0.000204	0.000163	-9.724618E-5	-7.294688E-5	T	29365	2017.09.19 14:01:20.633521382	0000678	
1	0.000202	0.000168	-0.000102	-4.396807E-5	T	29365	2017.09.19 14:01:20.643521382	0000678	
1	0.000181	0.000135	-0.000116	-2.964173E-5	T	29365	2017.09.19 14:01:20.653521382	0000678	
1	0.000191	0.000125	-0.000130	-6.350074E-5	T	29365	2017.09.19 14:01:20.663521382	0000678	
1	0.000193	0.000154	-0.000111	-3.481705E-5	T	29365	2017.09.19 14:01:20.673521382	0000678	
1	0.000184	0.000155	-8.704269E-5	-4.891606E-5	T	29365	2017.09.19 14:01:20.683521382	0000678	
1	0.000172	0.000141	-8.687623E-5	-4.880202E-5	T	29365	2017.09.19 14:01:20.693521382	0000678	
1	0.000180	0.000144	-9.194366E-5	-5.381364E-5	T	29365	2017.09.19 14:01:20.703521382	0000678	
1	0.000177	0.000121	-0.000116	-5.852647E-5	T	29365	2017.09.19 14:01:20.713521382	0000678	
1	0.000195	0.000154	-9.711891E-5	-6.787377E-5	T	29365	2017.09.19 14:01:20.723521382	0000678	
2	0.000192	0.000164	-9.211283E-5	-3.996901E-5	T	29348	2017.09.19 14:01:20.833608882	0000678	
2	0.000191	0.000154	-0.000106	-3.483780E-5	T	29348	2017.09.19 14:01:20.843608882	0000678	
2	0.000192	0.000154	-0.000106	-3.983759E-5	T	29348	2017.09.19 14:01:20.853608882	0000678	
2	0.000193	0.000159	-0.000102	-3.989492E-5	T	29348	2017.09.19 14:01:20.863608882	0000678	
2	0.000210	0.000163	-0.000125	-4.383189E-5	T	29348	2017.09.19 14:01:20.873608882	0000678	
2	0.000200	0.000154	-0.000116	-5.379550E-5	T	29348	2017.09.19 14:01:20.883608882	0000678	
2	0.000172	0.000141	-8.687623E-5	-4.880202E-5	T	29348	2017.09.19 14:01:20.893608882	0000678	
2	0.000168	0.000121	-0.000111	-3.454822E-5	T	29348	2017.09.19 14:01:20.903608882	0000678	
2	0.000190	0.000149	-9.208012E-5	-7.285358E-5	T	29348	2017.09.19 14:01:20.913608882	0000678	
2	0.000205	0.000163	-0.000106	-6.390990E-5	T	29348	2017.09.19 14:01:20.923608882	0000678	
3	0.000195	0.000149	-0.000111	-5.877531E-5	T	29347	2017.09.19 14:01:21.033696382	0000678	
3	0.000193	0.000144	-0.000116	-5.371404E-5	T	29347	2017.09.19 14:01:21.043696382	0000678	
3	0.000184	0.000144	-0.000106	-4.375596E-5	T	29347	2017.09.19 14:01:21.053696382	0000678	
3	0.000187	0.000144	-0.000111	-4.373521E-5	T	29347	2017.09.19 14:01:21.063696382	0000678	
3	0.000184	0.000140	-0.000106	-5.372296E-5	T	29347	2017.09.19 14:01:21.073696382	0000678	
3	0.000208	0.000168	-0.000106	-5.895084E-5	T	29347	2017.09.19 14:01:21.083696382	0000678	
3	0.000194	0.000159	-0.000102	-4.389475E-5	T	29347	2017.09.19 14:01:21.093696382	0000678	
3	0.000205	0.000173	-0.000102	-4.000897E-5	T	29347	2017.09.19 14:01:21.103696382	0000678	
3	0.000203	0.000159	-0.000120	-3.982022E-5	T	29347	2017.09.19 14:01:21.113696382	0000678	
3	0.000206	0.000163	-0.000120	-3.485302E-5	T	29347	2017.09.19 14:01:21.123696382	0000678	
4	0.000184	0.000140	-0.000111	-4.370262E-5	T	29352	2017.09.19 14:01:21.233783882	0000678	
4	0.000199	0.000159	-0.000116	-2.983724E-5	T	29352	2017.09.19 14:01:21.243783882	0000678	
4	0.000190	0.000140	-0.000116	-5.368146E-5	T	29352	2017.09.19 14:01:21.253783882	0000678	
4	0.000182	0.000125	-0.000116	-6.355884E-5	T	29352	2017.09.19 14:01:21.263783882	0000678	
4	0.000185	0.000149	-9.698245E-5	-4.883383E-5	T	29352	2017.09.19 14:01:21.273783882	0000678	
4	0.000185	0.000155	-9.202203E-5	-4.389552E-5	T	29352	2017.09.19 14:01:21.283783882	0000678	
4	0.000229	0.000192	-0.000112	-5.412581E-5	T	29352	2017.09.19 14:01:21.293783882	0000678	
4	0.000182	0.000155	-9.196529E-5	-2.989611E-5	T	29352	2017.09.19 14:01:21.303783882	0000678	
4	0.000214	0.000173	-0.000116	-4.895049E-5	T	29352	2017.09.19 14:01:21.313783882	0000678	
4	0.000176	0.000141	-0.000102	-2.974056E-5	T	29352	2017.09.19 14:01:21.323783882	0000678	
5	0.000176	0.000140	-9.189610E-5	-5.378106E-5	T	29372	2017.09.19 14:01:21.433871382	0000678	
5	0.000196	0.000154	-0.000111	-4.881646E-5	T	29372	2017.09.19 14:01:21.443871382	0000678	
5	0.000169	0.000125	-0.000106	-3.960135E-5	T	29372	2017.09.19 14:01:21.453871382	0000678	
5	0.000201	0.000149	-0.000116	-6.775419E-5	T	29372	2017.09.19 14:01:21.463871382	0000678	
5	0.000184	0.000150	-0.000106	-2.079765E-5	T	29372	2017.09.19 14:01:21.473871382	0000678	
5	0.000177	0.000125	-0.000111	-5.857980E-5	T	29372	2017.09.19 14:01:21.483871382	0000678	
5	0.000186	0.000144	-0.000111	-3.973538E-5	T	29372	2017.09.19 14:01:21.493871382	0000678	
5	0.000201	0.000174	-8.330945E-5	-5.908703E-5	T	29372	2017.09.19 14:01:21.503871382	0000678	
5	0.000206	0.000159	-0.000116	-5.883603E-5	T	29372	2017.09.19 14:01:21.513871382	0000678	
5	0.000205	0.000174	-0.000106	-2.099316E-5	T	29372	2017.09.19 14:01:21.523871382	0000678	
6	0.000204	0.000168	-0.000102	-5.396765E-5	T	29325	2017.09.19 14:01:21.633958882	0000678	
6	0.000211	0.000163	-0.000116	-6.786824E-5	T	29325	2017.09.19 14:01:21.643958882	0000678	
6	0.000181	0.000150	-9.196258E-5	-4.385479E-5	T	29325	2017.09.19 14:01:21.653958882	0000678	
6	0.000180	0.000140	-0.000106	-3.972354E-5	T	29325	2017.09.19 14:01:21.663958882	0000678	
6	0.000202	0.000168	-0.000102	-4.396807E-5	T	29325	2017.09.19 14:01:21.673958882	0000678	
6	0.000162	0.000102	-0.000115	-4.837211E-5	T	29325	2017.09.19 14:01:21.683958882	0000678	
6	0.000174	0.000131	-0.000116	-6.022083E-7	T	29325	2017.09.19 14:01:21.693958882	0000678	
6	0.000176	0.000130	-0.000116	-2.460121E-5	T	29325	2017.09.19 14:01:21.703958882	0000678	
6	0.000174	0.000130	-0.000111	-2.962175E-5	T	29325	2017.09.19 14:01:21.713958882	0000678	
6	0.000179	0.000121	-0.000106	-7.756717E-5	T	29325	2017.09.19 14:01:21.723958882	0000678	
7	0.000173	0.000111	-0.000111	-7.246517E-5	T	29368	2017.09.19 14:01:21.834046382	0000678	
7	0.000173	0.000116	-0.000125	-2.944960E-5	T	29368	2017.09.19 14:01:21.844046382	0000678	
7	0.000199	0.000159	-0.000106	-5.387774E-5	T	29368	2017.09.19 14:01:21.854046382	0000678	
7	0.000176	0.000130	-0.000106	-5.364149E-5	T	29368	2017.09.19 14:01:21.864046382	0000678	
7	0.000173	0.000145	-8.688731E-5	-3.983498E-5	T	29368	2017.09.19 14:01:21.874046382	0000678	
7	0.000196	0.000163	-9.714891E-5	-4.894788E-5	T	29368	2017.09.19 14:01:21.884046382	0000678	
7	0.000191	0.000149	-0.000106	-5.379627E-5	T	29368	2017.09.19 14:01:21.894046382	0000678	
7	0.000190	0.000140	-0.000111	-6.370179E-5	T	29368	2017.09.19 14:01:21.904046382	0000678	
7	0.000232	0.000196	-0.000117	-4.013823E-5	T	29368	2017.09.19 14:01:21.914046382	0000678	
7	0.000184	0.000155	-8.704269E-5	-4.891606E-5	T	29368	2017.09.19 14:01:21.924046382	0000678	
8	0.000203	0.000154	-0.000125	-4.375857E-5	T	29357	2017.09.19 14:01:22.034133882	0000678	
8	0.000209	0.000173	-0.000111	-3.497183E-5	T	29357	2017.09.19 14:01:22.044133882	0000678	
8	0.000187	0.000140	-0.000106	-6.372254E-5	T	29357	2017.09.19 14:01:22.054133882	0000678	
8	0.000200	0.000159	-0.000102	-6.389392E-5	T	29357	2017.09.19 14:01:22.064133882	0000678	
8	0.000191	0.000140	-0.000116	-5.868125E-5	T	29357	2017.09.19 14:01:22.074133882	0000678	
8	0.000165	0.000131	-9.173667E-5	-4.370001E-5	T	29357	2017.09.19 14:01:22.084133882	0000678	
8	0.000191	0.000155	-0.000111	-2.081763E-5	T	29357	2017.09.19 14:01:22.094133882	0000678	
8	0.000177	0.000150	-8.296329E-5	-4.389214E-5	T	29357	2017.09.19 14:01:22.104133882	0000678	
8	0.000160	0.000126	-9.166101E-5	-3.965945E-5	T	29357	2017.09.19 14:01:22.114133882	0000678	
8	0.000209	0.000163	-0.000111	-6.788899E-5	T	29357	2017.09.19 14:01:22.124133882	0000678	
9	0.000174	0.000135	-0.000102	-3.969941E-5	T	29363	2017.09.19 14:01:22.234221382	0000678	
9	0.000174	0.000141	-9.681870E-5	-3.476110E-5	T	29363	2017.09.19 14:01:22.244221382	0000678	
9	0.000180	0.000145	-0.000102	-3.477294E-5	T	29363	2017.09.19 14:01:22.254221382	0000678	
9	0.000191	0.000135	-0.000111	-7.766047E-5	T	29363	2017.09.19 14:01:22.264221382	0000678	
9	0.000198	0.000154	-0.000120	-2.977991E-5	T	29363	2017.09.19 14:01:22.274221382	0000678	
9	0.000185	0.000130	-0.000102	-8.265688E-5	T	29363	2017.09.19 14:01:22.284221382	0000678	
9	0.000176	0.000135	-0.000106	-3.968281E-5	T	29363	2017.09.19 14:01:22.294221382	0000678	
9	0.000198	0.000144	-0.000111	-7.773379E-5	T	29363	2017.09.19 14:01:22.304221382	0000678	
9	0.000206	0.000149	-0.000116	-8.275356E-5	T	29363	2017.09.19 14:01:22.314221382	0000678	
9	0.000217	0.000182	-0.000111	-4.004494E-5	T	29363	2017.09.19 14:01:22.324221382	0000678	
10	0.000197	0.000159	-0.000102	-5.389434E-5	T	29346	2017.09.19 14:01:22.434308882	0000678	
10	0.000170	0.000136	-0.000102	-5.700831E-6	T	29346	2017.09.19 14:01:22.444308882	0000678	
10	0.000172	0.000130	-0.000102	-4.865830E-5	T	29346	2017.09.19 14:01:22.454308882	0000678	
10	0.000171	0.000125	-0.000106	-4.860097E-5	T	29346	2017.09.19 14:01:22.464308882	0000678	
10	0.000167	0.000121	-0.000111	-2.954843E-5	T	29346	2017.09.19 14:01:22.474308882	0000678	
10	0.000180	0.000140	-0.000102	-4.873977E-5	T	29346	2017.09.19 14:01:22.484308882	0000678	
10	0.000196	0.000154	-0.000106	-5.883680E-5	T	29346	2017.09.19 14:01:22.494308882	0000678	
10	0.000168	0.000136	-9.671872E-5	-2.472079E-5	T	29346	2017.09.19 14:01:22.504308882	0000678	
10	0.000186	0.000144	-0.000102	-5.877193E-5	T	29346	2017.09.19 14:01:22.514308882	0000678	
10	0.000202	0.000159	-0.000111	-5.385699E-5	T	29346	2017.09.19 14:01:22.524308882	0000678	
11	0.000187	0.000135	-0.000125	-3.460417E-5	T	29345	2017.09.19 14:01:22.634396382	0000678	
11	0.000200	0.000159	-0.000106	-5.887753E-5	T	29345	2017.09.19 14:01:22.644396382	0000678	
11	0.000207	0.000159	-0.000111	-7.285619E-5	T	29345	2017.09.19 14:01:22.654396382	0000678	
11	0.000200	0.000149	-0.000111	-7.277473E-5	T	29345	2017.09.19 14:01:22.664396382	0000678	
11	0.000169	0.000131	-0.000102	-3.465889E-5	T	29345	2017.09.19 14:01:22.674396382	0000678	
11	0.000187	0.000150	-0.000111	-1.177728E-5	T	29345	2017.09.19 14:01:22.684396382	0000678	
11	0.000191	0.000160	-0.000102	-2.089572E-5	T	29345	2017.09.19 14:01:22.694396382	0000678	
11	0.000197	0.000163	-0.000102	-3.992751E-5	T	29345	2017.09.19 14:01:22.704396382	0000678	
11	0.000203	0.000159	-0.000102	-7.289354E-5	T	29345	2017.09.19 14:01:22.714396382	0000678	
11	0.000161	0.000136	-7.778101E-5	-3.979901E-5	T	29345	2017.09.19 14:01:22.724396382	0000678	
12	0.000228	0.000182	-0.000130	-4.396592E-5	T	29344	2017.09.19 14:01:22.834483882	0000678	
12	0.000183	0.000140	-0.000111	-3.970279E-5	T	29344	2017.09.19 14:01:22.844483882	0000678	
12	0.000214	0.000177	-0.000106	-5.402437E-5	T	29344	2017.09.19 14:01:22.854483882	0000678	
12	0.000188	0.000149	-0.000106	-4.379669E-5	T	29344	2017.09.19 14:01:22.864483882	0000678	
12	0.000193	0.000159	-9.214228E-5	-5.893563E-5	T	29344	2017.09.19 14:01:22.874483882	0000678	
12	0.000180	0.000135	-0.000111	-4.366189E-5	T	29344	2017.09.19 14:01:22.884483882	0000678	
12	0.000183	0.000125	-0.000125	-4.852212E-5	T	29344	2017.09.19 14:01:22.894483882	0000678	
12	0.000199	0.000135	-0.000120	-8.262291E-5	T	29344	2017.09.19 14:01:22.904483882	0000678	
12	0.000193	0.000149	-0.000120	-2.473938E-5	T	29344	2017.09.19 14:01:22.914483882	0000678	
12	0.000187	0.000149	-0.000102	-4.881308E-5	T	29344	2017.09.19 14:01:22.924483882	0000678	
13	0.000177	0.000121	-0.000111	-6.754684E-5	T	29358	2017.09.19 14:01:23.034571382	0000678	
13	0.000184	0.000144	-0.000106	-4.375596E-5	T	29358	2017.09.19 14:01:23.044571382	0000678	
13	0.000185	0.000135	-0.000106	-6.768164E-5	T	29358	2017.09.19 14:01:23.054571382	0000678	
13	0.000182	0.000125	-0.000116	-6.355884E-5	T	29358	2017.09.19 14:01:23.064571382	0000678	
13	0.000205	0.000149	-0.000111	-8.677414E-5	T	29358	2017.09.19 14:01:23.074571382	0000678	
13	0.000187	0.000144	-0.000116	-2.971504E-5	T	29358	2017.09.19 14:01:23.084571382	0000678	
13	0.000202	0.000163	-0.000106	-5.391032E-5	T	29358	2017.09.19 14:01:23.094571382	0000678	
13	0.000196	0.000163	-9.714891E-5	-4.894788E-5	T	29358	2017.09.19 14:01:23.104571382	0000678	
13	0.000194	0.000164	-0.000102	-1.592851E-5	T	29358	2017.09.19 14:01:23.114571382	0000678	
13	0.000178	0.000145	-9.688652E-5	-3.979348E-5	T	29358	2017.09.19 14:01:23.124571382	0000678	
14	0.000186	0.000140	-0.000116	-3.968204E-5	T	29365	2017.09.19 14:01:23.234658882	0000678	
14	0.000200	0.000159	-0.000102	-6.389392E-5	T	29365	2017.09.19 14:01:23.244658882	0000678	
14	0.000176	0.000130	-9.683355E-5	-6.767826E-5	T	29365	2017.09.19 14:01:23.254658882	0000678	
14	0.000203	0.000169	-0.000111	-2.093168E-5	T	29365	2017.09.19 14:01:23.264658882	0000678	
14	0.000166	0.000125	-9.669709E-5	-4.863832E-5	T	29365	2017.09.19 14:01:23.274658882	0000678	
14	0.000188	0.000155	-0.000106	-5.839011E-6	T	29365	2017.09.19 14:01:23.284658882	0000678	
14	0.000193	0.000164	-9.709217E-5	-3.494847E-5	T	29365	2017.09.19 14:01:23.294658882	0000678	
14	0.000185	0.000144	-9.698380E-5	-6.379247E-5	T	29365	2017.09.19 14:01:23.304658882	0000678	
14	0.000193	0.000154	-0.000102	-5.385361E-5	T	29365	2017.09.19 14:01:23.314658882	0000678	
14	0.000168	0.000136	-9.177991E-5	-3.974091E-5	T	29365	2017.09.19 14:01:23.324658882	0000678	
15	0.000162	0.000117	-0.000110	-2.050807E-5	T	29366	2017.09.19 14:01:23.434746382	0000678	
15	0.000201	0.000174	-9.224794E-5	-4.405030E-5	T	29366	2017.09.19 14:01:23.444746382	0000678	
15	0.000186	0.000144	-0.000102	-5.877193E-5	T	29366	2017.09.19 14:01:23.454746382	0000678	
15	0.000183	0.000135	-0.000116	-4.364114E-5	T	29366	2017.09.19 14:01:23.464746382	0000678	
15	0.000191	0.000149	-0.000106	-5.379627E-5	T	29366	2017.09.19 14:01:23.474746382	0000678	
15	0.000177	0.000130	-0.000111	-4.362116E-5	T	29366	2017.09.19 14:01:23.484746382	0000678	
15	0.000200	0.000159	-0.000111	-4.885720E-5	T	29366	2017.09.19 14:01:23.494746382	0000678	
15	0.000205	0.000163	-9.726645E-5	-7.794667E-5	T	29366	2017.09.19 14:01:23.504746382	0000678	
15	0.000175	0.000135	-0.000106	-3.468302E-5	T	29366	2017.09.19 14:01:23.514746382	0000678	
15	0.000205	0.000168	-9.726916E-5	-6.398799E-5	T	29366	2017.09.19 14:01:23.524746382	0000678	
16	0.000198	0.000159	-0.000111	-3.985757E-5	T	29350	2017.09.19 14:01:23.634833882	0000678	
16	0.000185	0.000144	-0.000102	-5.377214E-5	T	29350	2017.09.19 14:01:23.644833882	0000678	
16	0.000198	0.000149	-0.000116	-5.875456E-5	T	29350	2017.09.19 14:01:23.654833882	0000678	
16	0.000174	0.000136	-0.000106	-2.468344E-5	T	29350	2017.09.19 14:01:23.664833882	0000678	
16	0.000181	0.000150	-9.690544E-5	-2.983463E-5	T	29350	2017.09.19 14:01:23.674833882	0000678	
16	0.000202	0.000163	-0.000111	-3.989016E-5	T	29350	2017.09.19 14:01:23.684833882	0000678	
16	0.000186	0.000160	-9.200447E-5	-2.493705E-5	T	29350	2017.09.19 14:01:23.694833882	0000678	
16	0.000194	0.000140	-0.000106	-8.272174E-5	T	29350	2017.09.19 14:01:23.704833882	0000678	
16	0.000182	0.000140	-0.000111	-3.470300E-5	T	29350	2017.09.19 14:01:23.714833882	0000678	
16	0.000175	0.000130	-0.000102	-5.865788E-5	T	29350	2017.09.19 14:01:23.724833882	0000678	
17	0.000186	0.000150	-0.000111	-1.077732E-5	T	29335	2017.09.19 14:01:23.834921382	0000678	
17	0.000208	0.000173	-0.000106	-4.399220E-5	T	29335	2017.09.19 14:01:23.844921382	0000678	
17	0.000195	0.000149	-0.000111	-5.877531E-5	T	29335	2017.09.19 14:01:23.854921382	0000678	
17	0.000190	0.000140	-0.000125	-2.964511E-5	T	29335	2017.09.19 14:01:23.864921382	0000678	
17	0.000173	0.000111	-0.000111	-7.246517E-5	T	29335	2017.09.19 14:01:23.874921382	0000678	
17	0.000205	0.000163	-0.000116	-4.386924E-5	T	29335	2017.09.19 14:01:23.884921382	0000678	
17	0.000189	0.000130	-0.000130	-4.354231E-5	T	29335	2017.09.19 14:01:23.894921382	0000678	
17	0.000191	0.000144	-0.000116	-4.871425E-5	T	29335	2017.09.19 14:01:23.904921382	0000678	
17	0.000196	0.000154	-0.000106	-5.883680E-5	T	29335	2017.09.19 14:01:23.914921382	0000678	
17	0.000183	0.000135	-0.000111	-5.366147E-5	T	29335	2017.09.19 14:01:23.924921382	0000678	
18	0.000191	0.000160	-0.000102	-2.089572E-5	T	29361	2017.09.19 14:01:24.035008882	0000678	
18	0.000197	0.000154	-0.000102	-6.785302E-5	T	29361	2017.09.19 14:01:24.045008882	0000678	
18	0.000164	0.000116	-9.665087E-5	-6.356438E-5	T	29361	2017.09.19 14:01:24.055008882	0000678	
18	0.000171	0.000130	-0.000102	-4.365851E-5	T	29361	2017.09.19 14:01:24.065008882	0000678	
18	0.000208	0.000168	-0.000106	-5.895084E-5	T	29361	2017.09.19 14:01:24.075008882	0000678	
18	0.000206	0.000173	-9.728808E-5	-5.402914E-5	T	29361	2017.09.19 14:01:24.085008882	0000678	
18	0.000194	0.000159	-8.717915E-5	-6.795600E-5	T	29361	2017.09.19 14:01:24.095008882	0000678	
18	0.000199	0.000169	-9.717189E-5	-3.998899E-5	T	29361	2017.09.19 14:01:24.105008882	0000678	
18	0.000189	0.000160	-9.208148E-5	-4.393626E-5	T	29361	2017.09.19 14:01:24.115008882	0000678	
18	0.000177	0.000135	-0.000111	-2.966248E-5	T	29361	2017.09.19 14:01:24.125008882	0000678	
19	0.000185	0.000140	-0.000111	-4.870242E-5	T	29334	2017.09.19 14:01:24.235096382	0000678	
19	0.000188	0.000144	-0.000111	-4.873500E-5	T	29334	2017.09.19 14:01:24.245096382	0000678	
19	0.000199	0.000159	-0.000116	-2.983724E-5	T	29334	2017.09.19 14:01:24.255096382	0000678	
19	0.000208	0.000168	-0.000106	-5.895084E-5	T	29334	2017.09.19 14:01:24.265096382	0000678	
19	0.000184	0.000144	-0.000111	-2.973579E-5	T	29334	2017.09.19 14:01:24.275096382	0000678	
19	0.000150	0.000112	-9.149455E-5	-3.954540E-5	T	29334	2017.09.19 14:01:24.285096382	0000678	
19	0.000162	0.000111	-0.000106	-5.348671E-5	T	29334	2017.09.19 14:01:24.295096382	0000678	
19	0.000172	0.000141	-9.676196E-5	-2.076169E-5	T	29334	2017.09.19 14:01:24.305096382	0000678	
19	0.000174	0.000121	-0.000116	-4.852689E-5	T	29334	2017.09.19 14:01:24.315096382	0000678	
19	0.000176	0.000130	-0.000111	-3.962133E-5	T	29334	2017.09.19 14:01:24.325096382	0000678	
20	0.000182	0.000140	-0.000102	-5.373956E-5	T	29358	2017.09.19 14:01:24.435183882	0000678	
20	0.000188	0.000144	-0.000106	-5.875533E-5	T	29358	2017.09.19 14:01:24.445183882	0000678	
20	0.000189	0.000149	-0.000111	-3.477632E-5	T	29358	2017.09.19 14:01:24.455183882	0000678	
20	0.000192	0.000149	-0.000106	-5.879606E-5	T	29358	2017.09.19 14:01:24.465183882	0000678	
20	0.000185	0.000140	-0.000102	-6.373914E-5	T	29358	2017.09.19 14:01:24.475183882	0000678	
20	0.000192	0.000160	-0.000106	-5.879743E-6	T	29358	2017.09.19 14:01:24.485183882	0000678	
20	0.000219	0.000182	-0.000102	-6.408128E-5	T	29358	2017.09.19 14:01:24.495183882	0000678	
20	0.000168	0.000131	-0.000102	-2.965910E-5	T	29358	2017.09.19 14:01:24.505183882	0000678	
20	0.000164	0.000136	-7.781749E-5	-4.879864E-5	T	29358	2017.09.19 14:01:24.515183882	0000678	
20	0.000186	0.000144	-0.000106	-4.875575E-5	T	29358	2017.09.19 14:01:24.525183882	0000678	
21	0.000188	0.000149	-0.000106	-4.379669E-5	T	29346	2017.09.19 14:01:24.635271382	0000678	
21	0.000196	0.000144	-0.000116	-6.371362E-5	T	29346	2017.09.19 14:01:24.645271382	0000678	
21	0.000199	0.000154	-0.000111	-5.881605E-5	T	29346	2017.09.19 14:01:24.655271382	0000678	
21	0.000188	0.000140	-0.000116	-4.868167E-5	T	29346	2017.09.19 14:01:24.665271382	0000678	
21	0.000184	0.000135	-0.000102	-7.269803E-5	T	29346	2017.09.19 14:01:24.675271382	0000678	
21	0.000191	0.000144	-0.000120	-3.469824E-5	T	29346	2017.09.19 14:01:24.685271382	0000678	
21	0.000185	0.000144	-0.000102	-5.377214E-5	T	29346	2017.09.19 14:01:24.695271382	0000678	
21	0.000194	0.000149	-0.000111	-5.377552E-5	T	29346	2017.09.19 14:01:24.705271382	0000678	
21	0.000207	0.000168	-0.000116	-2.991056E-5	T	29346	2017.09.19 14:01:24.715271382	0000678	
21	0.000170	0.000130	-9.675654E-5	-4.867905E-5	T	29346	2017.09.19 14:01:24.725271382	0000678	
22	0.000202	0.000163	-0.000111	-4.388999E-5	T	29344	2017.09.19 14:01:24.835358882	0000678	
22	0.000186	0.000135	-0.000106	-7.268143E-5	T	29344	2017.09.19 14:01:24.845358882	0000678	
22	0.000214	0.000177	-0.000116	-2.998387E-5	T	29344	2017.09.19 14:01:24.855358882	0000678	
22	0.000192	0.000149	-0.000111	-4.877573E-5	T	29344	2017.09.19 14:01:24.865358882	0000678	
22	0.000185	0.000140	-0.000116	-3.468225E-5	T	29344	2017.09.19 14:01:24.875358882	0000678	
22	0.000136	8.754478E-5	-9.620879E-5	-3.932914E-5	T	29344	2017.09.19 14:01:24.885358882	0000678	
22	0.000189	0.000144	-0.000102	-6.777156E-5	T	29344	2017.09.19 14:01:24.895358882	0000678	
22	0.000205	0.000168	-9.726916E-5	-6.398799E-5	T	29344	2017.09.19 14:01:24.905358882	0000678	
22	0.000182	0.000150	-0.000102	-2.081425E-5	T	29344	2017.09.19 14:01:24.915358882	0000678	
22	0.000191	0.000130	-0.000116	-7.759899E-5	T	29344	2017.09.19 14:01:24.925358882	0000678	
23	0.000193	0.000135	-0.000111	-8.266026E-5	T	29346	2017.09.19 14:01:25.035446382	0000678	
23	0.000185	0.000144	-0.000111	-3.473559E-5	T	29346	2017.09.19 14:01:25.045446382	0000678	
23	0.000206	0.000159	-0.000111	-6.785640E-5	T	29346	2017.09.19 14:01:25.055446382	0000678	
23	0.000195	0.000149	-0.000111	-5.877531E-5	T	29346	2017.09.19 14:01:25.065446382	0000678	
23	0.000185	0.000135	-0.000116	-4.864093E-5	T	29346	2017.09.19 14:01:25.075446382	0000678	
23	0.000195	0.000149	-0.000120	-3.473897E-5	T	29346	2017.09.19 14:01:25.085446382	0000678	
23	0.000153	0.000107	-0.000105	-2.944699E-5	T	29346	2017.09.19 14:01:25.095446382	0000678	
23	0.000193	0.000144	-0.000116	-5.371404E-5	T	29346	2017.09.19 14:01:25.105446382	0000678	
23	0.000218	0.000193	-9.741672E-5	-3.018492E-5	T	29346	2017.09.19 14:01:25.115446382	0000678	
23	0.000181	0.000140	-0.000106	-4.372337E-5	T	29346	2017.09.19 14:01:25.125446382	0000678	
24	0.000180	0.000125	-0.000125	-3.452271E-5	T	29357	2017.09.19 14:01:25.235533882	0000678	
24	0.000193	0.000144	-0.000116	-5.371404E-5	T	29357	2017.09.19 14:01:25.245533882	0000678	
24	0.000199	0.000144	-0.000106	-8.675416E-5	T	29357	2017.09.19 14:01:25.255533882	0000678	
24	0.000189	0.000130	-0.000116	-7.259920E-5	T	29357	2017.09.19 14:01:25.265533882	0000678	
24	0.000194	0.000154	-0.000102	-5.885340E-5	T	29357	2017.09.19 14:01:25.275533882	0000678	
24	0.000194	0.000160	-0.000106	-2.987874E-5	T	29357	2017.09.19 14:01:25.285533882	0000678	
24	0.000187	0.000149	-0.000102	-4.881308E-5	T	29357	2017.09.19 14:01:25.295533882	0000678	
24	0.000221	0.000177	-0.000116	-6.398245E-5	T	29357	2017.09.19 14:01:25.305533882	0000678	
24	0.000206	0.000163	-0.000102	-7.292613E-5	T	29357	2017.09.19 14:01:25.315533882	0000678	
24	0.000180	0.000121	-0.000102	-8.658340E-5	T	29357	2017.09.19 14:01:25.325533882	0000678	
25	0.000182	0.000125	-0.000116	-6.355884E-5	T	29332	2017.09.19 14:01:25.435621382	0000678	
25	0.000197	0.000140	-0.000111	-8.270099E-5	T	29332	2017.09.19 14:01:25.445621382	0000678	
25	0.000197	0.000149	-0.000111	-6.377511E-5	T	29332	2017.09.19 14:01:25.455621382	0000678	
25	0.000185	0.000130	-0.000125	-3.956323E-5	T	29332	2017.09.19 14:01:25.465621382	0000678	
25	0.000202	0.000159	-0.000116	-4.383665E-5	T	29332	2017.09.19 14:01:25.475621382	0000678	
25	0.000186	0.000135	-0.000120	-4.362454E-5	T	29332	2017.09.19 14:01:25.485621382	0000678	
25	0.000209	0.000159	-0.000111	-7.785598E-5	T	29332	2017.09.19 14:01:25.495621382	0000678	
25	0.000195	0.000144	-0.000106	-7.775454E-5	T	29332	2017.09.19 14:01:25.505621382	0000678	
25	0.000179	0.000121	-0.000116	-6.352626E-5	T	29332	2017.09.19 14:01:25.515621382	0000678	
25	0.000181	0.000125	-0.000120	-5.354266E-5	T	29332	2017.09.19 14:01:25.525621382	0000678	
26	0.000207	0.000173	-0.000102	-4.900859E-5	T	29343	2017.09.19 14:01:25.635708882	0000678	
26	0.000206	0.000163	-0.000116	-4.886903E-5	T	29343	2017.09.19 14:01:25.645708882	0000678	
26	0.000178	0.000135	-9.687679E-5	-6.371916E-5	T	29343	2017.09.19 14:01:25.655708882	0000678	
26	0.000214	0.000177	-0.000116	-2.498408E-5	T	29343	2017.09.19 14:01:25.665708882	0000678	
26	0.000174	0.000125	-0.000111	-4.858022E-5	T	29343	2017.09.19 14:01:25.675708882	0000678	
26	0.000184	0.000155	-9.694463E-5	-2.487557E-5	T	29343	2017.09.19 14:01:25.685708882	0000678	
26	0.000211	0.000183	-0.000102	-3.008270E-5	T	29343	2017.09.19 14:01:25.695708882	0000678	
26	0.000196	0.000159	-0.000106	-3.987832E-5	T	29343	2017.09.19 14:01:25.705708882	0000678	
26	0.000166	0.000121	-0.000111	-2.454864E-5	T	29343	2017.09.19 14:01:25.715708882	0000678	
26	0.000190	0.000121	-0.000130	-6.746799E-5	T	29343	2017.09.19 14:01:25.725708882	0000678	
27	0.000201	0.000149	-0.000116	-6.775419E-5	T	29347	2017.09.19 14:01:25.835796382	0000678	
27	0.000195	0.000159	-0.000106	-3.487853E-5	T	29347	2017.09.19 14:01:25.845796382	0000678	
27	0.000181	0.000135	-0.000116	-3.464152E-5	T	29347	2017.09.19 14:01:25.855796382	0000678	
27	0.000188	0.000135	-0.000120	-5.362412E-5	T	29347	2017.09.19 14:01:25.865796382	0000678	
27	0.000176	0.000135	-0.000102	-4.869903E-5	T	29347	2017.09.19 14:01:25.875796382	0000678	
27	0.000190	0.000125	-0.000135	-4.848062E-5	T	29347	2017.09.19 14:01:25.885796382	0000678	
27	0.000177	0.000125	-0.000120	-3.454346E-5	T	29347	2017.09.19 14:01:25.895796382	0000678	
27	0.000221	0.000182	-0.000116	-4.402402E-5	T	29347	2017.09.19 14:01:25.905796382	0000678	
27	0.000183	0.000144	-0.000102	-4.877235E-5	T	29347	2017.09.19 14:01:25.915796382	0000678	
27	0.000192	0.000154	-0.000106	-4.383742E-5	T	29347	2017.09.19 14:01:25.925796382	0000678	
28	0.000158	0.000122	-9.657252E-5	-2.960653E-5	T	29347	2017.09.19 14:01:26.035883882	0000678	
28	0.000201	0.000163	-0.000102	-5.892671E-5	T	29347	2017.09.19 14:01:26.045883882	0000678	
28	0.000208	0.000177	-8.339349E-5	-6.811924E-5	T	29347	2017.09.19 14:01:26.055883882	0000678	
28	0.000183	0.000150	-0.000102	-2.481409E-5	T	29347	2017.09.19 14:01:26.065883882	0000678	
28	0.000182	0.000140	-0.000102	-5.373956E-5	T	29347	2017.09.19 14:01:26.075883882	0000678	
28	0.000191	0.000144	-0.000111	-5.873458E-5	T	29347	2017.09.19 14:01:26.085883882	0000678	
28	0.000198	0.000164	-0.000111	-5.891578E-6	T	29347	2017.09.19 14:01:26.095883882	0000678	
28	0.000193	0.000154	-0.000111	-3.481705E-5	T	29347	2017.09.19 14:01:26.105883882	0000678	
28	0.000171	0.000121	-0.000106	-5.856797E-5	T	29347	2017.09.19 14:01:26.115883882	0000678	
28	0.000167	0.000136	-9.668224E-5	-1.572116E-5	T	29347	2017.09.19 14:01:26.125883882	0000678	
29	0.000181	0.000130	-0.000106	-6.764091E-5	T	29346	2017.09.19 14:01:26.235971382	0000678	
29	0.000221	0.000182	-0.000116	-4.402402E-5	T	29346	2017.09.19 14:01:26.245971382	0000678	
29	0.000198	0.000140	-0.000120	-7.266406E-5	T	29346	2017.09.19 14:01:26.255971382	0000678	
29	0.000190	0.000149	-0.000111	-3.977611E-5	T	29346	2017.09.19 14:01:26.265971382	0000678	
29	0.000204	0.000159	-0.000111	-6.385657E-5	T	29346	2017.09.19 14:01:26.275971382	0000678	
29	0.000198	0.000154	-0.000116	-4.379592E-5	T	29346	2017.09.19 14:01:26.285971382	0000678	
29	0.000175	0.000135	-9.683625E-5	-5.371958E-5	T	29346	2017.09.19 14:01:26.295971382	0000678	
29	0.000169	0.000136	-8.285762E-5	-5.877747E-5	T	29346	2017.09.19 14:01:26.305971382	0000678	
29	0.000202	0.000163	-0.000106	-5.391032E-5	T	29346	2017.09.19 14:01:26.315971382	0000678	
29	0.000199	0.000163	-0.000102	-4.892713E-5	T	29346	2017.09.19 14:01:26.325971382	0000678	
30	0.000182	0.000140	-0.000106	-4.872317E-5	T	29357	2017.09.19 14:01:26.436058882	0000678	
30	0.000173	0.000121	-0.000111	-5.354743E-5	T	29357	2017.09.19 14:01:26.446058882	0000678	
30	0.000173	0.000121	-0.000111	-5.354743E-5	T	29357	2017.09.19 14:01:26.456058882	0000678	
30	0.000181	0.000144	-9.692300E-5	-4.879310E-5	T	29357	2017.09.19 14:01:26.466058882	0000678	
30	0.000163	0.000126	-9.666061E-5	-3.963870E-5	T	29357	2017.09.19 14:01:26.476058882	0000678	
30	0.000181	0.000130	-0.000106	-6.764091E-5	T	29357	2017.09.19 14:01:26.486058882	0000678	
30	0.000139	0.000103	-8.636766E-5	-3.449304E-5	T	29357	2017.09.19 14:01:26.496058882	0000678	
30	0.000213	0.000177	-0.000106	-4.902458E-5	T	29357	2017.09.19 14:01:26.506058882	0000678	
30	0.000171	0.000131	-0.000106	-2.964250E-5	T	29357	2017.09.19 14:01:26.516058882	0000678	
30	0.000193	0.000154	-0.000102	-5.385361E-5	T	29357	2017.09.19 14:01:26.526058882	0000678	
31	0.000199	0.000159	-0.000106	-5.387774E-5	T	29366	2017.09.19 14:01:26.636146382	0000678	
31	0.000192	0.000149	-0.000102	-6.381246E-5	T	29366	2017.09.19 14:01:26.646146382	0000678	
31	0.000204	0.000174	-0.000102	-3.500918E-5	T	29366	2017.09.19 14:01:26.656146382	0000678	
31	0.000159	0.000122	-9.659279E-5	-3.460632E-5	T	29366	2017.09.19 14:01:26.666146382	0000678	
31	0.000181	0.000144	-0.000102	-3.977273E-5	T	29366	2017.09.19 14:01:26.676146382	0000678	
31	0.000175	0.000145	-8.294437E-5	-5.385099E-5	T	29366	2017.09.19 14:01:26.686146382	0000678	
31	0.000202	0.000163	-0.000106	-5.391032E-5	T	29366	2017.09.19 14:01:26.696146382	0000678	
31	0.000164	0.000126	-9.667682E-5	-4.363853E-5	T	29366	2017.09.19 14:01:26.706146382	0000678	
31	0.000206	0.000168	-0.000106	-5.395105E-5	T	29366	2017.09.19 14:01:26.716146382	0000678	
31	0.000191	0.000149	-9.705946E-5	-6.783304E-5	T	29366	2017.09.19 14:01:26.726146382	0000678	
32	0.000180	0.000145	-0.000106	-2.075692E-5	T	29339	2017.09.19 14:01:26.836233882	0000678	
32	0.000198	0.000154	-0.000111	-5.381625E-5	T	29339	2017.09.19 14:01:26.846233882	0000678	
32	0.000189	0.000154	-9.704190E-5	-4.887456E-5	T	29339	2017.09.19 14:01:26.856233882	0000678	
32	0.000190	0.000144	-0.000111	-5.373479E-5	T	29339	2017.09.19 14:01:26.866233882	0000678	
32	0.000196	0.000154	-0.000116	-3.479630E-5	T	29339	2017.09.19 14:01:26.876233882	0000678	
32	0.000194	0.000144	-0.000116	-5.871383E-5	T	29339	2017.09.19 14:01:26.886233882	0000678	
32	0.000194	0.000154	-0.000116	-2.079688E-5	T	29339	2017.09.19 14:01:26.896233882	0000678	
32	0.000169	0.000116	-0.000116	-3.948653E-5	T	29339	2017.09.19 14:01:26.906233882	0000678	
32	0.000164	0.000111	-0.000115	-3.444601E-5	T	29339	2017.09.19 14:01:26.916233882	0000678	
32	0.000196	0.000154	-0.000116	-3.479630E-5	T	29339	2017.09.19 14:01:26.926233882	0000678	
33	0.000189	0.000154	-9.208283E-5	-5.889490E-5	T	29330	2017.09.19 14:01:27.036321382	0000678	
33	0.000182	0.000144	-0.000106	-3.475634E-5	T	29330	2017.09.19 14:01:27.046321382	0000678	
33	0.000196	0.000144	-0.000120	-5.869723E-5	T	29330	2017.09.19 14:01:27.056321382	0000678	
33	0.000183	0.000140	-0.000102	-5.873935E-5	T	29330	2017.09.19 14:01:27.066321382	0000678	
33	0.000182	0.000144	-0.000106	-3.475634E-5	T	29330	2017.09.19 14:01:27.076321382	0000678	
33	0.000161	0.000117	-0.000110	-1.050849E-5	T	29330	2017.09.19 14:01:27.086321382	0000678	
33	0.000177	0.000135	-0.000111	-2.966248E-5	T	29330	2017.09.19 14:01:27.096321382	0000678	
33	0.000187	0.000135	-0.000125	-3.460417E-5	T	29330	2017.09.19 14:01:27.106321382	0000678	
33	0.000160	0.000116	-0.000102	-3.954463E-5	T	29330	2017.09.19 14:01:27.116321382	0000678	
33	0.000190	0.000150	-0.000116	-1.575636E-5	T	29330	2017.09.19 14:01:27.126321382	0000678	
34	0.000206	0.000178	-0.000102	-2.104235E-5	T	29359	2017.09.19 14:01:27.236408882	0000678	
34	0.000193	0.000159	-0.000102	-3.989492E-5	T	29359	2017.09.19 14:01:27.246408882	0000678	
34	0.000178	0.000121	-0.000102	-8.258357E-5	T	29359	2017.09.19 14:01:27.256408882	0000678	
34	0.000189	0.000154	-9.208283E-5	-5.889490E-5	T	29359	2017.09.19 14:01:27.266408882	0000678	
34	0.000196	0.000149	-0.000125	-2.071880E-5	T	29359	2017.09.19 14:01:27.276408882	0000678	
34	0.000203	0.000140	-0.000111	-9.670041E-5	T	29359	2017.09.19 14:01:27.286408882	0000678	
34	0.000179	0.000121	-0.000106	-7.756717E-5	T	29359	2017.09.19 14:01:27.296408882	0000678	
34	0.000185	0.000140	-0.000106	-5.872275E-5	T	29359	2017.09.19 14:01:27.306408882	0000678	
34	0.000176	0.000141	-9.685517E-5	-4.376073E-5	T	29359	2017.09.19 14:01:27.316408882	0000678	
34	0.000192	0.000149	-0.000106	-5.879606E-5	T	29359	2017.09.19 14:01:27.326408882	0000678	
35	0.000196	0.000164	-0.000102	-3.492772E-5	T	29331	2017.09.19 14:01:27.436496382	0000678	
35	0.000198	0.000149	-0.000116	-5.875456E-5	T	29331	2017.09.19 14:01:27.446496382	0000678	
35	0.000189	0.000154	-9.208283E-5	-5.889490E-5	T	29331	2017.09.19 14:01:27.456496382	0000678	
35	0.000161	0.000126	-9.662008E-5	-2.963912E-5	T	29331	2017.09.19 14:01:27.466496382	0000678	
35	0.000196	0.000154	-0.000111	-4.881646E-5	T	29331	2017.09.19 14:01:27.476496382	0000678	
35	0.000176	0.000130	-0.000111	-3.962133E-5	T	29331	2017.09.19 14:01:27.486496382	0000678	
35	0.000175	0.000121	-0.000125	-1.549091E-5	T	29331	2017.09.19 14:01:27.496496382	0000678	
35	0.000169	0.000131	-0.000106	-2.064287E-5	T	29331	2017.09.19 14:01:27.506496382	0000678	
35	0.000175	0.000125	-0.000120	-2.054404E-5	T	29331	2017.09.19 14:01:27.516496382	0000678	
35	0.000185	0.000121	-0.000130	-5.346858E-5	T	29331	2017.09.19 14:01:27.526496382	0000678	
36	0.000192	0.000149	-0.000106	-5.879606E-5	T	29338	2017.09.19 14:01:27.636583882	0000678	
36	0.000210	0.000173	-0.000106	-5.399178E-5	T	29338	2017.09.19 14:01:27.646583882	0000678	
36	0.000167	0.000121	-0.000106	-4.356859E-5	T	29338	2017.09.19 14:01:27.656583882	0000678	
36	0.000182	0.000144	-0.000102	-4.377256E-5	T	29338	2017.09.19 14:01:27.666583882	0000678	
36	0.000201	0.000154	-0.000120	-4.877911E-5	T	29338	2017.09.19 14:01:27.676583882	0000678	
36	0.000207	0.000159	-0.000130	-2.477935E-5	T	29338	2017.09.19 14:01:27.686583882	0000678	
36	0.000185	0.000135	-0.000116	-4.864093E-5	T	29338	2017.09.19 14:01:27.696583882	0000678	
36	0.000143	9.248497E-5	-0.000101	-3.934912E-5	T	29338	2017.09.19 14:01:27.706583882	0000678	
36	0.000177	0.000116	-9.676436E-5	-9.156321E-5	T	29338	2017.09.19 14:01:27.716583882	0000678	
36	0.000166	0.000111	-0.000116	-4.344563E-5	T	29338	2017.09.19 14:01:27.726583882	0000678	
37	0.000164	0.000122	-0.000106	-2.956918E-5	T	29348	2017.09.19 14:01:27.836671382	0000678	
37	0.000177	0.000121	-0.000111	-6.754684E-5	T	29348	2017.09.19 14:01:27.846671382	0000678	
37	0.000187	0.000164	-8.705243E-5	-2.499038E-5	T	29348	2017.09.19 14:01:27.856671382	0000678	
37	0.000201	0.000163	-0.000111	-3.489037E-5	T	29348	2017.09.19 14:01:27.866671382	0000678	
37	0.000161	0.000122	-9.662926E-5	-4.360595E-5	T	29348	2017.09.19 14:01:27.876671382	0000678	
37	0.000210	0.000163	-0.000120	-5.385222E-5	T	29348	2017.09.19 14:01:27.886671382	0000678	
37	0.000197	0.000154	-0.000102	-6.785302E-5	T	29348	2017.09.19 14:01:27.896671382	0000678	
37	0.000204	0.000168	-0.000102	-5.396765E-5	T	29348	2017.09.19 14:01:27.906671382	0000678	
37	0.000184	0.000149	-9.200311E-5	-5.385437E-5	T	29348	2017.09.19 14:01:27.916671382	0000678	
37	0.000187	0.000140	-9.699298E-5	-7.775930E-5	T	29348	2017.09.19 14:01:27.926671382	0000678	
38	0.000179	0.000140	-0.000102	-4.373997E-5	T	29362	2017.09.19 14:01:28.036758882	0000678	
38	0.000188	0.000160	-9.700408E-5	-2.491630E-5	T	29362	2017.09.19 14:01:28.046758882	0000678	
38	0.000219	0.000168	-0.000116	-7.790855E-5	T	29362	2017.09.19 14:01:28.056758882	0000678	
38	0.000153	0.000126	-8.260092E-5	-2.469743E-5	T	29362	2017.09.19 14:01:28.066758882	0000678	
38	0.000172	0.000135	-9.183665E-5	-5.374033E-5	T	29362	2017.09.19 14:01:28.076758882	0000678	
38	0.000158	0.000102	-0.000105	-5.841319E-5	T	29362	2017.09.19 14:01:28.086758882	0000678	
38	0.000175	0.000130	-0.000102	-5.865788E-5	T	29362	2017.09.19 14:01:28.096758882	0000678	
38	0.000183	0.000140	-0.000111	-3.970279E-5	T	29362	2017.09.19 14:01:28.106758882	0000678	
38	0.000179	0.000145	-0.000102	-2.477335E-5	T	29362	2017.09.19 14:01:28.116758882	0000678	
38	0.000193	0.000159	-0.000102	-3.989492E-5	T	29362	2017.09.19 14:01:28.126758882	0000678	
39	0.000180	0.000130	-0.000116	-4.360041E-5	T	29356	2017.09.19 14:01:28.236846382	0000678	
39	0.000192	0.000149	-0.000102	-6.381246E-5	T	29356	2017.09.19 14:01:28.246846382	0000678	
39	0.000187	0.000149	-0.000106	-3.979686E-5	T	29356	2017.09.19 14:01:28.256846382	0000678	
39	0.000185	0.000130	-0.000116	-6.359958E-5	T	29356	2017.09.19 14:01:28.266846382	0000678	
39	0.000206	0.000144	-0.000125	-7.767569E-5	T	29356	2017.09.19 14:01:28.276846382	0000678	
39	0.000206	0.000159	-0.000111	-6.785640E-5	T	29356	2017.09.19 14:01:28.286846382	0000678	
39	0.000178	0.000140	-0.000102	-3.974014E-5	T	29356	2017.09.19 14:01:28.296846382	0000678	
39	0.000210	0.000168	-0.000102	-7.296686E-5	T	29356	2017.09.19 14:01:28.306846382	0000678	
39	0.000168	0.000145	-6.892521E-5	-4.890930E-5	T	29356	2017.09.19 14:01:28.316846382	0000678	
39	0.000171	0.000136	-8.685731E-5	-5.876087E-5	T	29356	2017.09.19 14:01:28.326846382	0000678	
40	0.000159	0.000131	-8.666006E-5	-2.472156E-5	T	29362	2017.09.19 14:01:28.436933882	0000678	
40	0.000177	0.000150	-9.188557E-5	-2.485559E-5	T	29362	2017.09.19 14:01:28.446933882	0000678	
40	0.000187	0.000130	-0.000116	-6.759941E-5	T	29362	2017.09.19 14:01:28.456933882	0000678	
40	0.000185	0.000125	-0.000106	-8.659938E-5	T	29362	2017.09.19 14:01:28.466933882	0000678	
40	0.000197	0.000154	-0.000120	-2.478012E-5	T	29362	2017.09.19 14:01:28.476933882	0000678	
40	0.000186	0.000155	-9.698516E-5	-3.487515E-5	T	29362	2017.09.19 14:01:28.486933882	0000678	
40	0.000198	0.000163	-9.716918E-5	-5.394767E-5	T	29362	2017.09.19 14:01:28.496933882	0000678	
40	0.000170	0.000136	-0.000102	-1.070062E-5	T	29362	2017.09.19 14:01:28.506933882	0000678	
40	0.000179	0.000155	-7.802314E-5	-4.395362E-5	T	29362	2017.09.19 14:01:28.516933882	0000678	
40	0.000210	0.000163	-0.000111	-7.288878E-5	T	29362	2017.09.19 14:01:28.526933882	0000678	
41	0.000180	0.000130	-0.000116	-4.360041E-5	T	29357	2017.09.19 14:01:28.637021382	0000678	
41	0.000174	0.000121	-0.000106	-6.756759E-5	T	29357	2017.09.19 14:01:28.647021382	0000678	
41	0.000199	0.000169	-9.718810E-5	-4.398882E-5	T	29357	2017.09.19 14:01:28.657021382	0000678	
41	0.000199	0.000174	-9.219120E-5	-3.005089E-5	T	29357	2017.09.19 14:01:28.667021382	0000678	
41	0.000169	0.000125	-0.000102	-4.861757E-5	T	29357	2017.09.19 14:01:28.677021382	0000678	
41	0.000149	0.000107	-8.651250E-5	-5.852462E-5	T	29357	2017.09.19 14:01:28.687021382	0000678	
41	0.000185	0.000135	-9.197040E-5	-8.673895E-5	T	29357	2017.09.19 14:01:28.697021382	0000678	
41	0.000180	0.000144	-9.194366E-5	-5.381364E-5	T	29357	2017.09.19 14:01:28.707021382	0000678	
41	0.000192	0.000149	-0.000102	-6.381246E-5	T	29357	2017.09.19 14:01:28.717021382	0000678	
41	0.000184	0.000140	-0.000106	-5.372296E-5	T	29357	2017.09.19 14:01:28.727021382	0000678	
42	0.000164	0.000131	-9.172046E-5	-3.970018E-5	T	29349	2017.09.19 14:01:28.837108882	0000678	
42	0.000189	0.000144	-0.000120	-2.069882E-5	T	29349	2017.09.19 14:01:28.847108882	0000678	
42	0.000180	0.000140	-0.000106	-3.972354E-5	T	29349	2017.09.19 14:01:28.857108882	0000678	
42	0.000179	0.000140	-0.000102	-4.373997E-5	T	29349	2017.09.19 14:01:28.867108882	0000678	
42	0.000180	0.000135	-0.000111	-4.366189E-5	T	29349	2017.09.19 14:01:28.877108882	0000678	
42	0.000172	0.000130	-0.000102	-4.865830E-5	T	29349	2017.09.19 14:01:28.887108882	0000678	
42	0.000203	0.000163	-9.226684E-5	-7.796742E-5	T	29349	2017.09.19 14:01:28.897108882	0000678	
42	0.000158	0.000117	-0.000102	-3.454484E-5	T	29349	2017.09.19 14:01:28.907108882	0000678	
42	0.000187	0.000144	-0.000111	-4.373521E-5	T	29349	2017.09.19 14:01:28.917108882	0000678	
42	0.000186	0.000149	-0.000102	-4.381329E-5	T	29349	2017.09.19 14:01:28.927108882	0000678	
43	0.000186	0.000150	-0.000106	-2.979728E-5	T	29334	2017.09.19 14:01:29.037196382	0000678	
43	0.000187	0.000149	-0.000106	-3.979686E-5	T	29334	2017.09.19 14:01:29.047196382	0000678	
43	0.000198	0.000144	-0.000111	-7.773379E-5	T	29334	2017.09.19 14:01:29.057196382	0000678	
43	0.000180	0.000130	-0.000116	-4.360041E-5	T	29334	2017.09.19 14:01:29.067196382	0000678	
43	0.000219	0.000177	-0.000111	-6.400320E-5	T	29334	2017.09.19 14:01:29.077196382	0000678	
43	0.000171	0.000131	-0.000111	-5.622750E-6	T	29334	2017.09.19 14:01:29.087196382	0000678	
43	0.000183	0.000121	-0.000135	-2.944883E-5	T	29334	2017.09.19 14:01:29.097196382	0000678	
43	0.000207	0.000168	-0.000116	-2.991056E-5	T	29334	2017.09.19 14:01:29.107196382	0000678	
43	0.000165	0.000116	-0.000111	-3.950728E-5	T	29334	2017.09.19 14:01:29.117196382	0000678	
43	0.000190	0.000140	-0.000120	-4.366527E-5	T	29334	2017.09.19 14:01:29.127196382	0000678	
44	0.000162	0.000122	-0.000106	-2.056956E-5	T	29346	2017.09.19 14:01:29.237283882	0000678	
44	0.000195	0.000154	-0.000111	-4.381667E-5	T	29346	2017.09.19 14:01:29.247283882	0000678	
44	0.000200	0.000154	-0.000120	-4.377932E-5	T	29346	2017.09.19 14:01:29.257283882	0000678	
44	0.000195	0.000140	-0.000111	-7.770120E-5	T	29346	2017.09.19 14:01:29.267283882	0000678	
44	0.000161	0.000122	-0.000105	-5.703919E-7	T	29346	2017.09.19 14:01:29.277283882	0000678	
44	0.000184	0.000144	-0.000111	-2.973579E-5	T	29346	2017.09.19 14:01:29.287283882	0000678	
44	0.000180	0.000140	-0.000106	-3.972354E-5	T	29346	2017.09.19 14:01:29.297283882	0000678	
44	0.000172	0.000121	-0.000116	-3.952726E-5	T	29346	2017.09.19 14:01:29.307283882	0000678	
44	0.000194	0.000154	-0.000102	-5.885340E-5	T	29346	2017.09.19 14:01:29.317283882	0000678	
44	0.000190	0.000154	-0.000102	-4.385402E-5	T	29346	2017.09.19 14:01:29.327283882	0000678	
45	0.000176	0.000135	-0.000106	-3.968281E-5	T	29346	2017.09.19 14:01:29.437371382	0000678	
45	0.000215	0.000173	-0.000116	-5.395028E-5	T	29346	2017.09.19 14:01:29.447371382	0000678	
45	0.000181	0.000140	-0.000111	-2.970321E-5	T	29346	2017.09.19 14:01:29.457371382	0000678	
45	0.000188	0.000135	-0.000102	-8.269761E-5	T	29346	2017.09.19 14:01:29.467371382	0000678	
45	0.000204	0.000159	-0.000111	-6.385657E-5	T	29346	2017.09.19 14:01:29.477371382	0000678	
45	0.000202	0.000168	-0.000106	-3.495185E-5	T	29346	2017.09.19 14:01:29.487371382	0000678	
45	0.000179	0.000150	-8.696297E-5	-4.387554E-5	T	29346	2017.09.19 14:01:29.497371382	0000678	
45	0.000175	0.000130	-0.000106	-4.864170E-5	T	29346	2017.09.19 14:01:29.507371382	0000678	
45	0.000186	0.000144	-0.000116	-2.071542E-5	T	29346	2017.09.19 14:01:29.517371382	0000678	
45	0.000198	0.000163	-0.000106	-3.491112E-5	T	29346	2017.09.19 14:01:29.527371382	0000678	
46	0.000201	0.000144	-0.000116	-7.771304E-5	T	29356	2017.09.19 14:01:29.637458882	0000678	
46	0.000190	0.000144	-0.000106	-6.375512E-5	T	29356	2017.09.19 14:01:29.647458882	0000678	
46	0.000164	0.000122	-0.000110	-5.549433E-6	T	29356	2017.09.19 14:01:29.657458882	0000678	
46	0.000171	0.000111	-0.000116	-5.844500E-5	T	29356	2017.09.19 14:01:29.667458882	0000678	
46	0.000200	0.000159	-0.000102	-6.389392E-5	T	29356	2017.09.19 14:01:29.677458882	0000678	
46	0.000184	0.000140	-0.000106	-5.372296E-5	T	29356	2017.09.19 14:01:29.687458882	0000678	
46	0.000172	0.000150	-7.792721E-5	-3.491327E-5	T	29356	2017.09.19 14:01:29.697458882	0000678	
46	0.000187	0.000149	-0.000106	-3.979686E-5	T	29356	2017.09.19 14:01:29.707458882	0000678	
46	0.000223	0.000187	-0.000102	-6.412202E-5	T	29356	2017.09.19 14:01:29.717458882	0000678	
46	0.000186	0.000155	-9.204230E-5	-4.889531E-5	T	29356	2017.09.19 14:01:29.727458882	0000678	
47	0.000194	0.000149	-0.000111	-5.377552E-5	T	29336	2017.09.19 14:01:29.837546382	0000678	
47	0.000166	0.000121	-8.276817E-5	-7.766262E-5	T	29336	2017.09.19 14:01:29.847546382	0000678	
47	0.000173	0.000135	-9.681599E-5	-4.871978E-5	T	29336	2017.09.19 14:01:29.857546382	0000678	
47	0.000206	0.000159	-0.000116	-5.883603E-5	T	29336	2017.09.19 14:01:29.867546382	0000678	
47	0.000179	0.000141	-0.000111	-1.170396E-5	T	29336	2017.09.19 14:01:29.877546382	0000678	
47	0.000186	0.000135	-0.000111	-6.366106E-5	T	29336	2017.09.19 14:01:29.887546382	0000678	
47	0.000201	0.000168	-0.000102	-3.996824E-5	T	29336	2017.09.19 14:01:29.897546382	0000678	
47	0.000196	0.000144	-0.000120	-5.869723E-5	T	29336	2017.09.19 14:01:29.907546382	0000678	
47	0.000187	0.000125	-0.000130	-4.850137E-5	T	29336	2017.09.19 14:01:29.917546382	0000678	
47	0.000196	0.000149	-0.000120	-3.973876E-5	T	29336	2017.09.19 14:01:29.927546382	0000678	
48	0.000190	0.000144	-0.000106	-6.375512E-5	T	29356	2017.09.19 14:01:30.037633882	0000678	
48	0.000196	0.000154	-0.000106	-5.883680E-5	T	29356	2017.09.19 14:01:30.047633882	0000678	
48	0.000194	0.000149	-0.000111	-5.377552E-5	T	29356	2017.09.19 14:01:30.057633882	0000678	
48	0.000218	0.000182	-0.000106	-5.406510E-5	T	29356	2017.09.19 14:01:30.067633882	0000678	
48	0.000195	0.000154	-0.000116	-2.479672E-5	T	29356	2017.09.19 14:01:30.077633882	0000678	
48	0.000183	0.000140	-0.000116	-2.068284E-5	T	29356	2017.09.19 14:01:30.087633882	0000678	
48	0.000179	0.000130	-0.000111	-5.362074E-5	T	29356	2017.09.19 14:01:30.097633882	0000678	
48	0.000173	0.000141	-8.291707E-5	-5.881820E-5	T	29356	2017.09.19 14:01:30.107633882	0000678	
48	0.000189	0.000149	-0.000111	-3.477632E-5	T	29356	2017.09.19 14:01:30.117633882	0000678	
48	0.000178	0.000145	-9.688652E-5	-3.979348E-5	T	29356	2017.09.19 14:01:30.127633882	0000678	
49	0.000212	0.000168	-0.000111	-6.392989E-5	T	29330	2017.09.19 14:01:30.237721382	0000678	
49	0.000205	0.000168	-0.000106	-4.895126E-5	T	29330	2017.09.19 14:01:30.247721382	0000678	
49	0.000178	0.000140	-0.000102	-3.974014E-5	T	29330	2017.09.19 14:01:30.257721382	0000678	
49	0.000172	0.000136	-9.679572E-5	-4.371999E-5	T	29330	2017.09.19 14:01:30.267721382	0000678	
49	0.000162	0.000122	-0.000106	-2.056956E-5	T	29330	2017.09.19 14:01:30.277721382	0000678	
49	0.000163	0.000116	-0.000111	-2.950770E-5	T	29330	2017.09.19 14:01:30.287721382	0000678	
49	0.000196	0.000149	-0.000125	-2.071880E-5	T	29330	2017.09.19 14:01:30.297721382	0000678	
49	0.000194	0.000149	-0.000116	-4.375519E-5	T	29330	2017.09.19 14:01:30.307721382	0000678	
49	0.000181	0.000125	-0.000125	-3.952250E-5	T	29330	2017.09.19 14:01:30.317721382	0000678	
49	0.000175	0.000116	-0.000120	-5.346934E-5	T	29330	2017.09.19 14:01:30.327721382	0000678	
50	0.000195	0.000154	-0.000116	-2.479672E-5	T	29352	2017.09.19 14:01:30.437808882	0000678	
50	0.000205	0.000174	-0.000106	-2.499300E-5	T	29352	2017.09.19 14:01:30.447808882	0000678	
50	0.000204	0.000163	-0.000102	-6.792634E-5	T	29352	2017.09.19 14:01:30.457808882	0000678	
50	0.000195	0.000144	-0.000125	-3.967728E-5	T	29352	2017.09.19 14:01:30.467808882	0000678	
50	0.000183	0.000130	-0.000120	-4.858360E-5	T	29352	2017.09.19 14:01:30.477808882	0000678	
50	0.000199	0.000164	-0.000111	-2.089095E-5	T	29352	2017.09.19 14:01:30.487808882	0000678	
50	0.000189	0.000155	-0.000106	-2.083838E-5	T	29352	2017.09.19 14:01:30.497808882	0000678	
50	0.000173	0.000145	-9.180991E-5	-2.081502E-5	T	29352	2017.09.19 14:01:30.507808882	0000678	
50	0.000173	0.000130	-0.000106	-3.964208E-5	T	29352	2017.09.19 14:01:30.517808882	0000678	
50	0.000192	0.000154	-0.000111	-2.481747E-5	T	29352	2017.09.19 14:01:30.527808882	0000678	
51	0.000182	0.000140	-9.693624E-5	-6.375989E-5	T	29340	2017.09.19 14:01:30.637896382	0000678	
51	0.000212	0.000173	-0.000111	-4.897124E-5	T	29340	2017.09.19 14:01:30.647896382	0000678	
51	0.000203	0.000159	-0.000120	-3.982022E-5	T	29340	2017.09.19 14:01:30.657896382	0000678	
51	0.000171	0.000121	-0.000106	-5.856797E-5	T	29340	2017.09.19 14:01:30.667896382	0000678	
51	0.000191	0.000149	-0.000116	-2.475599E-5	T	29340	2017.09.19 14:01:30.677896382	0000678	
51	0.000191	0.000149	-0.000116	-2.475599E-5	T	29340	2017.09.19 14:01:30.687896382	0000678	
51	0.000176	0.000121	-0.000116	-5.352668E-5	T	29340	2017.09.19 14:01:30.697896382	0000678	
51	0.000192	0.000164	-9.705164E-5	-2.494888E-5	T	29340	2017.09.19 14:01:30.707896382	0000678	
51	0.000210	0.000173	-0.000116	-2.095166E-5	T	29340	2017.09.19 14:01:30.717896382	0000678	
51	0.000168	0.000126	-0.000111	-1.058181E-5	T	29340	2017.09.19 14:01:30.727896382	0000678	
52	0.000185	0.000130	-0.000120	-5.358339E-5	T	29362	2017.09.19 14:01:30.837983882	0000678	
52	0.000205	0.000168	-9.726916E-5	-6.398799E-5	T	29362	2017.09.19 14:01:30.847983882	0000678	
52	0.000187	0.000140	-0.000111	-5.370221E-5	T	29362	2017.09.19 14:01:30.857983882	0000678	
52	0.000194	0.000149	-0.000106	-6.379586E-5	T	29362	2017.09.19 14:01:30.867983882	0000678	
52	0.000196	0.000144	-0.000111	-7.273400E-5	T	29362	2017.09.19 14:01:30.877983882	0000678	
52	0.000175	0.000130	-0.000111	-3.462154E-5	T	29362	2017.09.19 14:01:30.887983882	0000678	
52	0.000177	0.000135	-8.691405E-5	-7.276028E-5	T	29362	2017.09.19 14:01:30.897983882	0000678	
52	0.000179	0.000150	-8.696297E-5	-4.387554E-5	T	29362	2017.09.19 14:01:30.907983882	0000678	
52	0.000171	0.000130	-0.000106	-3.464229E-5	T	29362	2017.09.19 14:01:30.917983882	0000678	
52	0.000175	0.000145	-9.186665E-5	-3.481444E-5	T	29362	2017.09.19 14:01:30.927983882	0000678	
53	0.000188	0.000144	-0.000106	-5.875533E-5	T	29353	2017.09.19 14:01:31.038071382	0000678	
53	0.000172	0.000125	-0.000111	-3.958060E-5	T	29353	2017.09.19 14:01:31.048071382	0000678	
53	0.000197	0.000159	-9.716215E-5	-6.391467E-5	T	29353	2017.09.19 14:01:31.058071382	0000678	
53	0.000164	0.000122	-0.000106	-2.956918E-5	T	29353	2017.09.19 14:01:31.068071382	0000678	
53	0.000175	0.000136	-0.000111	-1.066327E-5	T	29353	2017.09.19 14:01:31.078071382	0000678	
53	0.000177	0.000141	-0.000102	-3.474035E-5	T	29353	2017.09.19 14:01:31.088071382	0000678	
53	0.000194	0.000159	-0.000102	-4.389475E-5	T	29353	2017.09.19 14:01:31.098071382	0000678	
53	0.000192	0.000154	-0.000106	-3.983759E-5	T	29353	2017.09.19 14:01:31.108071382	0000678	
53	0.000184	0.000140	-0.000116	-2.468267E-5	T	29353	2017.09.19 14:01:31.118071382	0000678	
53	0.000188	0.000149	-0.000111	-2.477674E-5	T	29353	2017.09.19 14:01:31.128071382	0000678	
54	0.000173	0.000136	-0.000106	-2.068360E-5	T	29353	2017.09.19 14:01:31.238158882	0000678	
54	0.000178	0.000135	-0.000102	-5.369883E-5	T	29353	2017.09.19 14:01:31.248158882	0000678	
54	0.000182	0.000145	-0.000106	-2.975655E-5	T	29353	2017.09.19 14:01:31.258158882	0000678	
54	0.000182	0.000135	-0.000111	-4.866168E-5	T	29353	2017.09.19 14:01:31.268158882	0000678	
54	0.000158	0.000117	-0.000102	-3.454484E-5	T	29353	2017.09.19 14:01:31.278158882	0000678	
54	0.000188	0.000144	-0.000111	-4.873500E-5	T	29353	2017.09.19 14:01:31.288158882	0000678	
54	0.000175	0.000135	-0.000106	-3.468302E-5	T	29353	2017.09.19 14:01:31.298158882	0000678	
54	0.000186	0.000150	-0.000111	-7.777384E-7	T	29353	2017.09.19 14:01:31.308158882	0000678	
54	0.000196	0.000159	-0.000106	-4.387815E-5	T	29353	2017.09.19 14:01:31.318158882	0000678	
54	0.000163	0.000131	-9.658226E-5	-5.680850E-6	T	29353	2017.09.19 14:01:31.328158882	0000678	
55	0.000168	0.000131	-9.673627E-5	-4.367926E-5	T	29362	2017.09.19 14:01:31.438246382	0000678	
55	0.000147	0.000103	-9.640335E-5	-4.345117E-5	T	29362	2017.09.19 14:01:31.448246382	0000678	
55	0.000180	0.000130	-0.000120	-3.458419E-5	T	29362	2017.09.19 14:01:31.458246382	0000678	
55	0.000188	0.000144	-0.000106	-5.875533E-5	T	29362	2017.09.19 14:01:31.468246382	0000678	
55	0.000171	0.000130	-9.677680E-5	-5.367884E-5	T	29362	2017.09.19 14:01:31.478246382	0000678	
55	0.000184	0.000150	-0.000102	-3.481367E-5	T	29362	2017.09.19 14:01:31.488246382	0000678	
55	0.000141	7.831625E-5	-9.621526E-5	-6.725465E-5	T	29362	2017.09.19 14:01:31.498246382	0000678	
55	0.000161	0.000122	-0.000102	-2.958578E-5	T	29362	2017.09.19 14:01:31.508246382	0000678	
55	0.000187	0.000160	-8.310246E-5	-4.897340E-5	T	29362	2017.09.19 14:01:31.518246382	0000678	
55	0.000192	0.000154	-9.708243E-5	-5.887415E-5	T	29362	2017.09.19 14:01:31.528246382	0000678	
56	0.000186	0.000140	-0.000116	-3.968204E-5	T	29354	2017.09.19 14:01:31.638333882	0000678	
56	0.000169	0.000121	-0.000111	-3.954801E-5	T	29354	2017.09.19 14:01:31.648333882	0000678	
56	0.000170	0.000141	-9.177856E-5	-2.478227E-5	T	29354	2017.09.19 14:01:31.658333882	0000678	
56	0.000179	0.000140	-0.000102	-4.373997E-5	T	29354	2017.09.19 14:01:31.668333882	0000678	
56	0.000176	0.000135	-0.000102	-4.869903E-5	T	29354	2017.09.19 14:01:31.678333882	0000678	
56	0.000164	0.000121	-0.000102	-4.358519E-5	T	29354	2017.09.19 14:01:31.688333882	0000678	
56	0.000177	0.000135	-0.000106	-4.368264E-5	T	29354	2017.09.19 14:01:31.698333882	0000678	
56	0.000190	0.000144	-0.000106	-6.375512E-5	T	29354	2017.09.19 14:01:31.708333882	0000678	
56	0.000153	9.226354E-5	-0.000110	-5.331118E-5	T	29354	2017.09.19 14:01:31.718333882	0000678	
56	0.000154	0.000112	-0.000105	-1.548830E-5	T	29354	2017.09.19 14:01:31.728333882	0000678	
57	0.000200	0.000154	-0.000111	-6.381584E-5	T	29359	2017.09.19 14:01:31.838421382	0000678	
57	0.000184	0.000135	-9.693353E-5	-7.771857E-5	T	29359	2017.09.19 14:01:31.848421382	0000678	
57	0.000169	0.000121	-0.000111	-3.954801E-5	T	29359	2017.09.19 14:01:31.858421382	0000678	
57	0.000185	0.000144	-0.000102	-5.377214E-5	T	29359	2017.09.19 14:01:31.868421382	0000678	
57	0.000185	0.000140	-0.000106	-5.872275E-5	T	29359	2017.09.19 14:01:31.878421382	0000678	
57	0.000196	0.000174	-8.321217E-5	-3.508803E-5	T	29359	2017.09.19 14:01:31.888421382	0000678	
57	0.000186	0.000155	-0.000102	-2.085498E-5	T	29359	2017.09.19 14:01:31.898421382	0000678	
57	0.000176	0.000121	-0.000106	-7.256738E-5	T	29359	2017.09.19 14:01:31.908421382	0000678	
57	0.000190	0.000154	-9.706217E-5	-5.387436E-5	T	29359	2017.09.19 14:01:31.918421382	0000678	
57	0.000179	0.000140	-0.000106	-3.472375E-5	T	29359	2017.09.19 14:01:31.928421382	0000678	
58	0.000189	0.000164	-8.709296E-5	-3.498997E-5	T	29340	2017.09.19 14:01:32.038508882	0000678	
58	0.000180	0.000140	-9.691597E-5	-5.876010E-5	T	29340	2017.09.19 14:01:32.048508882	0000678	
58	0.000190	0.000144	-0.000111	-5.373479E-5	T	29340	2017.09.19 14:01:32.058508882	0000678	
58	0.000157	0.000102	-0.000110	-4.339306E-5	T	29340	2017.09.19 14:01:32.068508882	0000678	
58	0.000191	0.000160	-0.000102	-2.489555E-5	T	29340	2017.09.19 14:01:32.078508882	0000678	
58	0.000159	0.000106	-0.000110	-4.342565E-5	T	29340	2017.09.19 14:01:32.088508882	0000678	
58	0.000172	0.000121	-0.000120	-2.051146E-5	T	29340	2017.09.19 14:01:32.098508882	0000678	
58	0.000174	0.000125	-0.000111	-4.858022E-5	T	29340	2017.09.19 14:01:32.108508882	0000678	
58	0.000190	0.000140	-0.000116	-5.368146E-5	T	29340	2017.09.19 14:01:32.118508882	0000678	
58	0.000164	0.000106	-0.000119	-3.438868E-5	T	29340	2017.09.19 14:01:32.128508882	0000678	
59	0.000176	0.000125	-0.000106	-6.360034E-5	T	29341	2017.09.19 14:01:32.238596382	0000678	
59	0.000191	0.000149	-0.000111	-4.377594E-5	T	29341	2017.09.19 14:01:32.248596382	0000678	
59	0.000158	0.000116	-9.161074E-5	-5.358555E-5	T	29341	2017.09.19 14:01:32.258596382	0000678	
59	0.000204	0.000154	-0.000120	-5.877870E-5	T	29341	2017.09.19 14:01:32.268596382	0000678	
59	0.000166	0.000121	-0.000106	-3.956876E-5	T	29341	2017.09.19 14:01:32.278596382	0000678	
59	0.000164	0.000131	-9.172046E-5	-3.970018E-5	T	29341	2017.09.19 14:01:32.288596382	0000678	
59	0.000192	0.000160	-0.000106	-1.087953E-5	T	29341	2017.09.19 14:01:32.298596382	0000678	
59	0.000186	0.000155	-0.000102	-2.085498E-5	T	29341	2017.09.19 14:01:32.308596382	0000678	
59	0.000181	0.000130	-0.000111	-5.862053E-5	T	29341	2017.09.19 14:01:32.318596382	0000678	
59	0.000192	0.000135	-0.000130	-3.958321E-5	T	29341	2017.09.19 14:01:32.328596382	0000678	
60	0.000193	0.000140	-0.000111	-7.270141E-5	T	29334	2017.09.19 14:01:32.438683882	0000678	
60	0.000207	0.000163	-0.000116	-5.386882E-5	T	29334	2017.09.19 14:01:32.448683882	0000678	
60	0.000229	0.000192	-0.000116	-4.410548E-5	T	29334	2017.09.19 14:01:32.458683882	0000678	
60	0.000187	0.000149	-0.000106	-3.979686E-5	T	29334	2017.09.19 14:01:32.468683882	0000678	
60	0.000183	0.000135	-0.000106	-6.368181E-5	T	29334	2017.09.19 14:01:32.478683882	0000678	
60	0.000194	0.000144	-0.000116	-5.871383E-5	T	29334	2017.09.19 14:01:32.488683882	0000678	
60	0.000183	0.000130	-0.000120	-4.858360E-5	T	29334	2017.09.19 14:01:32.498683882	0000678	
60	0.000207	0.000159	-0.000120	-5.381964E-5	T	29334	2017.09.19 14:01:32.508683882	0000678	
60	0.000200	0.000135	-0.000135	-5.856167E-5	T	29334	2017.09.19 14:01:32.518683882	0000678	
60	0.000199	0.000144	-0.000120	-6.769686E-5	T	29334	2017.09.19 14:01:32.528683882	0000678	
61	0.000200	0.000163	-0.000102	-5.392692E-5	T	29340	2017.09.19 14:01:32.638771382	0000678	
61	0.000185	0.000135	-0.000106	-6.768164E-5	T	29340	2017.09.19 14:01:32.648771382	0000678	
61	0.000185	0.000149	-0.000102	-3.981346E-5	T	29340	2017.09.19 14:01:32.658771382	0000678	
61	0.000188	0.000149	-9.205985E-5	-6.785379E-5	T	29340	2017.09.19 14:01:32.668771382	0000678	
61	0.000195	0.000149	-0.000106	-6.779569E-5	T	29340	2017.09.19 14:01:32.678771382	0000678	
61	0.000184	0.000144	-0.000111	-2.473600E-5	T	29340	2017.09.19 14:01:32.688771382	0000678	
61	0.000190	0.000155	-0.000106	-2.983801E-5	T	29340	2017.09.19 14:01:32.698771382	0000678	
61	0.000184	0.000150	-0.000102	-3.481367E-5	T	29340	2017.09.19 14:01:32.708771382	0000678	
61	0.000198	0.000159	-0.000111	-3.985757E-5	T	29340	2017.09.19 14:01:32.718771382	0000678	
61	0.000203	0.000168	-0.000102	-4.896786E-5	T	29340	2017.09.19 14:01:32.728771382	0000678	
62	0.000186	0.000135	-0.000106	-7.268143E-5	T	29333	2017.09.19 14:01:32.838858882	0000678	
62	0.000141	0.000103	-9.626960E-5	-1.045254E-5	T	29333	2017.09.19 14:01:32.848858882	0000678	
62	0.000202	0.000168	-0.000102	-4.396807E-5	T	29333	2017.09.19 14:01:32.858858882	0000678	
62	0.000170	0.000130	-9.675654E-5	-4.867905E-5	T	29333	2017.09.19 14:01:32.868858882	0000678	
62	0.000208	0.000168	-0.000106	-5.895084E-5	T	29333	2017.09.19 14:01:32.878858882	0000678	
62	0.000163	0.000116	-0.000111	-2.950770E-5	T	29333	2017.09.19 14:01:32.888858882	0000678	
62	0.000177	0.000135	-0.000106	-4.368264E-5	T	29333	2017.09.19 14:01:32.898858882	0000678	
62	0.000175	0.000141	-0.000102	-2.074094E-5	T	29333	2017.09.19 14:01:32.908858882	0000678	
62	0.000194	0.000154	-0.000102	-5.885340E-5	T	29333	2017.09.19 14:01:32.918858882	0000678	
62	0.000160	0.000131	-9.162318E-5	-1.570118E-5	T	29333	2017.09.19 14:01:32.928858882	0000678	
63	0.000211	0.000177	-0.000106	-4.402479E-5	T	29341	2017.09.19 14:01:33.038946382	0000678	
63	0.000186	0.000155	-0.000102	-1.585519E-5	T	29341	2017.09.19 14:01:33.048946382	0000678	
63	0.000198	0.000163	-0.000102	-4.392734E-5	T	29341	2017.09.19 14:01:33.058946382	0000678	
63	0.000187	0.000155	-0.000102	-2.485482E-5	T	29341	2017.09.19 14:01:33.068946382	0000678	
63	0.000176	0.000121	-0.000116	-5.352668E-5	T	29341	2017.09.19 14:01:33.078946382	0000678	
63	0.000199	0.000154	-0.000125	-1.175991E-5	T	29341	2017.09.19 14:01:33.088946382	0000678	
63	0.000200	0.000149	-0.000130	-2.969768E-5	T	29341	2017.09.19 14:01:33.098946382	0000678	
63	0.000178	0.000141	-0.000106	-2.472417E-5	T	29341	2017.09.19 14:01:33.108946382	0000678	
63	0.000188	0.000149	-0.000111	-2.977653E-5	T	29341	2017.09.19 14:01:33.118946382	0000678	
63	0.000184	0.000140	-0.000106	-5.372296E-5	T	29341	2017.09.19 14:01:33.128946382	0000678	
64	0.000183	0.000150	-0.000102	-2.981388E-5	T	29347	2017.09.19 14:01:33.239033882	0000678	
64	0.000203	0.000159	-0.000111	-5.885678E-5	T	29347	2017.09.19 14:01:33.249033882	0000678	
64	0.000181	0.000130	-0.000102	-7.265730E-5	T	29347	2017.09.19 14:01:33.259033882	0000678	
64	0.000198	0.000144	-0.000120	-6.369702E-5	T	29347	2017.09.19 14:01:33.269033882	0000678	
64	0.000186	0.000130	-0.000111	-7.261995E-5	T	29347	2017.09.19 14:01:33.279033882	0000678	
64	0.000187	0.000144	-0.000116	-2.971504E-5	T	29347	2017.09.19 14:01:33.289033882	0000678	
64	0.000187	0.000155	-0.000102	-2.485482E-5	T	29347	2017.09.19 14:01:33.299033882	0000678	
64	0.000201	0.000174	-9.224794E-5	-4.405030E-5	T	29347	2017.09.19 14:01:33.309033882	0000678	
64	0.000171	0.000121	-0.000102	-6.358436E-5	T	29347	2017.09.19 14:01:33.319033882	0000678	
64	0.000181	0.000145	-0.000106	-2.475675E-5	T	29347	2017.09.19 14:01:33.329033882	0000678	
65	0.000212	0.000168	-0.000125	-2.987321E-5	T	29337	2017.09.19 14:01:33.439121382	0000678	
65	0.000213	0.000173	-0.000106	-6.399137E-5	T	29337	2017.09.19 14:01:33.449121382	0000678	
65	0.000186	0.000150	-0.000106	-2.979728E-5	T	29337	2017.09.19 14:01:33.459121382	0000678	
65	0.000198	0.000159	-0.000102	-5.889413E-5	T	29337	2017.09.19 14:01:33.469121382	0000678	
65	0.000175	0.000125	-0.000116	-3.955985E-5	T	29337	2017.09.19 14:01:33.479121382	0000678	
65	0.000171	0.000131	-0.000106	-2.964250E-5	T	29337	2017.09.19 14:01:33.489121382	0000678	
65	0.000169	0.000131	-0.000106	-1.564308E-5	T	29337	2017.09.19 14:01:33.499121382	0000678	
65	0.000190	0.000160	-0.000102	-1.589592E-5	T	29337	2017.09.19 14:01:33.509121382	0000678	
65	0.000175	0.000130	-0.000106	-4.864170E-5	T	29337	2017.09.19 14:01:33.519121382	0000678	
65	0.000183	0.000150	-8.702377E-5	-5.887492E-5	T	29337	2017.09.19 14:01:33.529121382	0000678	
66	0.000184	0.000140	-0.000116	-2.968246E-5	T	29334	2017.09.19 14:01:33.639208882	0000678	
66	0.000186	0.000144	-0.000116	-2.071542E-5	T	29334	2017.09.19 14:01:33.649208882	0000678	
66	0.000191	0.000130	-0.000125	-6.356222E-5	T	29334	2017.09.19 14:01:33.659208882	0000678	
66	0.000174	0.000141	-9.185557E-5	-4.378148E-5	T	29334	2017.09.19 14:01:33.669208882	0000678	
66	0.000175	0.000130	-0.000111	-3.462154E-5	T	29334	2017.09.19 14:01:33.679208882	0000678	
66	0.000177	0.000145	-9.684599E-5	-2.979390E-5	T	29334	2017.09.19 14:01:33.689208882	0000678	
66	0.000178	0.000141	-0.000106	-2.972396E-5	T	29334	2017.09.19 14:01:33.699208882	0000678	
66	0.000196	0.000159	-0.000106	-4.387815E-5	T	29334	2017.09.19 14:01:33.709208882	0000678	
66	0.000157	0.000126	-9.158400E-5	-2.066024E-5	T	29334	2017.09.19 14:01:33.719208882	0000678	
66	0.000173	0.000130	-0.000106	-4.364191E-5	T	29334	2017.09.19 14:01:33.729208882	0000678	
67	0.000200	0.000163	-0.000106	-4.391074E-5	T	29345	2017.09.19 14:01:33.839296382	0000678	
67	0.000149	0.000107	-9.643470E-5	-3.948392E-5	T	29345	2017.09.19 14:01:33.849296382	0000678	
67	0.000199	0.000149	-0.000102	-8.281166E-5	T	29345	2017.09.19 14:01:33.859296382	0000678	
67	0.000181	0.000130	-0.000116	-4.860020E-5	T	29345	2017.09.19 14:01:33.869296382	0000678	
67	0.000169	0.000131	-0.000106	-1.564308E-5	T	29345	2017.09.19 14:01:33.879296382	0000678	
67	0.000181	0.000125	-0.000125	-3.952250E-5	T	29345	2017.09.19 14:01:33.889296382	0000678	
67	0.000188	0.000155	-0.000106	-1.183876E-5	T	29345	2017.09.19 14:01:33.899296382	0000678	
67	0.000210	0.000173	-0.000102	-5.900818E-5	T	29345	2017.09.19 14:01:33.909296382	0000678	
67	0.000193	0.000154	-0.000102	-5.385361E-5	T	29345	2017.09.19 14:01:33.919296382	0000678	
67	0.000185	0.000135	-0.000116	-4.864093E-5	T	29345	2017.09.19 14:01:33.929296382	0000678	
68	0.000177	0.000125	-0.000116	-4.855947E-5	T	29360	2017.09.19 14:01:34.039383882	0000678	
68	0.000212	0.000173	-9.736509E-5	-7.302834E-5	T	29360	2017.09.19 14:01:34.049383882	0000678	
68	0.000176	0.000145	-9.188692E-5	-3.981423E-5	T	29360	2017.09.19 14:01:34.059383882	0000678	
68	0.000214	0.000188	-9.737753E-5	-3.514398E-5	T	29360	2017.09.19 14:01:34.069383882	0000678	
68	0.000179	0.000125	-0.000111	-6.357959E-5	T	29360	2017.09.19 14:01:34.079383882	0000678	
68	0.000182	0.000140	-9.693624E-5	-6.375989E-5	T	29360	2017.09.19 14:01:34.089383882	0000678	
68	0.000194	0.000154	-0.000111	-3.981684E-5	T	29360	2017.09.19 14:01:34.099383882	0000678	
68	0.000181	0.000140	-0.000106	-4.372337E-5	T	29360	2017.09.19 14:01:34.109383882	0000678	
68	0.000205	0.000178	-9.723837E-5	-3.006272E-5	T	29360	2017.09.19 14:01:34.119383882	0000678	
68	0.000184	0.000150	-9.696219E-5	-4.383404E-5	T	29360	2017.09.19 14:01:34.129383882	0000678	
69	0.000168	0.000131	-9.673627E-5	-4.367926E-5	T	29345	2017.09.19 14:01:34.239471382	0000678	
69	0.000158	0.000126	-9.162048E-5	-2.965987E-5	T	29345	2017.09.19 14:01:34.249471382	0000678	
69	0.000173	0.000125	-0.000111	-4.358043E-5	T	29345	2017.09.19 14:01:34.259471382	0000678	
69	0.000167	0.000141	-8.676274E-5	-2.080319E-5	T	29345	2017.09.19 14:01:34.269471382	0000678	
69	0.000141	0.000107	-9.129729E-5	-5.506089E-6	T	29345	2017.09.19 14:01:34.279471382	0000678	
69	0.000177	0.000135	-0.000106	-4.368264E-5	T	29345	2017.09.19 14:01:34.289471382	0000678	
69	0.000202	0.000144	-0.000125	-6.767611E-5	T	29345	2017.09.19 14:01:34.299471382	0000678	
69	0.000187	0.000140	-0.000120	-2.966586E-5	T	29345	2017.09.19 14:01:34.309471382	0000678	
69	0.000197	0.000164	-0.000106	-2.991132E-5	T	29345	2017.09.19 14:01:34.319471382	0000678	
69	0.000189	0.000154	-0.000102	-3.985419E-5	T	29345	2017.09.19 14:01:34.329471382	0000678	
70	0.000208	0.000163	-0.000111	-6.388915E-5	T	29341	2017.09.19 14:01:34.439558882	0000678	
70	0.000210	0.000173	-0.000106	-5.399178E-5	T	29341	2017.09.19 14:01:34.449558882	0000678	
70	0.000186	0.000149	-0.000106	-3.479707E-5	T	29341	2017.09.19 14:01:34.459558882	0000678	
70	0.000184	0.000144	-0.000106	-4.375596E-5	T	29341	2017.09.19 14:01:34.469558882	0000678	
70	0.000179	0.000150	-9.192610E-5	-3.485517E-5	T	29341	2017.09.19 14:01:34.479558882	0000678	
70	0.000181	0.000116	-0.000135	-3.440789E-5	T	29341	2017.09.19 14:01:34.489558882	0000678	
70	0.000165	0.000121	-0.000106	-3.456897E-5	T	29341	2017.09.19 14:01:34.499558882	0000678	
70	0.000185	0.000140	-0.000102	-6.373914E-5	T	29341	2017.09.19 14:01:34.509558882	0000678	
70	0.000191	0.000144	-0.000116	-4.871425E-5	T	29341	2017.09.19 14:01:34.519558882	0000678	
70	0.000189	0.000144	-0.000116	-3.971463E-5	T	29341	2017.09.19 14:01:34.529558882	0000678	
71	0.000189	0.000130	-0.000130	-4.354231E-5	T	29363	2017.09.19 14:01:34.639646382	0000678	
71	0.000190	0.000155	-0.000106	-2.983801E-5	T	29363	2017.09.19 14:01:34.649646382	0000678	
71	0.000186	0.000149	-0.000102	-4.381329E-5	T	29363	2017.09.19 14:01:34.659646382	0000678	
71	0.000164	0.000126	-0.000102	-2.961837E-5	T	29363	2017.09.19 14:01:34.669646382	0000678	
71	0.000196	0.000159	-9.714188E-5	-5.891488E-5	T	29363	2017.09.19 14:01:34.679646382	0000678	
71	0.000175	0.000145	-9.680952E-5	-2.079427E-5	T	29363	2017.09.19 14:01:34.689646382	0000678	
71	0.000193	0.000154	-0.000102	-5.385361E-5	T	29363	2017.09.19 14:01:34.699646382	0000678	
71	0.000176	0.000135	-0.000106	-3.968281E-5	T	29363	2017.09.19 14:01:34.709646382	0000678	
71	0.000155	0.000122	-9.157292E-5	-2.962728E-5	T	29363	2017.09.19 14:01:34.719646382	0000678	
71	0.000180	0.000140	-0.000102	-4.873977E-5	T	29363	2017.09.19 14:01:34.729646382	0000678	
72	0.000203	0.000163	-0.000106	-5.891011E-5	T	29350	2017.09.19 14:01:34.839733882	0000678	
72	0.000177	0.000145	-9.684599E-5	-2.979390E-5	T	29350	2017.09.19 14:01:34.849733882	0000678	
72	0.000213	0.000177	-0.000106	-4.902458E-5	T	29350	2017.09.19 14:01:34.859733882	0000678	
72	0.000215	0.000173	-0.000120	-3.993427E-5	T	29350	2017.09.19 14:01:34.869733882	0000678	
72	0.000187	0.000149	-0.000106	-3.979686E-5	T	29350	2017.09.19 14:01:34.879733882	0000678	
72	0.000189	0.000144	-0.000116	-3.971463E-5	T	29350	2017.09.19 14:01:34.889733882	0000678	
72	0.000183	0.000135	-0.000120	-2.962513E-5	T	29350	2017.09.19 14:01:34.899733882	0000678	
72	0.000160	0.000122	-0.000102	-2.058616E-5	T	29350	2017.09.19 14:01:34.909733882	0000678	
72	0.000198	0.000163	-0.000106	-3.491112E-5	T	29350	2017.09.19 14:01:34.919733882	0000678	
72	0.000211	0.000174	-0.000120	-5.935690E-6	T	29350	2017.09.19 14:01:34.929733882	0000678	
73	0.000187	0.000144	-0.000106	-5.375554E-5	T	29339	2017.09.19 14:01:35.039821382	0000678	
73	0.000180	0.000140	-0.000102	-4.873977E-5	T	29339	2017.09.19 14:01:35.049821382	0000678	
73	0.000173	0.000141	-9.679843E-5	-2.976131E-5	T	29339	2017.09.19 14:01:35.059821382	0000678	
73	0.000177	0.000130	-0.000111	-4.362116E-5	T	29339	2017.09.19 14:01:35.069821382	0000678	
73	0.000178	0.000130	-0.000106	-5.864128E-5	T	29339	2017.09.19 14:01:35.079821382	0000678	
73	0.000184	0.000155	-9.694463E-5	-2.487557E-5	T	29339	2017.09.19 14:01:35.089821382	0000678	
73	0.000200	0.000144	-0.000125	-5.867648E-5	T	29339	2017.09.19 14:01:35.099821382	0000678	
73	0.000159	0.000102	-0.000119	-2.035668E-5	T	29339	2017.09.19 14:01:35.109821382	0000678	
73	0.000173	0.000111	-0.000111	-7.246517E-5	T	29339	2017.09.19 14:01:35.119821382	0000678	
73	0.000210	0.000183	-0.000102	-1.608329E-5	T	29339	2017.09.19 14:01:35.129821382	0000678	
74	0.000165	0.000136	-9.170290E-5	-2.074170E-5	T	29339	2017.09.19 14:01:35.239908882	0000678	
74	0.000180	0.000155	-8.696568E-5	-2.991686E-5	T	29339	2017.09.19 14:01:35.249908882	0000678	
74	0.000186	0.000140	-0.000120	-2.466607E-5	T	29339	2017.09.19 14:01:35.259908882	0000678	
74	0.000187	0.000160	-9.692707E-5	-5.917093E-6	T	29339	2017.09.19 14:01:35.269908882	0000678	
74	0.000169	0.000131	-0.000102	-3.465889E-5	T	29339	2017.09.19 14:01:35.279908882	0000678	
74	0.000166	0.000116	-0.000111	-4.350711E-5	T	29339	2017.09.19 14:01:35.289908882	0000678	
74	0.000191	0.000140	-0.000130	-1.062515E-5	T	29339	2017.09.19 14:01:35.299908882	0000678	
74	0.000184	0.000140	-0.000111	-4.370262E-5	T	29339	2017.09.19 14:01:35.309908882	0000678	
74	0.000202	0.000174	-0.000102	-1.010600E-6	T	29339	2017.09.19 14:01:35.319908882	0000678	
74	0.000186	0.000149	-0.000102	-4.381329E-5	T	29339	2017.09.19 14:01:35.329908882	0000678	
75	0.000186	0.000150	-0.000111	-5.777529E-6	T	29356	2017.09.19 14:01:35.439996382	0000678	
75	0.000207	0.000178	-0.000106	-6.026376E-6	T	29356	2017.09.19 14:01:35.449996382	0000678	
75	0.000168	0.000131	-9.673627E-5	-4.367926E-5	T	29356	2017.09.19 14:01:35.459996382	0000678	
75	0.000171	0.000121	-0.000116	-3.452747E-5	T	29356	2017.09.19 14:01:35.469996382	0000678	
75	0.000168	0.000131	-9.673627E-5	-4.367926E-5	T	29356	2017.09.19 14:01:35.479996382	0000678	
75	0.000205	0.000174	-0.000106	-2.499300E-5	T	29356	2017.09.19 14:01:35.489996382	0000678	
75	0.000167	0.000141	-8.676274E-5	-2.080319E-5	T	29356	2017.09.19 14:01:35.499996382	0000678	
75	0.000183	0.000144	-0.000106	-3.975613E-5	T	29356	2017.09.19 14:01:35.509996382	0000678	
75	0.000184	0.000155	-9.694463E-5	-2.487557E-5	T	29356	2017.09.19 14:01:35.519996382	0000678	
75	0.000187	0.000150	-0.000111	-1.577711E-5	T	29356	2017.09.19 14:01:35.529996382	0000678	
76	0.000192	0.000144	-0.000120	-3.969803E-5	T	29337	2017.09.19 14:01:35.640083882	0000678	
76	0.000191	0.000144	-0.000106	-6.775496E-5	T	29337	2017.09.19 14:01:35.650083882	0000678	
76	0.000179	0.000135	-0.000106	-4.868243E-5	T	29337	2017.09.19 14:01:35.660083882	0000678	
76	0.000222	0.000177	-0.000125	-4.894573E-5	T	29337	2017.09.19 14:01:35.670083882	0000678	
76	0.000176	0.000130	-0.000116	-2.060137E-5	T	29337	2017.09.19 14:01:35.680083882	0000678	
76	0.000162	0.000111	-0.000115	-2.044659E-5	T	29337	2017.09.19 14:01:35.690083882	0000678	
76	0.000171	0.000116	-0.000124	-1.545018E-5	T	29337	2017.09.19 14:01:35.700083882	0000678	
76	0.000182	0.000150	-9.198285E-5	-4.885458E-5	T	29337	2017.09.19 14:01:35.710083882	0000678	
76	0.000165	0.000126	-0.000106	-2.060214E-5	T	29337	2017.09.19 14:01:35.720083882	0000678	
76	0.000184	0.000150	-9.696219E-5	-4.383404E-5	T	29337	2017.09.19 14:01:35.730083882	0000678	
77	0.000183	0.000135	-0.000116	-4.364114E-5	T	29357	2017.09.19 14:01:35.840171382	0000678	
77	0.000192	0.000149	-0.000106	-5.879606E-5	T	29357	2017.09.19 14:01:35.850171382	0000678	
77	0.000181	0.000144	-9.692300E-5	-4.879310E-5	T	29357	2017.09.19 14:01:35.860171382	0000678	
77	0.000179	0.000140	-9.689571E-5	-5.376031E-5	T	29357	2017.09.19 14:01:35.870171382	0000678	
77	0.000192	0.000149	-0.000106	-5.879606E-5	T	29357	2017.09.19 14:01:35.880171382	0000678	
77	0.000206	0.000178	-0.000102	-2.504218E-5	T	29357	2017.09.19 14:01:35.890171382	0000678	
77	0.000178	0.000145	-0.000102	-1.577373E-5	T	29357	2017.09.19 14:01:35.900171382	0000678	
77	0.000175	0.000150	-8.688597E-5	-2.487634E-5	T	29357	2017.09.19 14:01:35.910171382	0000678	
77	0.000186	0.000140	-0.000120	-2.066624E-5	T	29357	2017.09.19 14:01:35.920171382	0000678	
77	0.000172	0.000131	-0.000111	-2.062212E-5	T	29357	2017.09.19 14:01:35.930171382	0000678	
78	0.000193	0.000160	-0.000106	-2.487895E-5	T	29342	2017.09.19 14:01:36.040258882	0000678	
78	0.000190	0.000144	-0.000111	-5.373479E-5	T	29342	2017.09.19 14:01:36.050258882	0000678	
78	0.000188	0.000140	-0.000111	-5.870200E-5	T	29342	2017.09.19 14:01:36.060258882	0000678	
78	0.000159	0.000126	-9.164074E-5	-3.465966E-5	T	29342	2017.09.19 14:01:36.070258882	0000678	
78	0.000180	0.000150	-9.688518E-5	-2.483484E-5	T	29342	2017.09.19 14:01:36.080258882	0000678	
78	0.000182	0.000135	-0.000120	-2.062550E-5	T	29342	2017.09.19 14:01:36.090258882	0000678	
78	0.000191	0.000140	-0.000125	-3.464490E-5	T	29342	2017.09.19 14:01:36.100258882	0000678	
78	0.000200	0.000154	-0.000116	-5.379550E-5	T	29342	2017.09.19 14:01:36.110258882	0000678	
78	0.000187	0.000144	-0.000116	-2.971504E-5	T	29342	2017.09.19 14:01:36.120258882	0000678	
78	0.000178	0.000150	-9.190584E-5	-2.985538E-5	T	29342	2017.09.19 14:01:36.130258882	0000678	
79	0.000171	0.000130	-0.000106	-3.464229E-5	T	29335	2017.09.19 14:01:36.240346382	0000678	
79	0.000183	0.000144	-0.000106	-3.975613E-5	T	29335	2017.09.19 14:01:36.250346382	0000678	
79	0.000174	0.000135	-0.000102	-3.969941E-5	T	29335	2017.09.19 14:01:36.260346382	0000678	
79	0.000185	0.000155	-9.202203E-5	-4.389552E-5	T	29335	2017.09.19 14:01:36.270346382	0000678	
79	0.000203	0.000163	-0.000106	-5.891011E-5	T	29335	2017.09.19 14:01:36.280346382	0000678	
79	0.000186	0.000150	-0.000106	-2.979728E-5	T	29335	2017.09.19 14:01:36.290346382	0000678	
79	0.000163	0.000131	-9.660252E-5	-1.068064E-5	T	29335	2017.09.19 14:01:36.300346382	0000678	
79	0.000193	0.000130	-0.000130	-5.854168E-5	T	29335	2017.09.19 14:01:36.310346382	0000678	
79	0.000177	0.000130	-0.000111	-4.362116E-5	T	29335	2017.09.19 14:01:36.320346382	0000678	
79	0.000201	0.000159	-0.000116	-3.983682E-5	T	29335	2017.09.19 14:01:36.330346382	0000678	
80	0.000186	0.000135	-0.000106	-7.268143E-5	T	29342	2017.09.19 14:01:36.440433882	0000678	
80	0.000177	0.000145	-9.684599E-5	-2.979390E-5	T	29342	2017.09.19 14:01:36.450433882	0000678	
80	0.000187	0.000130	-0.000106	-8.264028E-5	T	29342	2017.09.19 14:01:36.460433882	0000678	
80	0.000205	0.000168	-0.000111	-3.493110E-5	T	29342	2017.09.19 14:01:36.470433882	0000678	
80	0.000186	0.000149	-0.000106	-3.479707E-5	T	29342	2017.09.19 14:01:36.480433882	0000678	
80	0.000174	0.000135	-0.000102	-3.969941E-5	T	29342	2017.09.19 14:01:36.490433882	0000678	
80	0.000199	0.000163	-0.000111	-2.489078E-5	T	29342	2017.09.19 14:01:36.500433882	0000678	
80	0.000206	0.000163	-0.000125	-1.183323E-5	T	29342	2017.09.19 14:01:36.510433882	0000678	
80	0.000205	0.000168	-0.000111	-3.493110E-5	T	29342	2017.09.19 14:01:36.520433882	0000678	
80	0.000190	0.000155	-0.000106	-2.983801E-5	T	29342	2017.09.19 14:01:36.530433882	0000678	
81	0.000199	0.000149	-0.000120	-5.373817E-5	T	29341	2017.09.19 14:01:36.640521382	0000678	
81	0.000203	0.000159	-0.000106	-6.787715E-5	T	29341	2017.09.19 14:01:36.650521382	0000678	
81	0.000198	0.000163	-0.000106	-3.491112E-5	T	29341	2017.09.19 14:01:36.660521382	0000678	
81	0.000195	0.000154	-0.000111	-4.381667E-5	T	29341	2017.09.19 14:01:36.670521382	0000678	
81	0.000196	0.000154	-0.000111	-4.881646E-5	T	29341	2017.09.19 14:01:36.680521382	0000678	
81	0.000180	0.000145	-0.000102	-3.477294E-5	T	29341	2017.09.19 14:01:36.690521382	0000678	
81	0.000183	0.000160	-8.304571E-5	-3.497398E-5	T	29341	2017.09.19 14:01:36.700521382	0000678	
81	0.000194	0.000154	-0.000116	-2.079688E-5	T	29341	2017.09.19 14:01:36.710521382	0000678	
81	0.000187	0.000140	-0.000116	-4.368187E-5	T	29341	2017.09.19 14:01:36.720521382	0000678	
81	0.000187	0.000140	-0.000116	-4.368187E-5	T	29341	2017.09.19 14:01:36.730521382	0000678	
82	0.000182	0.000135	-0.000111	-4.866168E-5	T	29332	2017.09.19 14:01:36.840608882	0000678	
82	0.000163	0.000126	-9.666061E-5	-3.963870E-5	T	29332	2017.09.19 14:01:36.850608882	0000678	
82	0.000184	0.000150	-9.696219E-5	-4.383404E-5	T	29332	2017.09.19 14:01:36.860608882	0000678	
82	0.000196	0.000164	-0.000106	-2.091170E-5	T	29332	2017.09.19 14:01:36.870608882	0000678	
82	0.000190	0.000144	-0.000106	-6.375512E-5	T	29332	2017.09.19 14:01:36.880608882	0000678	
82	0.000198	0.000140	-0.000135	-3.960319E-5	T	29332	2017.09.19 14:01:36.890608882	0000678	
82	0.000162	0.000116	-0.000102	-4.854425E-5	T	29332	2017.09.19 14:01:36.900608882	0000678	
82	0.000180	0.000125	-0.000111	-6.757943E-5	T	29332	2017.09.19 14:01:36.910608882	0000678	
82	0.000164	0.000122	-0.000106	-2.956918E-5	T	29332	2017.09.19 14:01:36.920608882	0000678	
82	0.000160	0.000102	-0.000110	-5.339265E-5	T	29332	2017.09.19 14:01:36.930608882	0000678	
83	0.000165	0.000131	-9.667953E-5	-2.967985E-5	T	29352	2017.09.19 14:01:37.040696382	0000678	
83	0.000190	0.000155	-0.000106	-2.983801E-5	T	29352	2017.09.19 14:01:37.050696382	0000678	
83	0.000192	0.000140	-0.000125	-3.964469E-5	T	29352	2017.09.19 14:01:37.060696382	0000678	
83	0.000201	0.000169	-0.000106	-2.995206E-5	T	29352	2017.09.19 14:01:37.070696382	0000678	
83	0.000167	0.000136	-9.175964E-5	-3.474112E-5	T	29352	2017.09.19 14:01:37.080696382	0000678	
83	0.000191	0.000154	-0.000102	-4.885381E-5	T	29352	2017.09.19 14:01:37.090696382	0000678	
83	0.000172	0.000135	-9.183665E-5	-5.374033E-5	T	29352	2017.09.19 14:01:37.100696382	0000678	
83	0.000209	0.000177	-8.739317E-5	-6.810264E-5	T	29352	2017.09.19 14:01:37.110696382	0000678	
83	0.000179	0.000140	-9.689571E-5	-5.376031E-5	T	29352	2017.09.19 14:01:37.120696382	0000678	
83	0.000176	0.000141	-9.685517E-5	-4.376073E-5	T	29352	2017.09.19 14:01:37.130696382	0000678	
84	0.000173	0.000141	-9.677817E-5	-2.476152E-5	T	29355	2017.09.19 14:01:37.240783882	0000678	
84	0.000207	0.000163	-0.000125	-2.483268E-5	T	29355	2017.09.19 14:01:37.250783882	0000678	
84	0.000181	0.000144	-0.000102	-3.977273E-5	T	29355	2017.09.19 14:01:37.260783882	0000678	
84	0.000173	0.000135	-9.681599E-5	-4.871978E-5	T	29355	2017.09.19 14:01:37.270783882	0000678	
84	0.000164	0.000126	-9.667682E-5	-4.363853E-5	T	29355	2017.09.19 14:01:37.280783882	0000678	
84	0.000204	0.000168	-0.000102	-5.396765E-5	T	29355	2017.09.19 14:01:37.290783882	0000678	
84	0.000171	0.000136	-9.181638E-5	-4.874053E-5	T	29355	2017.09.19 14:01:37.300783882	0000678	
84	0.000216	0.000173	-0.000102	-7.800738E-5	T	29355	2017.09.19 14:01:37.310783882	0000678	
84	0.000162	0.000122	-0.000102	-3.458557E-5	T	29355	2017.09.19 14:01:37.320783882	0000678	
84	0.000210	0.000173	-0.000111	-3.997162E-5	T	29355	2017.09.19 14:01:37.330783882	0000678	
85	0.000221	0.000193	-0.000102	-3.516396E-5	T	29345	2017.09.19 14:01:37.440871382	0000678	
85	0.000213	0.000177	-0.000106	-4.902458E-5	T	29345	2017.09.19 14:01:37.450871382	0000678	
85	0.000179	0.000136	-0.000116	-1.064252E-5	T	29345	2017.09.19 14:01:37.460871382	0000678	
85	0.000180	0.000135	-0.000106	-5.368223E-5	T	29345	2017.09.19 14:01:37.470871382	0000678	
85	0.000199	0.000154	-0.000116	-4.879571E-5	T	29345	2017.09.19 14:01:37.480871382	0000678	
85	0.000222	0.000187	-0.000102	-5.912222E-5	T	29345	2017.09.19 14:01:37.490871382	0000678	
85	0.000206	0.000168	-0.000106	-5.395105E-5	T	29345	2017.09.19 14:01:37.500871382	0000678	
85	0.000166	0.000121	-0.000106	-3.956876E-5	T	29345	2017.09.19 14:01:37.510871382	0000678	
85	0.000157	0.000111	-0.000102	-4.350373E-5	T	29345	2017.09.19 14:01:37.520871382	0000678	
85	0.000177	0.000125	-0.000111	-5.857980E-5	T	29345	2017.09.19 14:01:37.530871382	0000678	
86	0.000185	0.000135	-0.000106	-6.768164E-5	T	29342	2017.09.19 14:01:37.640958882	0000678	
86	0.000171	0.000121	-0.000102	-6.358436E-5	T	29342	2017.09.19 14:01:37.650958882	0000678	
86	0.000198	0.000163	-0.000102	-4.392734E-5	T	29342	2017.09.19 14:01:37.660958882	0000678	
86	0.000184	0.000140	-0.000116	-2.468267E-5	T	29342	2017.09.19 14:01:37.670958882	0000678	
86	0.000192	0.000160	-0.000102	-2.989534E-5	T	29342	2017.09.19 14:01:37.680958882	0000678	
86	0.000215	0.000163	-0.000116	-7.786782E-5	T	29342	2017.09.19 14:01:37.690958882	0000678	
86	0.000197	0.000144	-0.000106	-8.275433E-5	T	29342	2017.09.19 14:01:37.700958882	0000678	
86	0.000194	0.000160	-0.000106	-2.987874E-5	T	29342	2017.09.19 14:01:37.710958882	0000678	
86	0.000189	0.000135	-0.000125	-4.360379E-5	T	29342	2017.09.19 14:01:37.720958882	0000678	
86	0.000214	0.000182	-0.000106	-3.506590E-5	T	29342	2017.09.19 14:01:37.730958882	0000678	
87	0.000206	0.000163	-0.000120	-3.485302E-5	T	29358	2017.09.19 14:01:37.841046382	0000678	
87	0.000185	0.000155	-9.202203E-5	-4.389552E-5	T	29358	2017.09.19 14:01:37.851046382	0000678	
87	0.000199	0.000154	-0.000106	-6.783642E-5	T	29358	2017.09.19 14:01:37.861046382	0000678	
87	0.000172	0.000121	-0.000102	-6.758419E-5	T	29358	2017.09.19 14:01:37.871046382	0000678	
87	0.000206	0.000163	-0.000106	-6.790974E-5	T	29358	2017.09.19 14:01:37.881046382	0000678	
87	0.000192	0.000140	-0.000125	-3.964469E-5	T	29358	2017.09.19 14:01:37.891046382	0000678	
87	0.000180	0.000135	-0.000111	-4.366189E-5	T	29358	2017.09.19 14:01:37.901046382	0000678	
87	0.000185	0.000125	-0.000116	-7.255847E-5	T	29358	2017.09.19 14:01:37.911046382	0000678	
87	0.000183	0.000141	-0.000116	-1.568304E-5	T	29358	2017.09.19 14:01:37.921046382	0000678	
87	0.000174	0.000135	-0.000102	-3.969941E-5	T	29358	2017.09.19 14:01:37.931046382	0000678	
88	0.000179	0.000145	-8.696432E-5	-5.883418E-5	T	29356	2017.09.19 14:01:38.041133882	0000678	
88	0.000162	0.000116	-9.663061E-5	-5.856459E-5	T	29356	2017.09.19 14:01:38.051133882	0000678	
88	0.000210	0.000163	-0.000120	-5.385222E-5	T	29356	2017.09.19 14:01:38.061133882	0000678	
88	0.000182	0.000135	-0.000106	-5.868202E-5	T	29356	2017.09.19 14:01:38.071133882	0000678	
88	0.000192	0.000159	-9.212201E-5	-5.393584E-5	T	29356	2017.09.19 14:01:38.081133882	0000678	
88	0.000219	0.000182	-0.000106	-5.906489E-5	T	29356	2017.09.19 14:01:38.091133882	0000678	
88	0.000164	0.000136	-7.781749E-5	-4.879864E-5	T	29356	2017.09.19 14:01:38.101133882	0000678	
88	0.000203	0.000168	-0.000102	-4.896786E-5	T	29356	2017.09.19 14:01:38.111133882	0000678	
88	0.000187	0.000155	-8.310380E-5	-6.393204E-5	T	29356	2017.09.19 14:01:38.121133882	0000678	
88	0.000166	0.000121	-0.000102	-4.858499E-5	T	29356	2017.09.19 14:01:38.131133882	0000678	
89	0.000196	0.000159	-0.000102	-4.889455E-5	T	29359	2017.09.19 14:01:38.241221382	0000678	
89	0.000178	0.000135	-0.000111	-3.466227E-5	T	29359	2017.09.19 14:01:38.251221382	0000678	
89	0.000190	0.000149	-0.000111	-3.977611E-5	T	29359	2017.09.19 14:01:38.261221382	0000678	
89	0.000195	0.000149	-0.000111	-5.877531E-5	T	29359	2017.09.19 14:01:38.271221382	0000678	
89	0.000196	0.000163	-9.714891E-5	-4.894788E-5	T	29359	2017.09.19 14:01:38.281221382	0000678	
89	0.000186	0.000144	-0.000106	-4.875575E-5	T	29359	2017.09.19 14:01:38.291221382	0000678	
89	0.000191	0.000160	-0.000102	-2.489555E-5	T	29359	2017.09.19 14:01:38.301221382	0000678	
89	0.000202	0.000174	-0.000102	-1.600997E-5	T	29359	2017.09.19 14:01:38.311221382	0000678	
89	0.000186	0.000150	-0.000106	-2.979728E-5	T	29359	2017.09.19 14:01:38.321221382	0000678	
89	0.000178	0.000141	-0.000106	-2.972396E-5	T	29359	2017.09.19 14:01:38.331221382	0000678	
90	0.000172	0.000136	-9.679572E-5	-4.371999E-5	T	29354	2017.09.19 14:01:38.441308882	0000678	
90	0.000183	0.000150	-0.000102	-2.981388E-5	T	29354	2017.09.19 14:01:38.451308882	0000678	
90	0.000186	0.000149	-0.000106	-3.479707E-5	T	29354	2017.09.19 14:01:38.461308882	0000678	
90	0.000175	0.000141	-0.000102	-2.474077E-5	T	29354	2017.09.19 14:01:38.471308882	0000678	
90	0.000190	0.000144	-0.000106	-6.375512E-5	T	29354	2017.09.19 14:01:38.481308882	0000678	
90	0.000195	0.000164	-0.000102	-2.992793E-5	T	29354	2017.09.19 14:01:38.491308882	0000678	
90	0.000199	0.000149	-0.000102	-8.281166E-5	T	29354	2017.09.19 14:01:38.501308882	0000678	
90	0.000165	0.000131	-9.667953E-5	-2.967985E-5	T	29354	2017.09.19 14:01:38.511308882	0000678	
90	0.000195	0.000149	-0.000116	-4.875498E-5	T	29354	2017.09.19 14:01:38.521308882	0000678	
90	0.000184	0.000144	-0.000106	-4.375596E-5	T	29354	2017.09.19 14:01:38.531308882	0000678	
91	0.000186	0.000144	-0.000102	-5.877193E-5	T	29344	2017.09.19 14:01:38.641396382	0000678	
91	0.000201	0.000149	-0.000116	-6.775419E-5	T	29344	2017.09.19 14:01:38.651396382	0000678	
91	0.000200	0.000154	-9.717970E-5	-8.287314E-5	T	29344	2017.09.19 14:01:38.661396382	0000678	
91	0.000184	0.000160	-8.702513E-5	-2.995759E-5	T	29344	2017.09.19 14:01:38.671396382	0000678	
91	0.000189	0.000149	-0.000111	-3.477632E-5	T	29344	2017.09.19 14:01:38.681396382	0000678	
91	0.000177	0.000135	-0.000111	-2.966248E-5	T	29344	2017.09.19 14:01:38.691396382	0000678	
91	0.000196	0.000159	-0.000106	-4.387815E-5	T	29344	2017.09.19 14:01:38.701396382	0000678	
91	0.000162	0.000122	-0.000106	-2.056956E-5	T	29344	2017.09.19 14:01:38.711396382	0000678	
91	0.000162	0.000117	-0.000110	-2.050807E-5	T	29344	2017.09.19 14:01:38.721396382	0000678	
91	0.000207	0.000159	-0.000120	-5.381964E-5	T	29344	2017.09.19 14:01:38.731396382	0000678	
92	0.000170	0.000130	-0.000102	-3.965868E-5	T	29348	2017.09.19 14:01:38.841483882	0000678	
92	0.000190	0.000144	-0.000111	-5.373479E-5	T	29348	2017.09.19 14:01:38.851483882	0000678	
92	0.000153	0.000112	-0.000101	-2.450453E-5	T	29348	2017.09.19 14:01:38.861483882	0000678	
92	0.000188	0.000155	-0.000102	-3.485440E-5	T	29348	2017.09.19 14:01:38.871483882	0000678	
92	0.000213	0.000177	-0.000102	-5.904076E-5	T	29348	2017.09.19 14:01:38.881483882	0000678	
92	0.000184	0.000150	-0.000102	-3.481367E-5	T	29348	2017.09.19 14:01:38.891483882	0000678	
92	0.000171	0.000111	-0.000116	-5.844500E-5	T	29348	2017.09.19 14:01:38.901483882	0000678	
92	0.000176	0.000135	-0.000102	-4.869903E-5	T	29348	2017.09.19 14:01:38.911483882	0000678	
92	0.000176	0.000130	-0.000111	-3.962133E-5	T	29348	2017.09.19 14:01:38.921483882	0000678	
92	0.000188	0.000135	-0.000120	-5.362412E-5	T	29348	2017.09.19 14:01:38.931483882	0000678	
93	0.000186	0.000135	-0.000111	-6.366106E-5	T	29332	2017.09.19 14:01:39.041571382	0000678	
93	0.000187	0.000140	-0.000111	-5.370221E-5	T	29332	2017.09.19 14:01:39.051571382	0000678	
93	0.000198	0.000163	-0.000106	-3.491112E-5	T	29332	2017.09.19 14:01:39.061571382	0000678	
93	0.000167	0.000111	-0.000111	-5.846575E-5	T	29332	2017.09.19 14:01:39.071571382	0000678	
93	0.000199	0.000163	-9.718944E-5	-5.894746E-5	T	29332	2017.09.19 14:01:39.081571382	0000678	
93	0.000198	0.000154	-0.000116	-4.379592E-5	T	29332	2017.09.19 14:01:39.091571382	0000678	
93	0.000195	0.000149	-0.000116	-4.875498E-5	T	29332	2017.09.19 14:01:39.101571382	0000678	
93	0.000174	0.000141	-9.681870E-5	-3.476110E-5	T	29332	2017.09.19 14:01:39.111571382	0000678	
93	0.000175	0.000136	-0.000111	-1.066327E-5	T	29332	2017.09.19 14:01:39.121571382	0000678	
93	0.000141	8.747904E-5	-0.000105	-3.429200E-5	T	29332	2017.09.19 14:01:39.131571382	0000678	
94	0.000158	0.000106	-0.000110	-3.942582E-5	T	29354	2017.09.19 14:01:39.241658882	0000678	
94	0.000181	0.000140	-9.195284E-5	-6.778047E-5	T	29354	2017.09.19 14:01:39.251658882	0000678	
94	0.000181	0.000144	-9.692300E-5	-4.879310E-5	T	29354	2017.09.19 14:01:39.261658882	0000678	
94	0.000174	0.000141	-0.000102	-1.741730E-6	T	29354	2017.09.19 14:01:39.271658882	0000678	
94	0.000195	0.000159	-0.000106	-3.487853E-5	T	29354	2017.09.19 14:01:39.281658882	0000678	
94	0.000191	0.000160	-0.000102	-2.089572E-5	T	29354	2017.09.19 14:01:39.291658882	0000678	
94	0.000176	0.000121	-0.000102	-7.758377E-5	T	29354	2017.09.19 14:01:39.301658882	0000678	
94	0.000190	0.000155	-0.000106	-2.983801E-5	T	29354	2017.09.19 14:01:39.311658882	0000678	
94	0.000176	0.000145	-9.682573E-5	-2.479410E-5	T	29354	2017.09.19 14:01:39.321658882	0000678	
94	0.000177	0.000150	-9.186936E-5	-2.085575E-5	T	29354	2017.09.19 14:01:39.331658882	0000678	
95	0.000189	0.000155	-0.000106	-2.083838E-5	T	29349	2017.09.19 14:01:39.441746382	0000678	
95	0.000184	0.000155	-9.694463E-5	-2.487557E-5	T	29349	2017.09.19 14:01:39.451746382	0000678	
95	0.000149	0.000112	-9.641714E-5	-2.052544E-5	T	29349	2017.09.19 14:01:39.461746382	0000678	
95	0.000164	9.710731E-5	-0.000110	-7.235112E-5	T	29349	2017.09.19 14:01:39.471746382	0000678	
95	0.000184	0.000144	-0.000111	-2.973579E-5	T	29349	2017.09.19 14:01:39.481746382	0000678	
95	0.000183	0.000125	-0.000120	-5.854245E-5	T	29349	2017.09.19 14:01:39.491746382	0000678	
95	0.000216	0.000182	-0.000102	-5.408170E-5	T	29349	2017.09.19 14:01:39.501746382	0000678	
95	0.000190	0.000155	-0.000106	-2.983801E-5	T	29349	2017.09.19 14:01:39.511746382	0000678	
95	0.000166	0.000122	-0.000111	-2.054881E-5	T	29349	2017.09.19 14:01:39.521746382	0000678	
95	0.000174	0.000136	-0.000106	-2.968323E-5	T	29349	2017.09.19 14:01:39.531746382	0000678	
96	0.000199	0.000154	-0.000120	-3.977949E-5	T	29339	2017.09.19 14:01:39.641833882	0000678	
96	0.000176	0.000130	-0.000111	-3.962133E-5	T	29339	2017.09.19 14:01:39.651833882	0000678	
96	0.000172	0.000136	-9.679572E-5	-4.371999E-5	T	29339	2017.09.19 14:01:39.661833882	0000678	
96	0.000187	0.000135	-0.000125	-3.460417E-5	T	29339	2017.09.19 14:01:39.671833882	0000678	
96	0.000198	0.000163	-9.716918E-5	-5.394767E-5	T	29339	2017.09.19 14:01:39.681833882	0000678	
96	0.000178	0.000145	-0.000102	-1.577373E-5	T	29339	2017.09.19 14:01:39.691833882	0000678	
96	0.000204	0.000159	-0.000116	-5.383624E-5	T	29339	2017.09.19 14:01:39.701833882	0000678	
96	0.000176	0.000130	-0.000111	-3.962133E-5	T	29339	2017.09.19 14:01:39.711833882	0000678	
96	0.000178	0.000130	-0.000116	-3.460079E-5	T	29339	2017.09.19 14:01:39.721833882	0000678	
96	0.000201	0.000159	-0.000116	-3.983682E-5	T	29339	2017.09.19 14:01:39.731833882	0000678	
97	0.000206	0.000173	-0.000102	-4.400880E-5	T	29328	2017.09.19 14:01:39.841921382	0000678	
97	0.000187	0.000149	-9.204364E-5	-6.385396E-5	T	29328	2017.09.19 14:01:39.851921382	0000678	
97	0.000189	0.000149	-0.000111	-3.477632E-5	T	29328	2017.09.19 14:01:39.861921382	0000678	
97	0.000181	0.000145	-0.000106	-2.475675E-5	T	29328	2017.09.19 14:01:39.871921382	0000678	
97	0.000180	0.000135	-0.000106	-5.368223E-5	T	29328	2017.09.19 14:01:39.881921382	0000678	
97	0.000176	0.000125	-0.000116	-4.355968E-5	T	29328	2017.09.19 14:01:39.891921382	0000678	
97	0.000179	0.000135	-0.000111	-3.966206E-5	T	29328	2017.09.19 14:01:39.901921382	0000678	
97	0.000195	0.000135	-0.000120	-7.262333E-5	T	29328	2017.09.19 14:01:39.911921382	0000678	
97	0.000176	0.000130	-9.683355E-5	-6.767826E-5	T	29328	2017.09.19 14:01:39.921921382	0000678	
97	0.000187	0.000140	-0.000116	-4.368187E-5	T	29328	2017.09.19 14:01:39.931921382	0000678	
98	0.000179	0.000145	-0.000102	-2.977315E-5	T	29358	2017.09.19 14:01:40.042008882	0000678	
98	0.000173	0.000116	-0.000102	-7.754304E-5	T	29358	2017.09.19 14:01:40.052008882	0000678	
98	0.000182	0.000135	-0.000106	-5.868202E-5	T	29358	2017.09.19 14:01:40.062008882	0000678	
98	0.000186	0.000149	-0.000102	-4.381329E-5	T	29358	2017.09.19 14:01:40.072008882	0000678	
98	0.000193	0.000164	-9.709217E-5	-3.494847E-5	T	29358	2017.09.19 14:01:40.082008882	0000678	
98	0.000180	0.000135	-0.000116	-2.464194E-5	T	29358	2017.09.19 14:01:40.092008882	0000678	
98	0.000199	0.000154	-0.000125	-1.075995E-5	T	29358	2017.09.19 14:01:40.102008882	0000678	
98	0.000186	0.000150	-0.000111	-6.777488E-6	T	29358	2017.09.19 14:01:40.112008882	0000678	
98	0.000209	0.000163	-0.000116	-5.886861E-5	T	29358	2017.09.19 14:01:40.122008882	0000678	
98	0.000169	0.000141	-8.681949E-5	-3.480260E-5	T	29358	2017.09.19 14:01:40.132008882	0000678	
99	0.000178	0.000135	-0.000111	-3.466227E-5	T	29360	2017.09.19 14:01:40.242096382	0000678	
99	0.000176	0.000141	-9.685517E-5	-4.376073E-5	T	29360	2017.09.19 14:01:40.252096382	0000678	
99	0.000181	0.000135	-0.000116	-3.464152E-5	T	29360	2017.09.19 14:01:40.262096382	0000678	
99	0.000176	0.000135	-0.000106	-3.968281E-5	T	29360	2017.09.19 14:01:40.272096382	0000678	
99	0.000171	0.000125	-0.000106	-4.860097E-5	T	29360	2017.09.19 14:01:40.282096382	0000678	
99	0.000181	0.000155	-8.302274E-5	-4.393287E-5	T	29360	2017.09.19 14:01:40.292096382	0000678	
99	0.000179	0.000135	-0.000111	-3.966206E-5	T	29360	2017.09.19 14:01:40.302096382	0000678	
99	0.000189	0.000154	-9.704190E-5	-4.887456E-5	T	29360	2017.09.19 14:01:40.312096382	0000678	
99	0.000181	0.000130	-0.000111	-5.862053E-5	T	29360	2017.09.19 14:01:40.322096382	0000678	
99	0.000181	0.000140	-0.000106	-4.372337E-5	T	29360	2017.09.19 14:01:40.332096382	0000678	
100	0.000171	0.000116	-0.000116	-4.848615E-5	T	29341	2017.09.19 14:01:40.442183882	0000678	
100	0.000177	0.000145	-9.684599E-5	-2.979390E-5	T	29341	2017.09.19 14:01:40.452183882	0000678	
100	0.000196	0.000149	-0.000120	-4.373859E-5	T	29341	2017.09.19 14:01:40.462183882	0000678	
100	0.000187	0.000140	-0.000106	-6.372254E-5	T	29341	2017.09.19 14:01:40.472183882	0000678	
100	0.000193	0.000149	-0.000116	-3.975536E-5	T	29341	2017.09.19 14:01:40.482183882	0000678	
100	0.000163	0.000136	-8.276035E-5	-3.477847E-5	T	29341	2017.09.19 14:01:40.492183882	0000678	
100	0.000201	0.000169	-0.000106	-2.495227E-5	T	29341	2017.09.19 14:01:40.502183882	0000678	
100	0.000176	0.000121	-0.000102	-7.758377E-5	T	29341	2017.09.19 14:01:40.512183882	0000678	
100	0.000200	0.000159	-0.000111	-4.885720E-5	T	29341	2017.09.19 14:01:40.522183882	0000678	
100	0.000191	0.000149	-0.000116	-2.475599E-5	T	29341	2017.09.19 14:01:40.532183882	0000678	
101	0.000205	0.000159	-0.000102	-7.789333E-5	T	29363	2017.09.19 14:01:40.642271382	0000678	
101	0.000180	0.000135	-0.000111	-4.366189E-5	T	29363	2017.09.19 14:01:40.652271382	0000678	
101	0.000174	0.000130	-0.000102	-5.365809E-5	T	29363	2017.09.19 14:01:40.662271382	0000678	
101	0.000166	0.000111	-0.000106	-6.348630E-5	T	29363	2017.09.19 14:01:40.672271382	0000678	
101	0.000194	0.000154	-0.000102	-5.885340E-5	T	29363	2017.09.19 14:01:40.682271382	0000678	
101	0.000203	0.000168	-9.724889E-5	-5.898819E-5	T	29363	2017.09.19 14:01:40.692271382	0000678	
101	0.000175	0.000141	-9.683896E-5	-3.976089E-5	T	29363	2017.09.19 14:01:40.702271382	0000678	
101	0.000188	0.000144	-0.000106	-5.875533E-5	T	29363	2017.09.19 14:01:40.712271382	0000678	
101	0.000201	0.000178	-8.329621E-5	-4.412024E-5	T	29363	2017.09.19 14:01:40.722271382	0000678	
101	0.000214	0.000173	-0.000102	-7.300759E-5	T	29363	2017.09.19 14:01:40.732271382	0000678	
102	0.000194	0.000154	-0.000111	-3.981684E-5	T	29361	2017.09.19 14:01:40.842358882	0000678	
102	0.000194	0.000159	-9.712162E-5	-5.391509E-5	T	29361	2017.09.19 14:01:40.852358882	0000678	
102	0.000192	0.000154	-0.000106	-3.983759E-5	T	29361	2017.09.19 14:01:40.862358882	0000678	
102	0.000192	0.000149	-0.000106	-5.879606E-5	T	29361	2017.09.19 14:01:40.872358882	0000678	
102	0.000173	0.000121	-0.000106	-6.356776E-5	T	29361	2017.09.19 14:01:40.882358882	0000678	
102	0.000166	0.000116	-0.000115	-2.448716E-5	T	29361	2017.09.19 14:01:40.892358882	0000678	
102	0.000197	0.000159	-0.000102	-5.389434E-5	T	29361	2017.09.19 14:01:40.902358882	0000678	
102	0.000200	0.000168	-9.222902E-5	-5.400915E-5	T	29361	2017.09.19 14:01:40.912358882	0000678	
102	0.000200	0.000154	-9.717970E-5	-8.287314E-5	T	29361	2017.09.19 14:01:40.922358882	0000678	
102	0.000197	0.000169	-0.000102	-9.698686E-7	T	29361	2017.09.19 14:01:40.932358882	0000678	
103	0.000189	0.000144	-0.000116	-3.971463E-5	T	29352	2017.09.19 14:01:41.042446382	0000678	
103	0.000216	0.000177	-0.000111	-5.400362E-5	T	29352	2017.09.19 14:01:41.052446382	0000678	
103	0.000186	0.000144	-0.000111	-3.973538E-5	T	29352	2017.09.19 14:01:41.062446382	0000678	
103	0.000192	0.000154	-0.000106	-3.983759E-5	T	29352	2017.09.19 14:01:41.072446382	0000678	
103	0.000157	0.000122	-9.655226E-5	-2.460674E-5	T	29352	2017.09.19 14:01:41.082446382	0000678	
103	0.000188	0.000140	-0.000106	-6.772237E-5	T	29352	2017.09.19 14:01:41.092446382	0000678	
103	0.000171	0.000141	-9.179883E-5	-2.978206E-5	T	29352	2017.09.19 14:01:41.102446382	0000678	
103	0.000197	0.000159	-0.000111	-3.485778E-5	T	29352	2017.09.19 14:01:41.112446382	0000678	
103	0.000213	0.000177	-0.000102	-5.904076E-5	T	29352	2017.09.19 14:01:41.122446382	0000678	
103	0.000167	0.000126	-0.000106	-2.960177E-5	T	29352	2017.09.19 14:01:41.132446382	0000678	
104	0.000205	0.000173	-9.726781E-5	-4.902934E-5	T	29372	2017.09.19 14:01:41.242533882	0000678	
104	0.000184	0.000144	-0.000111	-2.973579E-5	T	29372	2017.09.19 14:01:41.252533882	0000678	
104	0.000192	0.000144	-0.000120	-3.969803E-5	T	29372	2017.09.19 14:01:41.262533882	0000678	
104	0.000213	0.000177	-0.000111	-4.000421E-5	T	29372	2017.09.19 14:01:41.272533882	0000678	
104	0.000180	0.000130	-0.000116	-4.360041E-5	T	29372	2017.09.19 14:01:41.282533882	0000678	
104	0.000172	0.000130	-0.000102	-4.865830E-5	T	29372	2017.09.19 14:01:41.292533882	0000678	
104	0.000215	0.000177	-0.000106	-5.902416E-5	T	29372	2017.09.19 14:01:41.302533882	0000678	
104	0.000196	0.000164	-0.000102	-3.492772E-5	T	29372	2017.09.19 14:01:41.312533882	0000678	
104	0.000180	0.000135	-9.689300E-5	-6.771899E-5	T	29372	2017.09.19 14:01:41.322533882	0000678	
104	0.000173	0.000141	-8.291707E-5	-5.881820E-5	T	29372	2017.09.19 14:01:41.332533882	0000678	
