Block	B	Bx	By	Bz	Units	Temperature	Timestamp	Serial No.	Comment
0	0.000321	-0.000230	-0.000220	-4.022353E-5	T	29494	2017.09.19 16:33:26.501835971	0000678	
0	0.000302	-0.000202	-0.000212	-7.448756E-5	T	29494	2017.09.19 16:33:26.511835971	0000678	
0	0.000327	-0.000221	-0.000226	-8.327430E-5	T	29494	2017.09.19 16:33:26.521835971	0000678	
0	0.000304	-0.000206	-0.000216	-6.043896E-5	T	29494	2017.09.19 16:33:26.531835971	0000678	
0	0.000330	-0.000235	-0.000216	-8.320175E-5	T	29494	2017.09.19 16:33:26.541835971	0000678	
0	0.000304	-0.000206	-0.000221	-3.641921E-5	T	29494	2017.09.19 16:33:26.551835971	0000678	
0	0.000297	-0.000202	-0.000212	-5.048856E-5	T	29494	2017.09.19 16:33:26.561835971	0000678	
0	0.000343	-0.000249	-0.000230	-5.002683E-5	T	29494	2017.09.19 16:33:26.571835971	0000678	
0	0.000331	-0.000244	-0.000215	-6.012940E-5	T	29494	2017.09.19 16:33:26.581835971	0000678	
0	0.000334	-0.000240	-0.000220	-7.414065E-5	T	29494	2017.09.19 16:33:26.591835971	0000678	
1	0.000310	-0.000211	-0.000221	-5.037789E-5	T	29491	2017.09.19 16:33:26.601879721	0000678	
1	0.000330	-0.000235	-0.000225	-5.516142E-5	T	29491	2017.09.19 16:33:26.611879721	0000678	
1	0.000319	-0.000221	-0.000226	-4.527589E-5	T	29491	2017.09.19 16:33:26.621879721	0000678	
1	0.000319	-0.000225	-0.000221	-5.026385E-5	T	29491	2017.09.19 16:33:26.631879721	0000678	
1	0.000322	-0.000221	-0.000212	-9.833177E-5	T	29491	2017.09.19 16:33:26.641879721	0000678	
1	0.000323	-0.000211	-0.000231	-7.933518E-5	T	29491	2017.09.19 16:33:26.651879721	0000678	
1	0.000335	-0.000235	-0.000230	-6.014046E-5	T	29491	2017.09.19 16:33:26.661879721	0000678	
1	0.000323	-0.000235	-0.000215	-5.020313E-5	T	29491	2017.09.19 16:33:26.671879721	0000678	
1	0.000352	-0.000244	-0.000248	-4.999286E-5	T	29491	2017.09.19 16:33:26.681879721	0000678	
1	0.000369	-0.000264	-0.000248	-7.383708E-5	T	29491	2017.09.19 16:33:26.691879721	0000678	
2	0.000312	-0.000221	-0.000212	-6.033336E-5	T	29487	2017.09.19 16:33:26.701923471	0000678	
2	0.000297	-0.000197	-0.000216	-5.051269E-5	T	29487	2017.09.19 16:33:26.711923471	0000678	
2	0.000339	-0.000249	-0.000220	-6.406775E-5	T	29487	2017.09.19 16:33:26.721923471	0000678	
2	0.000323	-0.000235	-0.000207	-7.923927E-5	T	29487	2017.09.19 16:33:26.731923471	0000678	
2	0.000342	-0.000259	-0.000220	-3.998729E-5	T	29487	2017.09.19 16:33:26.741923471	0000678	
2	0.000330	-0.000235	-0.000225	-5.016163E-5	T	29487	2017.09.19 16:33:26.751923471	0000678	
2	0.000315	-0.000240	-0.000197	-5.523689E-5	T	29487	2017.09.19 16:33:26.761923471	0000678	
2	0.000330	-0.000235	-0.000225	-5.516142E-5	T	29487	2017.09.19 16:33:26.771923471	0000678	
2	0.000296	-0.000216	-0.000198	-4.543282E-5	T	29487	2017.09.19 16:33:26.781923471	0000678	
2	0.000303	-0.000216	-0.000212	-1.737589E-5	T	29487	2017.09.19 16:33:26.791923471	0000678	
3	0.000302	-0.000192	-0.000226	-5.551171E-5	T	29492	2017.09.19 16:33:26.801967221	0000678	
3	0.000342	-0.000254	-0.000220	-6.002718E-5	T	29492	2017.09.19 16:33:26.811967221	0000678	
3	0.000294	-0.000197	-0.000216	-3.651328E-5	T	29492	2017.09.19 16:33:26.821967221	0000678	
3	0.000336	-0.000230	-0.000235	-6.916422E-5	T	29492	2017.09.19 16:33:26.831967221	0000678	
3	0.000333	-0.000217	-0.000240	-7.925710E-5	T	29492	2017.09.19 16:33:26.841967221	0000678	
3	0.000338	-0.000235	-0.000234	-6.012386E-5	T	29492	2017.09.19 16:33:26.851967221	0000678	
3	0.000302	-0.000183	-0.000231	-6.456390E-5	T	29492	2017.09.19 16:33:26.861967221	0000678	
3	0.000305	-0.000206	-0.000207	-8.847514E-5	T	29492	2017.09.19 16:33:26.871967221	0000678	
3	0.000345	-0.000244	-0.000230	-7.906635E-5	T	29492	2017.09.19 16:33:26.881967221	0000678	
3	0.000333	-0.000254	-0.000206	-6.408512E-5	T	29492	2017.09.19 16:33:26.891967221	0000678	
4	0.000337	-0.000249	-0.000220	-5.506812E-5	T	29485	2017.09.19 16:33:26.902010971	0000678	
4	0.000322	-0.000216	-0.000221	-8.833557E-5	T	29485	2017.09.19 16:33:26.912010971	0000678	
4	0.000314	-0.000216	-0.000212	-8.337313E-5	T	29485	2017.09.19 16:33:26.922010971	0000678	
4	0.000347	-0.000259	-0.000215	-8.300624E-5	T	29485	2017.09.19 16:33:26.932010971	0000678	
4	0.000310	-0.000206	-0.000231	-1.737850E-5	T	29485	2017.09.19 16:33:26.942010971	0000678	
4	0.000343	-0.000235	-0.000240	-6.910274E-5	T	29485	2017.09.19 16:33:26.952010971	0000678	
4	0.000302	-0.000221	-0.000202	-4.537549E-5	T	29485	2017.09.19 16:33:26.962010971	0000678	
4	0.000301	-0.000192	-0.000226	-5.051192E-5	T	29485	2017.09.19 16:33:26.972010971	0000678	
4	0.000317	-0.000211	-0.000226	-6.935635E-5	T	29485	2017.09.19 16:33:26.982010971	0000678	
4	0.000299	-0.000211	-0.000207	-4.543620E-5	T	29485	2017.09.19 16:33:26.992010971	0000678	
5	0.000320	-0.000235	-0.000202	-7.926002E-5	T	29493	2017.09.19 16:33:27.002054721	0000678	
5	0.000348	-0.000249	-0.000225	-8.804600E-5	T	29493	2017.09.19 16:33:27.012054721	0000678	
5	0.000308	-0.000225	-0.000207	-4.032236E-5	T	29493	2017.09.19 16:33:27.022054721	0000678	
5	0.000342	-0.000240	-0.000234	-6.408296E-5	T	29493	2017.09.19 16:33:27.032054721	0000678	
5	0.000316	-0.000225	-0.000216	-5.028460E-5	T	29493	2017.09.19 16:33:27.042054721	0000678	
5	0.000331	-0.000244	-0.000211	-7.414541E-5	T	29493	2017.09.19 16:33:27.052054721	0000678	
5	0.000324	-0.000230	-0.000212	-8.325908E-5	T	29493	2017.09.19 16:33:27.062054721	0000678	
5	0.000310	-0.000206	-0.000231	-1.737850E-5	T	29493	2017.09.19 16:33:27.072054721	0000678	
5	0.000302	-0.000188	-0.000226	-6.954371E-5	T	29493	2017.09.19 16:33:27.082054721	0000678	
5	0.000311	-0.000216	-0.000221	-4.033758E-5	T	29493	2017.09.19 16:33:27.092054721	0000678	
6	0.000316	-0.000225	-0.000216	-5.528439E-5	T	29490	2017.09.19 16:33:27.102098471	0000678	
6	0.000339	-0.000254	-0.000215	-6.404777E-5	T	29490	2017.09.19 16:33:27.112098471	0000678	
6	0.000304	-0.000197	-0.000221	-6.949115E-5	T	29490	2017.09.19 16:33:27.122098471	0000678	
6	0.000332	-0.000244	-0.000215	-6.412923E-5	T	29490	2017.09.19 16:33:27.132098471	0000678	
6	0.000336	-0.000235	-0.000230	-6.414030E-5	T	29490	2017.09.19 16:33:27.142098471	0000678	
6	0.000317	-0.000221	-0.000216	-6.931639E-5	T	29490	2017.09.19 16:33:27.152098471	0000678	
6	0.000314	-0.000211	-0.000226	-5.535693E-5	T	29490	2017.09.19 16:33:27.162098471	0000678	
6	0.000345	-0.000249	-0.000230	-6.002642E-5	T	29490	2017.09.19 16:33:27.172098471	0000678	
6	0.000300	-0.000221	-0.000202	-2.637628E-5	T	29490	2017.09.19 16:33:27.182098471	0000678	
6	0.000350	-0.000249	-0.000234	-7.400923E-5	T	29490	2017.09.19 16:33:27.192098471	0000678	
7	0.000319	-0.000230	-0.000212	-6.425988E-5	T	29493	2017.09.19 16:33:27.202142221	0000678	
7	0.000332	-0.000235	-0.000230	-4.014130E-5	T	29493	2017.09.19 16:33:27.212142221	0000678	
7	0.000332	-0.000235	-0.000225	-6.416105E-5	T	29493	2017.09.19 16:33:27.222142221	0000678	
7	0.000308	-0.000211	-0.000212	-7.441424E-5	T	29493	2017.09.19 16:33:27.232142221	0000678	
7	0.000341	-0.000244	-0.000230	-6.006715E-5	T	29493	2017.09.19 16:33:27.242142221	0000678	
7	0.000309	-0.000221	-0.000207	-6.435395E-5	T	29493	2017.09.19 16:33:27.252142221	0000678	
7	0.000320	-0.000235	-0.000211	-5.021973E-5	T	29493	2017.09.19 16:33:27.262142221	0000678	
7	0.000318	-0.000230	-0.000215	-4.024428E-5	T	29493	2017.09.19 16:33:27.272142221	0000678	
7	0.000340	-0.000244	-0.000234	-3.605155E-5	T	29493	2017.09.19 16:33:27.282142221	0000678	
7	0.000310	-0.000225	-0.000211	-3.130199E-5	T	29493	2017.09.19 16:33:27.292142221	0000678	
8	0.000314	-0.000221	-0.000216	-5.531697E-5	T	29502	2017.09.19 16:33:27.302185971	0000678	
8	0.000324	-0.000244	-0.000211	-3.114721E-5	T	29502	2017.09.19 16:33:27.312185971	0000678	
8	0.000324	-0.000240	-0.000215	-3.616299E-5	T	29502	2017.09.19 16:33:27.322185971	0000678	
8	0.000313	-0.000206	-0.000231	-4.537733E-5	T	29502	2017.09.19 16:33:27.332185971	0000678	
8	0.000323	-0.000230	-0.000221	-5.522290E-5	T	29502	2017.09.19 16:33:27.342185971	0000678	
8	0.000313	-0.000225	-0.000212	-5.030120E-5	T	29502	2017.09.19 16:33:27.352185971	0000678	
8	0.000318	-0.000216	-0.000221	-7.433616E-5	T	29502	2017.09.19 16:33:27.362185971	0000678	
8	0.000307	-0.000206	-0.000226	-3.139867E-5	T	29502	2017.09.19 16:33:27.372185971	0000678	
8	0.000328	-0.000221	-0.000235	-6.023791E-5	T	29502	2017.09.19 16:33:27.382185971	0000678	
8	0.000312	-0.000230	-0.000206	-4.528142E-5	T	29502	2017.09.19 16:33:27.392185971	0000678	
9	0.000332	-0.000221	-0.000240	-6.021716E-5	T	29482	2017.09.19 16:33:27.402229721	0000678	
9	0.000309	-0.000188	-0.000226	-9.354271E-5	T	29482	2017.09.19 16:33:27.412229721	0000678	
9	0.000326	-0.000240	-0.000215	-4.516261E-5	T	29482	2017.09.19 16:33:27.422229721	0000678	
9	0.000325	-0.000221	-0.000231	-6.025451E-5	T	29482	2017.09.19 16:33:27.432229721	0000678	
9	0.000302	-0.000197	-0.000221	-6.049152E-5	T	29482	2017.09.19 16:33:27.442229721	0000678	
9	0.000308	-0.000216	-0.000207	-7.439426E-5	T	29482	2017.09.19 16:33:27.452229721	0000678	
9	0.000348	-0.000254	-0.000220	-8.802601E-5	T	29482	2017.09.19 16:33:27.462229721	0000678	
9	0.000322	-0.000235	-0.000211	-6.021931E-5	T	29482	2017.09.19 16:33:27.472229721	0000678	
9	0.000313	-0.000197	-0.000235	-6.043342E-5	T	29482	2017.09.19 16:33:27.482229721	0000678	
9	0.000307	-0.000211	-0.000221	-3.137869E-5	T	29482	2017.09.19 16:33:27.492229721	0000678	
10	0.000346	-0.000244	-0.000244	-2.601047E-5	T	29497	2017.09.19 16:33:27.502273471	0000678	
10	0.000340	-0.000230	-0.000240	-6.914347E-5	T	29497	2017.09.19 16:33:27.512273471	0000678	
10	0.000323	-0.000225	-0.000226	-5.024309E-5	T	29497	2017.09.19 16:33:27.522273471	0000678	
10	0.000341	-0.000226	-0.000240	-8.818341E-5	T	29497	2017.09.19 16:33:27.532273471	0000678	
10	0.000334	-0.000249	-0.000220	-3.106913E-5	T	29497	2017.09.19 16:33:27.542273471	0000678	
10	0.000318	-0.000225	-0.000212	-7.430019E-5	T	29497	2017.09.19 16:33:27.552273471	0000678	
10	0.000313	-0.000225	-0.000212	-5.030120E-5	T	29497	2017.09.19 16:33:27.562273471	0000678	
10	0.000316	-0.000216	-0.000221	-6.433658E-5	T	29497	2017.09.19 16:33:27.572273471	0000678	
10	0.000338	-0.000230	-0.000235	-7.916380E-5	T	29497	2017.09.19 16:33:27.582273471	0000678	
10	0.000315	-0.000221	-0.000212	-7.433278E-5	T	29497	2017.09.19 16:33:27.592273471	0000678	
11	0.000317	-0.000225	-0.000216	-6.028418E-5	T	29489	2017.09.19 16:33:27.602317221	0000678	
11	0.000323	-0.000216	-0.000231	-6.429508E-5	T	29489	2017.09.19 16:33:27.612317221	0000678	
11	0.000317	-0.000221	-0.000221	-5.529622E-5	T	29489	2017.09.19 16:33:27.622317221	0000678	
11	0.000321	-0.000225	-0.000226	-3.624368E-5	T	29489	2017.09.19 16:33:27.632317221	0000678	
11	0.000325	-0.000230	-0.000221	-6.422253E-5	T	29489	2017.09.19 16:33:27.642317221	0000678	
11	0.000318	-0.000211	-0.000221	-8.837631E-5	T	29489	2017.09.19 16:33:27.652317221	0000678	
11	0.000297	-0.000192	-0.000216	-6.955263E-5	T	29489	2017.09.19 16:33:27.662317221	0000678	
11	0.000356	-0.000268	-0.000225	-6.389222E-5	T	29489	2017.09.19 16:33:27.672317221	0000678	
11	0.000311	-0.000197	-0.000226	-8.346981E-5	T	29489	2017.09.19 16:33:27.682317221	0000678	
11	0.000328	-0.000225	-0.000235	-4.020616E-5	T	29489	2017.09.19 16:33:27.692317221	0000678	
12	0.000328	-0.000230	-0.000230	-3.618220E-5	T	29494	2017.09.19 16:33:27.702360971	0000678	
12	0.000316	-0.000206	-0.000221	-9.341683E-5	T	29494	2017.09.19 16:33:27.712360971	0000678	
12	0.000318	-0.000216	-0.000226	-6.031599E-5	T	29494	2017.09.19 16:33:27.722360971	0000678	
12	0.000329	-0.000235	-0.000220	-6.418180E-5	T	29494	2017.09.19 16:33:27.732360971	0000678	
12	0.000325	-0.000221	-0.000221	-8.829484E-5	T	29494	2017.09.19 16:33:27.742360971	0000678	
12	0.000308	-0.000202	-0.000226	-5.543025E-5	T	29494	2017.09.19 16:33:27.752360971	0000678	
12	0.000319	-0.000221	-0.000221	-6.429585E-5	T	29494	2017.09.19 16:33:27.762360971	0000678	
12	0.000309	-0.000206	-0.000226	-4.539808E-5	T	29494	2017.09.19 16:33:27.772360971	0000678	
12	0.000307	-0.000225	-0.000198	-6.935850E-5	T	29494	2017.09.19 16:33:27.782360971	0000678	
12	0.000333	-0.000244	-0.000215	-6.912902E-5	T	29494	2017.09.19 16:33:27.792360971	0000678	
13	0.000317	-0.000211	-0.000231	-5.033639E-5	T	29490	2017.09.19 16:33:27.802404721	0000678	
13	0.000340	-0.000240	-0.000230	-6.909936E-5	T	29490	2017.09.19 16:33:27.812404721	0000678	
13	0.000321	-0.000225	-0.000226	-4.024351E-5	T	29490	2017.09.19 16:33:27.822404721	0000678	
13	0.000312	-0.000216	-0.000221	-4.533737E-5	T	29490	2017.09.19 16:33:27.832404721	0000678	
13	0.000335	-0.000240	-0.000225	-6.012048E-5	T	29490	2017.09.19 16:33:27.842404721	0000678	
13	0.000330	-0.000230	-0.000226	-6.920157E-5	T	29490	2017.09.19 16:33:27.852404721	0000678	
13	0.000298	-0.000192	-0.000226	-3.151272E-5	T	29490	2017.09.19 16:33:27.862404721	0000678	
13	0.000321	-0.000225	-0.000216	-7.428359E-5	T	29490	2017.09.19 16:33:27.872404721	0000678	
13	0.000325	-0.000244	-0.000215	-7.131613E-6	T	29490	2017.09.19 16:33:27.882404721	0000678	
13	0.000319	-0.000211	-0.000231	-6.433581E-5	T	29490	2017.09.19 16:33:27.892404721	0000678	
14	0.000322	-0.000235	-0.000211	-6.021931E-5	T	29491	2017.09.19 16:33:27.902448471	0000678	
14	0.000318	-0.000216	-0.000226	-6.031599E-5	T	29491	2017.09.19 16:33:27.912448471	0000678	
14	0.000315	-0.000211	-0.000226	-6.035673E-5	T	29491	2017.09.19 16:33:27.922448471	0000678	
14	0.000319	-0.000197	-0.000245	-5.539213E-5	T	29491	2017.09.19 16:33:27.932448471	0000678	
14	0.000318	-0.000202	-0.000231	-8.340833E-5	T	29491	2017.09.19 16:33:27.942448471	0000678	
14	0.000328	-0.000221	-0.000235	-6.023791E-5	T	29491	2017.09.19 16:33:27.952448471	0000678	
14	0.000328	-0.000230	-0.000226	-6.020195E-5	T	29491	2017.09.19 16:33:27.962448471	0000678	
14	0.000325	-0.000230	-0.000221	-6.422253E-5	T	29491	2017.09.19 16:33:27.972448471	0000678	
14	0.000316	-0.000221	-0.000221	-5.029643E-5	T	29491	2017.09.19 16:33:27.982448471	0000678	
14	0.000358	-0.000278	-0.000215	-6.885205E-5	T	29491	2017.09.19 16:33:27.992448471	0000678	
15	0.000318	-0.000230	-0.000215	-4.024428E-5	T	29484	2017.09.19 16:33:28.002492221	0000678	
15	0.000310	-0.000230	-0.000201	-5.030196E-5	T	29484	2017.09.19 16:33:28.012492221	0000678	
15	0.000343	-0.000244	-0.000230	-6.906677E-5	T	29484	2017.09.19 16:33:28.022492221	0000678	
15	0.000323	-0.000230	-0.000216	-6.924307E-5	T	29484	2017.09.19 16:33:28.032492221	0000678	
15	0.000328	-0.000235	-0.000216	-7.420213E-5	T	29484	2017.09.19 16:33:28.042492221	0000678	
15	0.000335	-0.000249	-0.000211	-7.410468E-5	T	29484	2017.09.19 16:33:28.052492221	0000678	
15	0.000318	-0.000221	-0.000221	-6.029601E-5	T	29484	2017.09.19 16:33:28.062492221	0000678	
15	0.000310	-0.000221	-0.000212	-5.033378E-5	T	29484	2017.09.19 16:33:28.072492221	0000678	
15	0.000320	-0.000235	-0.000215	-3.120393E-5	T	29484	2017.09.19 16:33:28.082492221	0000678	
15	0.000353	-0.000249	-0.000248	-3.095293E-5	T	29484	2017.09.19 16:33:28.092492221	0000678	
16	0.000316	-0.000230	-0.000211	-5.026046E-5	T	29489	2017.09.19 16:33:28.102535971	0000678	
16	0.000328	-0.000230	-0.000226	-6.020195E-5	T	29489	2017.09.19 16:33:28.112535971	0000678	
16	0.000310	-0.000192	-0.000235	-6.047415E-5	T	29489	2017.09.19 16:33:28.122535971	0000678	
16	0.000341	-0.000249	-0.000225	-6.004717E-5	T	29489	2017.09.19 16:33:28.132535971	0000678	
16	0.000324	-0.000240	-0.000215	-3.616299E-5	T	29489	2017.09.19 16:33:28.142535971	0000678	
16	0.000334	-0.000254	-0.000211	-5.006495E-5	T	29489	2017.09.19 16:33:28.152535971	0000678	
16	0.000316	-0.000221	-0.000221	-5.029643E-5	T	29489	2017.09.19 16:33:28.162535971	0000678	
16	0.000323	-0.000221	-0.000235	-2.623933E-5	T	29489	2017.09.19 16:33:28.172535971	0000678	
16	0.000328	-0.000240	-0.000211	-7.417800E-5	T	29489	2017.09.19 16:33:28.182535971	0000678	
16	0.000328	-0.000244	-0.000211	-6.014600E-5	T	29489	2017.09.19 16:33:28.192535971	0000678	
17	0.000322	-0.000198	-0.000235	-9.843184E-5	T	29492	2017.09.19 16:33:28.202579721	0000678	
17	0.000311	-0.000211	-0.000212	-8.341386E-5	T	29492	2017.09.19 16:33:28.212579721	0000678	
17	0.000330	-0.000230	-0.000230	-5.018161E-5	T	29492	2017.09.19 16:33:28.222579721	0000678	
17	0.000338	-0.000235	-0.000231	-7.413988E-5	T	29492	2017.09.19 16:33:28.232579721	0000678	
17	0.000312	-0.000202	-0.000231	-5.540950E-5	T	29492	2017.09.19 16:33:28.242579721	0000678	
17	0.000313	-0.000211	-0.000226	-5.035714E-5	T	29492	2017.09.19 16:33:28.252579721	0000678	
17	0.000319	-0.000221	-0.000216	-7.931597E-5	T	29492	2017.09.19 16:33:28.262579721	0000678	
17	0.000334	-0.000222	-0.000226	-0.000107	T	29492	2017.09.19 16:33:28.272579721	0000678	
17	0.000333	-0.000244	-0.000225	-3.108911E-5	T	29492	2017.09.19 16:33:28.282579721	0000678	
17	0.000311	-0.000197	-0.000235	-5.043384E-5	T	29492	2017.09.19 16:33:28.292579721	0000678	
18	0.000318	-0.000230	-0.000215	-4.524407E-5	T	29474	2017.09.19 16:33:28.302623471	0000678	
18	0.000324	-0.000235	-0.000215	-5.520292E-5	T	29474	2017.09.19 16:33:28.312623471	0000678	
18	0.000329	-0.000230	-0.000230	-4.518182E-5	T	29474	2017.09.19 16:33:28.322623471	0000678	
18	0.000335	-0.000249	-0.000211	-7.410468E-5	T	29474	2017.09.19 16:33:28.332623471	0000678	
18	0.000305	-0.000192	-0.000231	-5.049117E-5	T	29474	2017.09.19 16:33:28.342623471	0000678	
18	0.000317	-0.000230	-0.000215	-3.624445E-5	T	29474	2017.09.19 16:33:28.352623471	0000678	
18	0.000323	-0.000206	-0.000235	-7.935931E-5	T	29474	2017.09.19 16:33:28.362623471	0000678	
18	0.000328	-0.000225	-0.000231	-6.022193E-5	T	29474	2017.09.19 16:33:28.372623471	0000678	
18	0.000332	-0.000225	-0.000235	-6.420516E-5	T	29474	2017.09.19 16:33:28.382623471	0000678	
18	0.000339	-0.000249	-0.000215	-7.908787E-5	T	29474	2017.09.19 16:33:28.392623471	0000678	
19	0.000315	-0.000221	-0.000221	-4.029685E-5	T	29495	2017.09.19 16:33:28.402667221	0000678	
19	0.000348	-0.000263	-0.000225	-3.993395E-5	T	29495	2017.09.19 16:33:28.412667221	0000678	
19	0.000326	-0.000230	-0.000225	-5.020236E-5	T	29495	2017.09.19 16:33:28.422667221	0000678	
19	0.000331	-0.000235	-0.000225	-6.016121E-5	T	29495	2017.09.19 16:33:28.432667221	0000678	
19	0.000351	-0.000259	-0.000230	-5.494516E-5	T	29495	2017.09.19 16:33:28.442667221	0000678	
19	0.000338	-0.000249	-0.000225	-3.604817E-5	T	29495	2017.09.19 16:33:28.452667221	0000678	
19	0.000314	-0.000225	-0.000216	-3.628518E-5	T	29495	2017.09.19 16:33:28.462667221	0000678	
19	0.000332	-0.000244	-0.000215	-6.412923E-5	T	29495	2017.09.19 16:33:28.472667221	0000678	
19	0.000305	-0.000202	-0.000226	-3.143125E-5	T	29495	2017.09.19 16:33:28.482667221	0000678	
19	0.000349	-0.000259	-0.000230	-3.994579E-5	T	29495	2017.09.19 16:33:28.492667221	0000678	
20	0.000304	-0.000206	-0.000221	-3.641921E-5	T	29501	2017.09.19 16:33:28.502710971	0000678	
20	0.000310	-0.000206	-0.000221	-6.941783E-5	T	29501	2017.09.19 16:33:28.512710971	0000678	
20	0.000312	-0.000202	-0.000235	-3.639369E-5	T	29501	2017.09.19 16:33:28.522710971	0000678	
20	0.000320	-0.000216	-0.000235	-3.127986E-5	T	29501	2017.09.19 16:33:28.532710971	0000678	
20	0.000319	-0.000225	-0.000221	-5.026385E-5	T	29501	2017.09.19 16:33:28.542710971	0000678	
20	0.000307	-0.000221	-0.000212	-3.133457E-5	T	29501	2017.09.19 16:33:28.552710971	0000678	
20	0.000335	-0.000212	-0.000249	-7.426069E-5	T	29501	2017.09.19 16:33:28.562710971	0000678	
20	0.000319	-0.000221	-0.000221	-6.429585E-5	T	29501	2017.09.19 16:33:28.572710971	0000678	
20	0.000343	-0.000249	-0.000225	-6.904679E-5	T	29501	2017.09.19 16:33:28.582710971	0000678	
20	0.000309	-0.000216	-0.000216	-4.535812E-5	T	29501	2017.09.19 16:33:28.592710971	0000678	
21	0.000319	-0.000221	-0.000226	-4.527589E-5	T	29489	2017.09.19 16:33:28.602754721	0000678	
21	0.000314	-0.000225	-0.000212	-5.530099E-5	T	29489	2017.09.19 16:33:28.612754721	0000678	
21	0.000326	-0.000235	-0.000220	-5.018238E-5	T	29489	2017.09.19 16:33:28.622754721	0000678	
21	0.000319	-0.000225	-0.000225	-2.124431E-5	T	29489	2017.09.19 16:33:28.632754721	0000678	
21	0.000335	-0.000249	-0.000215	-6.408850E-5	T	29489	2017.09.19 16:33:28.642754721	0000678	
21	0.000320	-0.000235	-0.000207	-6.923969E-5	T	29489	2017.09.19 16:33:28.652754721	0000678	
21	0.000314	-0.000202	-0.000235	-5.039311E-5	T	29489	2017.09.19 16:33:28.662754721	0000678	
21	0.000319	-0.000230	-0.000207	-7.928000E-5	T	29489	2017.09.19 16:33:28.672754721	0000678	
21	0.000307	-0.000211	-0.000216	-5.539843E-5	T	29489	2017.09.19 16:33:28.682754721	0000678	
21	0.000322	-0.000211	-0.000240	-4.029946E-5	T	29489	2017.09.19 16:33:28.692754721	0000678	
22	0.000307	-0.000211	-0.000212	-6.941445E-5	T	29497	2017.09.19 16:33:28.702798471	0000678	
22	0.000316	-0.000216	-0.000226	-4.531662E-5	T	29497	2017.09.19 16:33:28.712798471	0000678	
22	0.000330	-0.000221	-0.000240	-5.021758E-5	T	29497	2017.09.19 16:33:28.722798471	0000678	
22	0.000352	-0.000263	-0.000225	-5.993312E-5	T	29497	2017.09.19 16:33:28.732798471	0000678	
22	0.000320	-0.000225	-0.000225	-3.124389E-5	T	29497	2017.09.19 16:33:28.742798471	0000678	
22	0.000310	-0.000216	-0.000221	-3.133796E-5	T	29497	2017.09.19 16:33:28.752798471	0000678	
22	0.000323	-0.000216	-0.000235	-5.027906E-5	T	29497	2017.09.19 16:33:28.762798471	0000678	
22	0.000308	-0.000221	-0.000212	-4.033420E-5	T	29497	2017.09.19 16:33:28.772798471	0000678	
22	0.000304	-0.000197	-0.000226	-5.047119E-5	T	29497	2017.09.19 16:33:28.782798471	0000678	
22	0.000314	-0.000225	-0.000216	-4.028501E-5	T	29497	2017.09.19 16:33:28.792798471	0000678	
23	0.000308	-0.000211	-0.000212	-7.441424E-5	T	29495	2017.09.19 16:33:28.802842221	0000678	
23	0.000328	-0.000221	-0.000231	-7.425393E-5	T	29495	2017.09.19 16:33:28.812842221	0000678	
23	0.000308	-0.000221	-0.000212	-4.033420E-5	T	29495	2017.09.19 16:33:28.822842221	0000678	
23	0.000314	-0.000211	-0.000226	-5.535693E-5	T	29495	2017.09.19 16:33:28.832842221	0000678	
23	0.000310	-0.000206	-0.000216	-8.343800E-5	T	29495	2017.09.19 16:33:28.842842221	0000678	
23	0.000300	-0.000211	-0.000212	-3.141604E-5	T	29495	2017.09.19 16:33:28.852842221	0000678	
23	0.000310	-0.000211	-0.000226	-3.135794E-5	T	29495	2017.09.19 16:33:28.862842221	0000678	
23	0.000314	-0.000216	-0.000221	-5.533695E-5	T	29495	2017.09.19 16:33:28.872842221	0000678	
23	0.000286	-0.000188	-0.000212	-3.660319E-5	T	29495	2017.09.19 16:33:28.882842221	0000678	
23	0.000314	-0.000230	-0.000211	-3.626105E-5	T	29495	2017.09.19 16:33:28.892842221	0000678	
24	0.000317	-0.000235	-0.000206	-5.024048E-5	T	29475	2017.09.19 16:33:28.902885971	0000678	
24	0.000333	-0.000225	-0.000231	-8.322097E-5	T	29475	2017.09.19 16:33:28.912885971	0000678	
24	0.000302	-0.000202	-0.000221	-4.045163E-5	T	29475	2017.09.19 16:33:28.922885971	0000678	
24	0.000341	-0.000249	-0.000225	-6.004717E-5	T	29475	2017.09.19 16:33:28.932885971	0000678	
24	0.000303	-0.000202	-0.000216	-6.447138E-5	T	29475	2017.09.19 16:33:28.942885971	0000678	
24	0.000319	-0.000216	-0.000221	-7.933595E-5	T	29475	2017.09.19 16:33:28.952885971	0000678	
24	0.000317	-0.000221	-0.000221	-5.529622E-5	T	29475	2017.09.19 16:33:28.962885971	0000678	
24	0.000312	-0.000211	-0.000216	-7.939743E-5	T	29475	2017.09.19 16:33:28.972885971	0000678	
24	0.000340	-0.000244	-0.000234	-3.605155E-5	T	29475	2017.09.19 16:33:28.982885971	0000678	
24	0.000338	-0.000259	-0.000206	-6.904418E-5	T	29475	2017.09.19 16:33:28.992885971	0000678	
25	0.000332	-0.000235	-0.000225	-6.416105E-5	T	29491	2017.09.19 16:33:29.002929721	0000678	
25	0.000295	-0.000197	-0.000212	-5.552908E-5	T	29491	2017.09.19 16:33:29.012929721	0000678	
25	0.000316	-0.000211	-0.000231	-4.533660E-5	T	29491	2017.09.19 16:33:29.022929721	0000678	
25	0.000332	-0.000225	-0.000231	-7.922113E-5	T	29491	2017.09.19 16:33:29.032929721	0000678	
25	0.000330	-0.000225	-0.000231	-6.922155E-5	T	29491	2017.09.19 16:33:29.042929721	0000678	
25	0.000319	-0.000216	-0.000231	-4.529587E-5	T	29491	2017.09.19 16:33:29.052929721	0000678	
25	0.000331	-0.000225	-0.000231	-7.422134E-5	T	29491	2017.09.19 16:33:29.062929721	0000678	
25	0.000302	-0.000197	-0.000216	-7.451169E-5	T	29491	2017.09.19 16:33:29.072929721	0000678	
25	0.000289	-0.000202	-0.000207	-1.751069E-5	T	29491	2017.09.19 16:33:29.082929721	0000678	
25	0.000317	-0.000197	-0.000235	-7.943263E-5	T	29491	2017.09.19 16:33:29.092929721	0000678	
26	0.000317	-0.000211	-0.000231	-5.033639E-5	T	29497	2017.09.19 16:33:29.102973471	0000678	
26	0.000332	-0.000230	-0.000231	-6.418103E-5	T	29497	2017.09.19 16:33:29.112973471	0000678	
26	0.000326	-0.000230	-0.000225	-5.020236E-5	T	29497	2017.09.19 16:33:29.122973471	0000678	
26	0.000329	-0.000225	-0.000235	-5.020574E-5	T	29497	2017.09.19 16:33:29.132973471	0000678	
26	0.000336	-0.000225	-0.000248	-1.714902E-5	T	29497	2017.09.19 16:33:29.142973471	0000678	
26	0.000320	-0.000230	-0.000216	-5.524365E-5	T	29497	2017.09.19 16:33:29.152973471	0000678	
26	0.000326	-0.000221	-0.000235	-4.523854E-5	T	29497	2017.09.19 16:33:29.162973471	0000678	
26	0.000337	-0.000244	-0.000225	-5.508811E-5	T	29497	2017.09.19 16:33:29.172973471	0000678	
26	0.000335	-0.000235	-0.000234	-4.512449E-5	T	29497	2017.09.19 16:33:29.182973471	0000678	
26	0.000308	-0.000206	-0.000226	-4.039829E-5	T	29497	2017.09.19 16:33:29.192973471	0000678	
27	0.000329	-0.000235	-0.000220	-6.418180E-5	T	29496	2017.09.19 16:33:29.203017221	0000678	
27	0.000336	-0.000235	-0.000230	-6.414030E-5	T	29496	2017.09.19 16:33:29.213017221	0000678	
27	0.000330	-0.000240	-0.000215	-6.916161E-5	T	29496	2017.09.19 16:33:29.223017221	0000678	
27	0.000305	-0.000211	-0.000207	-7.443499E-5	T	29496	2017.09.19 16:33:29.233017221	0000678	
27	0.000336	-0.000240	-0.000225	-6.412032E-5	T	29496	2017.09.19 16:33:29.243017221	0000678	
27	0.000314	-0.000216	-0.000221	-5.533695E-5	T	29496	2017.09.19 16:33:29.253017221	0000678	
27	0.000298	-0.000197	-0.000221	-3.649253E-5	T	29496	2017.09.19 16:33:29.263017221	0000678	
27	0.000327	-0.000225	-0.000234	-3.620633E-5	T	29496	2017.09.19 16:33:29.273017221	0000678	
27	0.000317	-0.000202	-0.000240	-4.537257E-5	T	29496	2017.09.19 16:33:29.283017221	0000678	
27	0.000317	-0.000211	-0.000226	-6.935635E-5	T	29496	2017.09.19 16:33:29.293017221	0000678	
28	0.000330	-0.000225	-0.000231	-6.922155E-5	T	29492	2017.09.19 16:33:29.303060971	0000678	
28	0.000307	-0.000216	-0.000207	-6.939447E-5	T	29492	2017.09.19 16:33:29.313060971	0000678	
28	0.000329	-0.000240	-0.000220	-4.514186E-5	T	29492	2017.09.19 16:33:29.323060971	0000678	
28	0.000330	-0.000235	-0.000230	-2.114209E-5	T	29492	2017.09.19 16:33:29.333060971	0000678	
28	0.000307	-0.000211	-0.000212	-6.941445E-5	T	29492	2017.09.19 16:33:29.343060971	0000678	
28	0.000323	-0.000221	-0.000231	-4.525514E-5	T	29492	2017.09.19 16:33:29.353060971	0000678	
28	0.000329	-0.000225	-0.000231	-6.422176E-5	T	29492	2017.09.19 16:33:29.363060971	0000678	
28	0.000318	-0.000221	-0.000221	-6.029601E-5	T	29492	2017.09.19 16:33:29.373060971	0000678	
28	0.000282	-0.000188	-0.000207	-4.062378E-5	T	29492	2017.09.19 16:33:29.383060971	0000678	
28	0.000324	-0.000240	-0.000215	-3.616299E-5	T	29492	2017.09.19 16:33:29.393060971	0000678	
29	0.000294	-0.000197	-0.000216	-3.151349E-5	T	29489	2017.09.19 16:33:29.403104721	0000678	
29	0.000310	-0.000197	-0.000231	-6.045002E-5	T	29489	2017.09.19 16:33:29.413104721	0000678	
29	0.000303	-0.000206	-0.000216	-5.543917E-5	T	29489	2017.09.19 16:33:29.423104721	0000678	
29	0.000302	-0.000206	-0.000212	-6.445539E-5	T	29489	2017.09.19 16:33:29.433104721	0000678	
29	0.000317	-0.000216	-0.000226	-5.531620E-5	T	29489	2017.09.19 16:33:29.443104721	0000678	
29	0.000360	-0.000278	-0.000220	-6.383151E-5	T	29489	2017.09.19 16:33:29.453104721	0000678	
29	0.000307	-0.000216	-0.000212	-5.037451E-5	T	29489	2017.09.19 16:33:29.463104721	0000678	
29	0.000311	-0.000230	-0.000206	-3.628180E-5	T	29489	2017.09.19 16:33:29.473104721	0000678	
29	0.000291	-0.000205	-0.000207	-2.478732E-6	T	29489	2017.09.19 16:33:29.483104721	0000678	
29	0.000328	-0.000230	-0.000230	-4.018203E-5	T	29489	2017.09.19 16:33:29.493104721	0000678	
30	0.000323	-0.000230	-0.000212	-7.925925E-5	T	29483	2017.09.19 16:33:29.503148471	0000678	
30	0.000308	-0.000211	-0.000216	-6.039823E-5	T	29483	2017.09.19 16:33:29.513148471	0000678	
30	0.000313	-0.000211	-0.000231	-2.133761E-5	T	29483	2017.09.19 16:33:29.523148471	0000678	
30	0.000328	-0.000240	-0.000215	-6.016198E-5	T	29483	2017.09.19 16:33:29.533148471	0000678	
30	0.000318	-0.000225	-0.000221	-4.526405E-5	T	29483	2017.09.19 16:33:29.543148471	0000678	
30	0.000324	-0.000244	-0.000206	-5.516696E-5	T	29483	2017.09.19 16:33:29.553148471	0000678	
30	0.000326	-0.000225	-0.000234	-2.120696E-5	T	29483	2017.09.19 16:33:29.563148471	0000678	
30	0.000309	-0.000230	-0.000198	-6.031815E-5	T	29483	2017.09.19 16:33:29.573148471	0000678	
30	0.000307	-0.000225	-0.000202	-5.534249E-5	T	29483	2017.09.19 16:33:29.583148471	0000678	
30	0.000306	-0.000221	-0.000211	-1.233537E-5	T	29483	2017.09.19 16:33:29.593148471	0000678	
31	0.000306	-0.000211	-0.000212	-6.441466E-5	T	29489	2017.09.19 16:33:29.603192221	0000678	
31	0.000325	-0.000221	-0.000226	-7.427468E-5	T	29489	2017.09.19 16:33:29.613192221	0000678	
31	0.000300	-0.000216	-0.000207	-2.639627E-5	T	29489	2017.09.19 16:33:29.623192221	0000678	
31	0.000321	-0.000211	-0.000240	-3.629963E-5	T	29489	2017.09.19 16:33:29.633192221	0000678	
31	0.000323	-0.000230	-0.000221	-5.522290E-5	T	29489	2017.09.19 16:33:29.643192221	0000678	
31	0.000335	-0.000254	-0.000215	-3.604894E-5	T	29489	2017.09.19 16:33:29.653192221	0000678	
31	0.000311	-0.000197	-0.000226	-8.346981E-5	T	29489	2017.09.19 16:33:29.663192221	0000678	
31	0.000327	-0.000225	-0.000231	-5.522214E-5	T	29489	2017.09.19 16:33:29.673192221	0000678	
31	0.000325	-0.000230	-0.000221	-6.422253E-5	T	29489	2017.09.19 16:33:29.683192221	0000678	
31	0.000339	-0.000230	-0.000248	-2.110812E-5	T	29489	2017.09.19 16:33:29.693192221	0000678	
32	0.000316	-0.000225	-0.000216	-5.028460E-5	T	29491	2017.09.19 16:33:29.703235971	0000678	
32	0.000327	-0.000240	-0.000220	-3.114244E-5	T	29491	2017.09.19 16:33:29.713235971	0000678	
32	0.000297	-0.000183	-0.000226	-6.058482E-5	T	29491	2017.09.19 16:33:29.723235971	0000678	
32	0.000318	-0.000211	-0.000221	-8.837631E-5	T	29491	2017.09.19 16:33:29.733235971	0000678	
32	0.000304	-0.000221	-0.000207	-3.135533E-5	T	29491	2017.09.19 16:33:29.743235971	0000678	
32	0.000336	-0.000249	-0.000211	-7.910447E-5	T	29491	2017.09.19 16:33:29.753235971	0000678	
32	0.000316	-0.000221	-0.000221	-4.529664E-5	T	29491	2017.09.19 16:33:29.763235971	0000678	
32	0.000342	-0.000249	-0.000220	-7.906712E-5	T	29491	2017.09.19 16:33:29.773235971	0000678	
32	0.000333	-0.000230	-0.000239	-2.614527E-5	T	29491	2017.09.19 16:33:29.783235971	0000678	
32	0.000322	-0.000244	-0.000192	-8.322389E-5	T	29491	2017.09.19 16:33:29.793235971	0000678	
33	0.000315	-0.000216	-0.000212	-8.837292E-5	T	29485	2017.09.19 16:33:29.803279721	0000678	
33	0.000322	-0.000240	-0.000206	-6.019933E-5	T	29485	2017.09.19 16:33:29.813279721	0000678	
33	0.000309	-0.000230	-0.000198	-6.031815E-5	T	29485	2017.09.19 16:33:29.823279721	0000678	
33	0.000324	-0.000225	-0.000226	-6.024268E-5	T	29485	2017.09.19 16:33:29.833279721	0000678	
33	0.000311	-0.000216	-0.000216	-6.035749E-5	T	29485	2017.09.19 16:33:29.843279721	0000678	
33	0.000315	-0.000211	-0.000226	-6.035673E-5	T	29485	2017.09.19 16:33:29.853279721	0000678	
33	0.000325	-0.000230	-0.000221	-6.422253E-5	T	29485	2017.09.19 16:33:29.863279721	0000678	
33	0.000311	-0.000221	-0.000202	-8.337390E-5	T	29485	2017.09.19 16:33:29.873279721	0000678	
33	0.000326	-0.000211	-0.000235	-7.931858E-5	T	29485	2017.09.19 16:33:29.883279721	0000678	
33	0.000324	-0.000225	-0.000221	-7.426284E-5	T	29485	2017.09.19 16:33:29.893279721	0000678	
34	0.000318	-0.000225	-0.000216	-6.428401E-5	T	29494	2017.09.19 16:33:29.903323471	0000678	
34	0.000324	-0.000225	-0.000226	-6.024268E-5	T	29494	2017.09.19 16:33:29.913323471	0000678	
34	0.000308	-0.000211	-0.000216	-6.039823E-5	T	29494	2017.09.19 16:33:29.923323471	0000678	
34	0.000321	-0.000221	-0.000221	-7.429543E-5	T	29494	2017.09.19 16:33:29.933323471	0000678	
34	0.000330	-0.000225	-0.000226	-8.324172E-5	T	29494	2017.09.19 16:33:29.943323471	0000678	
34	0.000338	-0.000225	-0.000245	-6.016383E-5	T	29494	2017.09.19 16:33:29.953323471	0000678	
34	0.000319	-0.000221	-0.000221	-6.429585E-5	T	29494	2017.09.19 16:33:29.963323471	0000678	
34	0.000327	-0.000221	-0.000226	-8.327430E-5	T	29494	2017.09.19 16:33:29.973323471	0000678	
34	0.000320	-0.000211	-0.000221	-9.337610E-5	T	29494	2017.09.19 16:33:29.983323471	0000678	
34	0.000299	-0.000206	-0.000207	-6.447614E-5	T	29494	2017.09.19 16:33:29.993323471	0000678	
35	0.000299	-0.000202	-0.000216	-4.547217E-5	T	29490	2017.09.19 16:33:30.003367221	0000678	
35	0.000315	-0.000221	-0.000212	-7.433278E-5	T	29490	2017.09.19 16:33:30.013367221	0000678	
35	0.000317	-0.000230	-0.000207	-6.928042E-5	T	29490	2017.09.19 16:33:30.023367221	0000678	
35	0.000307	-0.000211	-0.000216	-5.539843E-5	T	29490	2017.09.19 16:33:30.033367221	0000678	
35	0.000330	-0.000240	-0.000207	-9.319795E-5	T	29490	2017.09.19 16:33:30.043367221	0000678	
35	0.000332	-0.000235	-0.000225	-6.416105E-5	T	29490	2017.09.19 16:33:30.053367221	0000678	
35	0.000322	-0.000240	-0.000206	-6.019933E-5	T	29490	2017.09.19 16:33:30.063367221	0000678	
35	0.000301	-0.000202	-0.000221	-3.145200E-5	T	29490	2017.09.19 16:33:30.073367221	0000678	
35	0.000310	-0.000211	-0.000216	-6.939785E-5	T	29490	2017.09.19 16:33:30.083367221	0000678	
35	0.000341	-0.000254	-0.000220	-5.502739E-5	T	29490	2017.09.19 16:33:30.093367221	0000678	
36	0.000318	-0.000211	-0.000226	-7.435614E-5	T	29494	2017.09.19 16:33:30.103410971	0000678	
36	0.000328	-0.000235	-0.000220	-6.018196E-5	T	29494	2017.09.19 16:33:30.113410971	0000678	
36	0.000352	-0.000259	-0.000230	-5.994495E-5	T	29494	2017.09.19 16:33:30.123410971	0000678	
36	0.000306	-0.000225	-0.000198	-6.435871E-5	T	29494	2017.09.19 16:33:30.133410971	0000678	
36	0.000320	-0.000211	-0.000226	-8.335576E-5	T	29494	2017.09.19 16:33:30.143410971	0000678	
36	0.000322	-0.000216	-0.000231	-6.029524E-5	T	29494	2017.09.19 16:33:30.153410971	0000678	
36	0.000313	-0.000216	-0.000212	-7.937330E-5	T	29494	2017.09.19 16:33:30.163410971	0000678	
36	0.000316	-0.000211	-0.000226	-6.435656E-5	T	29494	2017.09.19 16:33:30.173410971	0000678	
36	0.000317	-0.000221	-0.000226	-2.627668E-5	T	29494	2017.09.19 16:33:30.183410971	0000678	
36	0.000335	-0.000249	-0.000211	-7.410468E-5	T	29494	2017.09.19 16:33:30.193410971	0000678	
37	0.000334	-0.000235	-0.000234	-3.612487E-5	T	29485	2017.09.19 16:33:30.203454721	0000678	
37	0.000362	-0.000260	-0.000234	-9.292697E-5	T	29485	2017.09.19 16:33:30.213454721	0000678	
37	0.000337	-0.000254	-0.000220	-2.602861E-5	T	29485	2017.09.19 16:33:30.223454721	0000678	
37	0.000318	-0.000225	-0.000221	-4.526405E-5	T	29485	2017.09.19 16:33:30.233454721	0000678	
37	0.000298	-0.000192	-0.000221	-5.553246E-5	T	29485	2017.09.19 16:33:30.243454721	0000678	
37	0.000317	-0.000206	-0.000226	-8.339650E-5	T	29485	2017.09.19 16:33:30.253454721	0000678	
37	0.000323	-0.000235	-0.000220	-2.118359E-5	T	29485	2017.09.19 16:33:30.263454721	0000678	
37	0.000333	-0.000240	-0.000225	-5.012090E-5	T	29485	2017.09.19 16:33:30.273454721	0000678	
37	0.000333	-0.000235	-0.000230	-5.014088E-5	T	29485	2017.09.19 16:33:30.283454721	0000678	
37	0.000339	-0.000235	-0.000239	-5.010353E-5	T	29485	2017.09.19 16:33:30.293454721	0000678	
38	0.000314	-0.000206	-0.000231	-5.537692E-5	T	29497	2017.09.19 16:33:30.303498471	0000678	
38	0.000298	-0.000192	-0.000221	-5.553246E-5	T	29497	2017.09.19 16:33:30.313498471	0000678	
38	0.000305	-0.000221	-0.000207	-4.035495E-5	T	29497	2017.09.19 16:33:30.323498471	0000678	
38	0.000319	-0.000230	-0.000212	-6.425988E-5	T	29497	2017.09.19 16:33:30.333498471	0000678	
38	0.000302	-0.000206	-0.000216	-4.543958E-5	T	29497	2017.09.19 16:33:30.343498471	0000678	
38	0.000307	-0.000206	-0.000221	-5.541842E-5	T	29497	2017.09.19 16:33:30.353498471	0000678	
38	0.000319	-0.000225	-0.000212	-7.929998E-5	T	29497	2017.09.19 16:33:30.363498471	0000678	
38	0.000312	-0.000216	-0.000212	-7.437351E-5	T	29497	2017.09.19 16:33:30.373498471	0000678	
38	0.000303	-0.000221	-0.000198	-6.439130E-5	T	29497	2017.09.19 16:33:30.383498471	0000678	
38	0.000335	-0.000211	-0.000254	-5.524073E-5	T	29497	2017.09.19 16:33:30.393498471	0000678	
39	0.000323	-0.000216	-0.000231	-6.429508E-5	T	29481	2017.09.19 16:33:30.403542221	0000678	
39	0.000336	-0.000244	-0.000230	-2.606857E-5	T	29481	2017.09.19 16:33:30.413542221	0000678	
39	0.000313	-0.000216	-0.000226	-1.731779E-5	T	29481	2017.09.19 16:33:30.423542221	0000678	
39	0.000343	-0.000240	-0.000239	-5.006280E-5	T	29481	2017.09.19 16:33:30.433542221	0000678	
39	0.000339	-0.000249	-0.000225	-4.504779E-5	T	29481	2017.09.19 16:33:30.443542221	0000678	
39	0.000325	-0.000230	-0.000225	-4.520257E-5	T	29481	2017.09.19 16:33:30.453542221	0000678	
39	0.000341	-0.000236	-0.000226	-9.815963E-5	T	29481	2017.09.19 16:33:30.463542221	0000678	
39	0.000306	-0.000202	-0.000221	-6.445063E-5	T	29481	2017.09.19 16:33:30.473542221	0000678	
39	0.000349	-0.000226	-0.000254	-7.912568E-5	T	29481	2017.09.19 16:33:30.483542221	0000678	
39	0.000315	-0.000221	-0.000216	-6.431660E-5	T	29481	2017.09.19 16:33:30.493542221	0000678	
40	0.000320	-0.000206	-0.000231	-7.937591E-5	T	29487	2017.09.19 16:33:30.503585971	0000678	
40	0.000332	-0.000240	-0.000225	-4.012132E-5	T	29487	2017.09.19 16:33:30.513585971	0000678	
40	0.000322	-0.000216	-0.000231	-6.029524E-5	T	29487	2017.09.19 16:33:30.523585971	0000678	
40	0.000332	-0.000230	-0.000226	-7.920115E-5	T	29487	2017.09.19 16:33:30.533585971	0000678	
40	0.000331	-0.000240	-0.000225	-3.612149E-5	T	29487	2017.09.19 16:33:30.543585971	0000678	
40	0.000324	-0.000225	-0.000221	-7.426284E-5	T	29487	2017.09.19 16:33:30.553585971	0000678	
40	0.000344	-0.000254	-0.000225	-5.500664E-5	T	29487	2017.09.19 16:33:30.563585971	0000678	
40	0.000343	-0.000236	-0.000231	-9.313908E-5	T	29487	2017.09.19 16:33:30.573585971	0000678	
40	0.000305	-0.000221	-0.000207	-3.635512E-5	T	29487	2017.09.19 16:33:30.583585971	0000678	
40	0.000302	-0.000221	-0.000202	-4.537549E-5	T	29487	2017.09.19 16:33:30.593585971	0000678	
41	0.000306	-0.000206	-0.000216	-6.943858E-5	T	29497	2017.09.19 16:33:30.603629721	0000678	
41	0.000304	-0.000211	-0.000212	-5.541503E-5	T	29497	2017.09.19 16:33:30.613629721	0000678	
41	0.000317	-0.000216	-0.000221	-6.933637E-5	T	29497	2017.09.19 16:33:30.623629721	0000678	
41	0.000309	-0.000221	-0.000207	-6.035411E-5	T	29497	2017.09.19 16:33:30.633629721	0000678	
41	0.000319	-0.000225	-0.000216	-6.928380E-5	T	29497	2017.09.19 16:33:30.643629721	0000678	
41	0.000341	-0.000259	-0.000215	-5.500741E-5	T	29497	2017.09.19 16:33:30.653629721	0000678	
41	0.000297	-0.000197	-0.000221	-2.649294E-5	T	29497	2017.09.19 16:33:30.663629721	0000678	
41	0.000314	-0.000230	-0.000211	-3.126126E-5	T	29497	2017.09.19 16:33:30.673629721	0000678	
41	0.000306	-0.000206	-0.000212	-7.945476E-5	T	29497	2017.09.19 16:33:30.683629721	0000678	
41	0.000338	-0.000240	-0.000234	-4.008397E-5	T	29497	2017.09.19 16:33:30.693629721	0000678	
42	0.000323	-0.000235	-0.000207	-7.923927E-5	T	29485	2017.09.19 16:33:30.703673471	0000678	
42	0.000323	-0.000225	-0.000226	-5.024309E-5	T	29485	2017.09.19 16:33:30.713673471	0000678	
42	0.000324	-0.000235	-0.000212	-6.921894E-5	T	29485	2017.09.19 16:33:30.723673471	0000678	
42	0.000300	-0.000188	-0.000221	-7.456426E-5	T	29485	2017.09.19 16:33:30.733673471	0000678	
42	0.000316	-0.000216	-0.000226	-5.031641E-5	T	29485	2017.09.19 16:33:30.743673471	0000678	
42	0.000319	-0.000225	-0.000216	-6.928380E-5	T	29485	2017.09.19 16:33:30.753673471	0000678	
42	0.000315	-0.000216	-0.000226	-4.031683E-5	T	29485	2017.09.19 16:33:30.763673471	0000678	
42	0.000315	-0.000225	-0.000216	-4.528480E-5	T	29485	2017.09.19 16:33:30.773673471	0000678	
42	0.000318	-0.000230	-0.000215	-4.024428E-5	T	29485	2017.09.19 16:33:30.783673471	0000678	
42	0.000321	-0.000244	-0.000201	-5.518771E-5	T	29485	2017.09.19 16:33:30.793673471	0000678	
43	0.000312	-0.000230	-0.000206	-4.528142E-5	T	29492	2017.09.19 16:33:30.803717221	0000678	
43	0.000303	-0.000211	-0.000212	-5.041524E-5	T	29492	2017.09.19 16:33:30.813717221	0000678	
43	0.000302	-0.000211	-0.000212	-4.541545E-5	T	29492	2017.09.19 16:33:30.823717221	0000678	
43	0.000334	-0.000235	-0.000234	-3.612487E-5	T	29492	2017.09.19 16:33:30.833717221	0000678	
43	0.000302	-0.000206	-0.000212	-6.045556E-5	T	29492	2017.09.19 16:33:30.843717221	0000678	
43	0.000328	-0.000235	-0.000216	-7.420213E-5	T	29492	2017.09.19 16:33:30.853717221	0000678	
43	0.000332	-0.000240	-0.000212	-8.817741E-5	T	29492	2017.09.19 16:33:30.863717221	0000678	
43	0.000335	-0.000244	-0.000215	-7.912860E-5	T	29492	2017.09.19 16:33:30.873717221	0000678	
43	0.000325	-0.000221	-0.000221	-8.829484E-5	T	29492	2017.09.19 16:33:30.883717221	0000678	
43	0.000300	-0.000216	-0.000207	-3.139606E-5	T	29492	2017.09.19 16:33:30.893717221	0000678	
44	0.000321	-0.000230	-0.000220	-3.622370E-5	T	29487	2017.09.19 16:33:30.903760971	0000678	
44	0.000290	-0.000202	-0.000202	-5.053006E-5	T	29487	2017.09.19 16:33:30.913760971	0000678	
44	0.000322	-0.000240	-0.000211	-3.617959E-5	T	29487	2017.09.19 16:33:30.923760971	0000678	
44	0.000330	-0.000244	-0.000220	-3.110986E-5	T	29487	2017.09.19 16:33:30.933760971	0000678	
44	0.000322	-0.000235	-0.000215	-4.520334E-5	T	29487	2017.09.19 16:33:30.943760971	0000678	
44	0.000334	-0.000221	-0.000240	-6.921679E-5	T	29487	2017.09.19 16:33:30.953760971	0000678	
44	0.000300	-0.000202	-0.000207	-7.950810E-5	T	29487	2017.09.19 16:33:30.963760971	0000678	
44	0.000291	-0.000202	-0.000198	-6.954587E-5	T	29487	2017.09.19 16:33:30.973760971	0000678	
44	0.000303	-0.000225	-0.000198	-5.035930E-5	T	29487	2017.09.19 16:33:30.983760971	0000678	
44	0.000333	-0.000249	-0.000211	-6.410510E-5	T	29487	2017.09.19 16:33:30.993760971	0000678	
45	0.000327	-0.000244	-0.000211	-5.514621E-5	T	29492	2017.09.19 16:33:31.003804721	0000678	
45	0.000298	-0.000192	-0.000226	-2.651293E-5	T	29492	2017.09.19 16:33:31.013804721	0000678	
45	0.000309	-0.000225	-0.000207	-5.032195E-5	T	29492	2017.09.19 16:33:31.023804721	0000678	
45	0.000321	-0.000206	-0.000245	-2.632003E-5	T	29492	2017.09.19 16:33:31.033804721	0000678	
45	0.000338	-0.000244	-0.000225	-6.408773E-5	T	29492	2017.09.19 16:33:31.043804721	0000678	
45	0.000304	-0.000202	-0.000221	-5.045121E-5	T	29492	2017.09.19 16:33:31.053804721	0000678	
45	0.000328	-0.000235	-0.000220	-6.018196E-5	T	29492	2017.09.19 16:33:31.063804721	0000678	
45	0.000325	-0.000216	-0.000235	-6.027864E-5	T	29492	2017.09.19 16:33:31.073804721	0000678	
45	0.000329	-0.000240	-0.000215	-6.416182E-5	T	29492	2017.09.19 16:33:31.083804721	0000678	
45	0.000314	-0.000225	-0.000212	-5.530099E-5	T	29492	2017.09.19 16:33:31.093804721	0000678	
46	0.000292	-0.000202	-0.000198	-7.454566E-5	T	29477	2017.09.19 16:33:31.103848471	0000678	
46	0.000295	-0.000192	-0.000221	-4.053309E-5	T	29477	2017.09.19 16:33:31.113848471	0000678	
46	0.000339	-0.000259	-0.000211	-5.502401E-5	T	29477	2017.09.19 16:33:31.123848471	0000678	
46	0.000291	-0.000192	-0.000207	-6.958998E-5	T	29477	2017.09.19 16:33:31.133848471	0000678	
46	0.000297	-0.000206	-0.000212	-3.145677E-5	T	29477	2017.09.19 16:33:31.143848471	0000678	
46	0.000286	-0.000178	-0.000216	-5.566726E-5	T	29477	2017.09.19 16:33:31.153848471	0000678	
46	0.000336	-0.000235	-0.000226	-8.316025E-5	T	29477	2017.09.19 16:33:31.163848471	0000678	
46	0.000318	-0.000244	-0.000201	-3.618850E-5	T	29477	2017.09.19 16:33:31.173848471	0000678	
46	0.000316	-0.000225	-0.000220	-3.126464E-5	T	29477	2017.09.19 16:33:31.183848471	0000678	
46	0.000337	-0.000240	-0.000221	-8.314027E-5	T	29477	2017.09.19 16:33:31.193848471	0000678	
47	0.000328	-0.000235	-0.000216	-7.420213E-5	T	29492	2017.09.19 16:33:31.203892221	0000678	
47	0.000299	-0.000192	-0.000221	-6.053226E-5	T	29492	2017.09.19 16:33:31.213892221	0000678	
47	0.000314	-0.000211	-0.000231	-2.633740E-5	T	29492	2017.09.19 16:33:31.223892221	0000678	
47	0.000335	-0.000249	-0.000220	-4.506854E-5	T	29492	2017.09.19 16:33:31.233892221	0000678	
47	0.000320	-0.000230	-0.000212	-6.925967E-5	T	29492	2017.09.19 16:33:31.243892221	0000678	
47	0.000340	-0.000249	-0.000220	-6.906754E-5	T	29492	2017.09.19 16:33:31.253892221	0000678	
47	0.000290	-0.000192	-0.000212	-4.557023E-5	T	29492	2017.09.19 16:33:31.263892221	0000678	
47	0.000292	-0.000188	-0.000216	-5.558580E-5	T	29492	2017.09.19 16:33:31.273892221	0000678	
47	0.000332	-0.000230	-0.000231	-6.418103E-5	T	29492	2017.09.19 16:33:31.283892221	0000678	
47	0.000302	-0.000211	-0.000207	-6.043558E-5	T	29492	2017.09.19 16:33:31.293892221	0000678	
48	0.000331	-0.000244	-0.000220	-3.610965E-5	T	29497	2017.09.19 16:33:31.303935971	0000678	
48	0.000328	-0.000225	-0.000231	-6.022193E-5	T	29497	2017.09.19 16:33:31.313935971	0000678	
48	0.000327	-0.000240	-0.000220	-2.614265E-5	T	29497	2017.09.19 16:33:31.323935971	0000678	
48	0.000308	-0.000221	-0.000212	-3.633437E-5	T	29497	2017.09.19 16:33:31.333935971	0000678	
48	0.000325	-0.000216	-0.000235	-6.027864E-5	T	29497	2017.09.19 16:33:31.343935971	0000678	
48	0.000319	-0.000235	-0.000206	-6.024006E-5	T	29497	2017.09.19 16:33:31.353935971	0000678	
48	0.000296	-0.000211	-0.000207	-2.143721E-5	T	29497	2017.09.19 16:33:31.363935971	0000678	
48	0.000331	-0.000263	-0.000201	-2.103435E-5	T	29497	2017.09.19 16:33:31.373935971	0000678	
48	0.000281	-0.000197	-0.000198	-3.158819E-5	T	29497	2017.09.19 16:33:31.383935971	0000678	
48	0.000330	-0.000230	-0.000231	-5.518140E-5	T	29497	2017.09.19 16:33:31.393935971	0000678	
49	0.000313	-0.000206	-0.000226	-6.439729E-5	T	29491	2017.09.19 16:33:31.403979721	0000678	
49	0.000332	-0.000249	-0.000215	-4.508929E-5	T	29491	2017.09.19 16:33:31.413979721	0000678	
49	0.000339	-0.000244	-0.000230	-4.506777E-5	T	29491	2017.09.19 16:33:31.423979721	0000678	
49	0.000315	-0.000221	-0.000216	-6.031676E-5	T	29491	2017.09.19 16:33:31.433979721	0000678	
49	0.000316	-0.000235	-0.000206	-4.524069E-5	T	29491	2017.09.19 16:33:31.443979721	0000678	
49	0.000313	-0.000221	-0.000216	-5.031718E-5	T	29491	2017.09.19 16:33:31.453979721	0000678	
49	0.000322	-0.000244	-0.000206	-4.016758E-5	T	29491	2017.09.19 16:33:31.463979721	0000678	
49	0.000322	-0.000211	-0.000235	-6.431921E-5	T	29491	2017.09.19 16:33:31.473979721	0000678	
49	0.000338	-0.000249	-0.000220	-6.006792E-5	T	29491	2017.09.19 16:33:31.483979721	0000678	
49	0.000327	-0.000254	-0.000201	-4.510666E-5	T	29491	2017.09.19 16:33:31.493979721	0000678	
50	0.000342	-0.000249	-0.000225	-6.404700E-5	T	29497	2017.09.19 16:33:31.504023471	0000678	
50	0.000325	-0.000221	-0.000226	-7.427468E-5	T	29497	2017.09.19 16:33:31.514023471	0000678	
50	0.000308	-0.000225	-0.000207	-4.032236E-5	T	29497	2017.09.19 16:33:31.524023471	0000678	
50	0.000316	-0.000225	-0.000216	-5.028460E-5	T	29497	2017.09.19 16:33:31.534023471	0000678	
50	0.000308	-0.000221	-0.000207	-5.535432E-5	T	29497	2017.09.19 16:33:31.544023471	0000678	
50	0.000331	-0.000240	-0.000220	-5.514144E-5	T	29497	2017.09.19 16:33:31.554023471	0000678	
50	0.000320	-0.000216	-0.000221	-8.333578E-5	T	29497	2017.09.19 16:33:31.564023471	0000678	
50	0.000301	-0.000202	-0.000221	-3.645180E-5	T	29497	2017.09.19 16:33:31.574023471	0000678	
50	0.000297	-0.000211	-0.000202	-5.545654E-5	T	29497	2017.09.19 16:33:31.584023471	0000678	
50	0.000339	-0.000240	-0.000234	-4.508376E-5	T	29497	2017.09.19 16:33:31.594023471	0000678	
51	0.000320	-0.000230	-0.000212	-6.925967E-5	T	29494	2017.09.19 16:33:31.604067221	0000678	
51	0.000320	-0.000216	-0.000226	-6.931562E-5	T	29494	2017.09.19 16:33:31.614067221	0000678	
51	0.000348	-0.000254	-0.000220	-8.802601E-5	T	29494	2017.09.19 16:33:31.624067221	0000678	
51	0.000308	-0.000206	-0.000216	-7.443837E-5	T	29494	2017.09.19 16:33:31.634067221	0000678	
51	0.000306	-0.000216	-0.000216	-2.635892E-5	T	29494	2017.09.19 16:33:31.644067221	0000678	
51	0.000326	-0.000225	-0.000226	-6.924230E-5	T	29494	2017.09.19 16:33:31.654067221	0000678	
51	0.000319	-0.000235	-0.000211	-4.022015E-5	T	29494	2017.09.19 16:33:31.664067221	0000678	
51	0.000340	-0.000225	-0.000245	-6.916345E-5	T	29494	2017.09.19 16:33:31.674067221	0000678	
51	0.000323	-0.000221	-0.000231	-4.525514E-5	T	29494	2017.09.19 16:33:31.684067221	0000678	
51	0.000303	-0.000206	-0.000216	-5.043938E-5	T	29494	2017.09.19 16:33:31.694067221	0000678	
52	0.000349	-0.000263	-0.000220	-6.395370E-5	T	29508	2017.09.19 16:33:31.704110971	0000678	
52	0.000315	-0.000240	-0.000201	-3.622109E-5	T	29508	2017.09.19 16:33:31.714110971	0000678	
52	0.000317	-0.000221	-0.000212	-8.333240E-5	T	29508	2017.09.19 16:33:31.724110971	0000678	
52	0.000294	-0.000206	-0.000207	-3.647731E-5	T	29508	2017.09.19 16:33:31.734110971	0000678	
52	0.000313	-0.000216	-0.000212	-7.937330E-5	T	29508	2017.09.19 16:33:31.744110971	0000678	
52	0.000332	-0.000235	-0.000230	-4.014130E-5	T	29508	2017.09.19 16:33:31.754110971	0000678	
52	0.000321	-0.000235	-0.000215	-3.620372E-5	T	29508	2017.09.19 16:33:31.764110971	0000678	
52	0.000320	-0.000216	-0.000221	-8.333578E-5	T	29508	2017.09.19 16:33:31.774110971	0000678	
52	0.000334	-0.000225	-0.000235	-7.420474E-5	T	29508	2017.09.19 16:33:31.784110971	0000678	
52	0.000319	-0.000225	-0.000216	-6.928380E-5	T	29508	2017.09.19 16:33:31.794110971	0000678	
53	0.000343	-0.000254	-0.000225	-5.000685E-5	T	29498	2017.09.19 16:33:31.804154721	0000678	
53	0.000331	-0.000225	-0.000231	-7.422134E-5	T	29498	2017.09.19 16:33:31.814154721	0000678	
53	0.000332	-0.000244	-0.000215	-6.412923E-5	T	29498	2017.09.19 16:33:31.824154721	0000678	
53	0.000311	-0.000221	-0.000216	-4.031760E-5	T	29498	2017.09.19 16:33:31.834154721	0000678	
53	0.000322	-0.000225	-0.000226	-4.524330E-5	T	29498	2017.09.19 16:33:31.844154721	0000678	
53	0.000318	-0.000225	-0.000212	-7.430019E-5	T	29498	2017.09.19 16:33:31.854154721	0000678	
53	0.000362	-0.000282	-0.000215	-7.381925E-5	T	29498	2017.09.19 16:33:31.864154721	0000678	
53	0.000318	-0.000230	-0.000215	-4.024428E-5	T	29498	2017.09.19 16:33:31.874154721	0000678	
53	0.000337	-0.000249	-0.000220	-5.506812E-5	T	29498	2017.09.19 16:33:31.884154721	0000678	
53	0.000310	-0.000211	-0.000221	-5.537768E-5	T	29498	2017.09.19 16:33:31.894154721	0000678	
54	0.000309	-0.000216	-0.000212	-6.437393E-5	T	29489	2017.09.19 16:33:31.904198471	0000678	
54	0.000340	-0.000235	-0.000235	-7.412328E-5	T	29489	2017.09.19 16:33:31.914198471	0000678	
54	0.000304	-0.000225	-0.000202	-3.634328E-5	T	29489	2017.09.19 16:33:31.924198471	0000678	
54	0.000337	-0.000240	-0.000230	-5.509994E-5	T	29489	2017.09.19 16:33:31.934198471	0000678	
54	0.000315	-0.000221	-0.000221	-4.029685E-5	T	29489	2017.09.19 16:33:31.944198471	0000678	
54	0.000305	-0.000192	-0.000231	-5.049117E-5	T	29489	2017.09.19 16:33:31.954198471	0000678	
54	0.000336	-0.000240	-0.000225	-6.412032E-5	T	29489	2017.09.19 16:33:31.964198471	0000678	
54	0.000309	-0.000221	-0.000207	-6.435395E-5	T	29489	2017.09.19 16:33:31.974198471	0000678	
54	0.000350	-0.000259	-0.000230	-4.994537E-5	T	29489	2017.09.19 16:33:31.984198471	0000678	
54	0.000329	-0.000244	-0.000211	-6.414583E-5	T	29489	2017.09.19 16:33:31.994198471	0000678	
55	0.000321	-0.000221	-0.000221	-7.429543E-5	T	29498	2017.09.19 16:33:32.004242221	0000678	
55	0.000332	-0.000221	-0.000235	-7.923712E-5	T	29498	2017.09.19 16:33:32.014242221	0000678	
55	0.000321	-0.000230	-0.000220	-4.022353E-5	T	29498	2017.09.19 16:33:32.024242221	0000678	
55	0.000324	-0.000221	-0.000235	-3.623891E-5	T	29498	2017.09.19 16:33:32.034242221	0000678	
55	0.000313	-0.000225	-0.000207	-6.932115E-5	T	29498	2017.09.19 16:33:32.044242221	0000678	
55	0.000327	-0.000244	-0.000211	-5.014642E-5	T	29498	2017.09.19 16:33:32.054242221	0000678	
55	0.000316	-0.000225	-0.000220	-3.126464E-5	T	29498	2017.09.19 16:33:32.064242221	0000678	
55	0.000325	-0.000240	-0.000211	-5.517879E-5	T	29498	2017.09.19 16:33:32.074242221	0000678	
55	0.000320	-0.000230	-0.000216	-5.524365E-5	T	29498	2017.09.19 16:33:32.084242221	0000678	
55	0.000314	-0.000211	-0.000231	-2.633740E-5	T	29498	2017.09.19 16:33:32.094242221	0000678	
56	0.000310	-0.000197	-0.000231	-6.045002E-5	T	29477	2017.09.19 16:33:32.104285971	0000678	
56	0.000314	-0.000225	-0.000216	-3.628518E-5	T	29477	2017.09.19 16:33:32.114285971	0000678	
56	0.000321	-0.000240	-0.000206	-5.519954E-5	T	29477	2017.09.19 16:33:32.124285971	0000678	
56	0.000330	-0.000249	-0.000206	-6.412585E-5	T	29477	2017.09.19 16:33:32.134285971	0000678	
56	0.000314	-0.000225	-0.000212	-5.530099E-5	T	29477	2017.09.19 16:33:32.144285971	0000678	
56	0.000334	-0.000240	-0.000220	-7.414065E-5	T	29477	2017.09.19 16:33:32.154285971	0000678	
56	0.000349	-0.000254	-0.000234	-4.996950E-5	T	29477	2017.09.19 16:33:32.164285971	0000678	
56	0.000315	-0.000206	-0.000226	-7.439687E-5	T	29477	2017.09.19 16:33:32.174285971	0000678	
56	0.000331	-0.000249	-0.000215	-4.008950E-5	T	29477	2017.09.19 16:33:32.184285971	0000678	
56	0.000317	-0.000211	-0.000226	-6.935635E-5	T	29477	2017.09.19 16:33:32.194285971	0000678	
57	0.000323	-0.000240	-0.000206	-6.419917E-5	T	29491	2017.09.19 16:33:32.204329721	0000678	
57	0.000323	-0.000225	-0.000226	-5.024309E-5	T	29491	2017.09.19 16:33:32.214329721	0000678	
57	0.000342	-0.000235	-0.000244	-4.008320E-5	T	29491	2017.09.19 16:33:32.224329721	0000678	
57	0.000337	-0.000235	-0.000221	-9.818038E-5	T	29491	2017.09.19 16:33:32.234329721	0000678	
57	0.000325	-0.000230	-0.000225	-4.520257E-5	T	29491	2017.09.19 16:33:32.244329721	0000678	
57	0.000317	-0.000216	-0.000221	-6.933637E-5	T	29491	2017.09.19 16:33:32.254329721	0000678	
57	0.000299	-0.000216	-0.000202	-4.541622E-5	T	29491	2017.09.19 16:33:32.264329721	0000678	
57	0.000333	-0.000230	-0.000226	-8.320098E-5	T	29491	2017.09.19 16:33:32.274329721	0000678	
57	0.000351	-0.000259	-0.000230	-5.494516E-5	T	29491	2017.09.19 16:33:32.284329721	0000678	
57	0.000325	-0.000240	-0.000211	-6.017858E-5	T	29491	2017.09.19 16:33:32.294329721	0000678	
58	0.000340	-0.000249	-0.000211	-9.310389E-5	T	29491	2017.09.19 16:33:32.304373471	0000678	
58	0.000329	-0.000235	-0.000225	-4.516184E-5	T	29491	2017.09.19 16:33:32.314373471	0000678	
58	0.000328	-0.000225	-0.000231	-6.022193E-5	T	29491	2017.09.19 16:33:32.324373471	0000678	
58	0.000336	-0.000244	-0.000215	-8.312844E-5	T	29491	2017.09.19 16:33:32.334373471	0000678	
58	0.000324	-0.000230	-0.000225	-3.120316E-5	T	29491	2017.09.19 16:33:32.344373471	0000678	
58	0.000323	-0.000211	-0.000226	-9.335535E-5	T	29491	2017.09.19 16:33:32.354373471	0000678	
58	0.000333	-0.000244	-0.000215	-6.912902E-5	T	29491	2017.09.19 16:33:32.364373471	0000678	
58	0.000306	-0.000211	-0.000221	-2.137911E-5	T	29491	2017.09.19 16:33:32.374373471	0000678	
58	0.000333	-0.000235	-0.000234	-2.612528E-5	T	29491	2017.09.19 16:33:32.384373471	0000678	
58	0.000337	-0.000244	-0.000225	-5.508811E-5	T	29491	2017.09.19 16:33:32.394373471	0000678	
59	0.000328	-0.000235	-0.000220	-6.018196E-5	T	29500	2017.09.19 16:33:32.404417221	0000678	
59	0.000316	-0.000221	-0.000221	-5.029643E-5	T	29500	2017.09.19 16:33:32.414417221	0000678	
59	0.000307	-0.000197	-0.000226	-6.447061E-5	T	29500	2017.09.19 16:33:32.424417221	0000678	
59	0.000298	-0.000211	-0.000193	-8.349272E-5	T	29500	2017.09.19 16:33:32.434417221	0000678	
59	0.000325	-0.000230	-0.000212	-8.825888E-5	T	29500	2017.09.19 16:33:32.444417221	0000678	
59	0.000323	-0.000230	-0.000225	-2.120358E-5	T	29500	2017.09.19 16:33:32.454417221	0000678	
59	0.000303	-0.000206	-0.000216	-5.543917E-5	T	29500	2017.09.19 16:33:32.464417221	0000678	
59	0.000314	-0.000221	-0.000216	-5.531697E-5	T	29500	2017.09.19 16:33:32.474417221	0000678	
59	0.000334	-0.000235	-0.000230	-5.514067E-5	T	29500	2017.09.19 16:33:32.484417221	0000678	
59	0.000334	-0.000235	-0.000221	-8.818079E-5	T	29500	2017.09.19 16:33:32.494417221	0000678	
60	0.000334	-0.000244	-0.000220	-6.010865E-5	T	29494	2017.09.19 16:33:32.504460971	0000678	
60	0.000317	-0.000202	-0.000226	-9.342866E-5	T	29494	2017.09.19 16:33:32.514460971	0000678	
60	0.000310	-0.000230	-0.000206	-2.628222E-5	T	29494	2017.09.19 16:33:32.524460971	0000678	
60	0.000330	-0.000240	-0.000211	-7.917779E-5	T	29494	2017.09.19 16:33:32.534460971	0000678	
60	0.000318	-0.000221	-0.000207	-9.835252E-5	T	29494	2017.09.19 16:33:32.544460971	0000678	
60	0.000303	-0.000206	-0.000216	-5.543917E-5	T	29494	2017.09.19 16:33:32.554460971	0000678	
60	0.000309	-0.000211	-0.000216	-6.439806E-5	T	29494	2017.09.19 16:33:32.564460971	0000678	
60	0.000337	-0.000244	-0.000215	-8.812823E-5	T	29494	2017.09.19 16:33:32.574460971	0000678	
60	0.000329	-0.000221	-0.000231	-7.925372E-5	T	29494	2017.09.19 16:33:32.584460971	0000678	
60	0.000307	-0.000192	-0.000235	-4.547478E-5	T	29494	2017.09.19 16:33:32.594460971	0000678	
61	0.000305	-0.000202	-0.000212	-8.348718E-5	T	29499	2017.09.19 16:33:32.604504721	0000678	
61	0.000315	-0.000197	-0.000240	-5.041309E-5	T	29499	2017.09.19 16:33:32.614504721	0000678	
61	0.000333	-0.000254	-0.000206	-6.008528E-5	T	29499	2017.09.19 16:33:32.624504721	0000678	
61	0.000331	-0.000235	-0.000225	-6.016121E-5	T	29499	2017.09.19 16:33:32.634504721	0000678	
61	0.000324	-0.000225	-0.000231	-3.622293E-5	T	29499	2017.09.19 16:33:32.644504721	0000678	
61	0.000315	-0.000202	-0.000226	-8.342908E-5	T	29499	2017.09.19 16:33:32.654504721	0000678	
61	0.000322	-0.000225	-0.000221	-6.426326E-5	T	29499	2017.09.19 16:33:32.664504721	0000678	
61	0.000335	-0.000249	-0.000220	-4.006875E-5	T	29499	2017.09.19 16:33:32.674504721	0000678	
61	0.000310	-0.000206	-0.000216	-8.343800E-5	T	29499	2017.09.19 16:33:32.684504721	0000678	
61	0.000354	-0.000268	-0.000230	-2.587306E-5	T	29499	2017.09.19 16:33:32.694504721	0000678	
62	0.000333	-0.000244	-0.000220	-5.510886E-5	T	29484	2017.09.19 16:33:32.704548471	0000678	
62	0.000295	-0.000197	-0.000216	-4.051311E-5	T	29484	2017.09.19 16:33:32.714548471	0000678	
62	0.000341	-0.000249	-0.000225	-6.004717E-5	T	29484	2017.09.19 16:33:32.724548471	0000678	
62	0.000326	-0.000230	-0.000212	-9.325867E-5	T	29484	2017.09.19 16:33:32.734548471	0000678	
62	0.000352	-0.000254	-0.000230	-7.898489E-5	T	29484	2017.09.19 16:33:32.744548471	0000678	
62	0.000321	-0.000225	-0.000221	-6.026343E-5	T	29484	2017.09.19 16:33:32.754548471	0000678	
62	0.000339	-0.000235	-0.000235	-6.912349E-5	T	29484	2017.09.19 16:33:32.764548471	0000678	
62	0.000319	-0.000216	-0.000226	-6.431583E-5	T	29484	2017.09.19 16:33:32.774548471	0000678	
62	0.000306	-0.000211	-0.000212	-6.441466E-5	T	29484	2017.09.19 16:33:32.784548471	0000678	
62	0.000320	-0.000216	-0.000231	-5.029566E-5	T	29484	2017.09.19 16:33:32.794548471	0000678	
63	0.000318	-0.000211	-0.000235	-4.032021E-5	T	29482	2017.09.19 16:33:32.804592221	0000678	
63	0.000336	-0.000230	-0.000235	-6.916422E-5	T	29482	2017.09.19 16:33:32.814592221	0000678	
63	0.000328	-0.000225	-0.000235	-4.520595E-5	T	29482	2017.09.19 16:33:32.824592221	0000678	
63	0.000324	-0.000230	-0.000225	-3.620295E-5	T	29482	2017.09.19 16:33:32.834592221	0000678	
63	0.000317	-0.000216	-0.000226	-5.531620E-5	T	29482	2017.09.19 16:33:32.844592221	0000678	
63	0.000304	-0.000225	-0.000198	-5.535909E-5	T	29482	2017.09.19 16:33:32.854592221	0000678	
63	0.000312	-0.000211	-0.000226	-4.535735E-5	T	29482	2017.09.19 16:33:32.864592221	0000678	
63	0.000334	-0.000235	-0.000221	-8.818079E-5	T	29482	2017.09.19 16:33:32.874592221	0000678	
63	0.000281	-0.000169	-0.000221	-3.672062E-5	T	29482	2017.09.19 16:33:32.884592221	0000678	
63	0.000317	-0.000225	-0.000221	-3.626443E-5	T	29482	2017.09.19 16:33:32.894592221	0000678	
64	0.000339	-0.000244	-0.000225	-6.908752E-5	T	29486	2017.09.19 16:33:32.904635971	0000678	
64	0.000299	-0.000206	-0.000212	-4.545618E-5	T	29486	2017.09.19 16:33:32.914635971	0000678	
64	0.000328	-0.000240	-0.000220	-4.014207E-5	T	29486	2017.09.19 16:33:32.924635971	0000678	
64	0.000344	-0.000254	-0.000230	-3.098690E-5	T	29486	2017.09.19 16:33:32.934635971	0000678	
64	0.000315	-0.000225	-0.000212	-6.030078E-5	T	29486	2017.09.19 16:33:32.944635971	0000678	
64	0.000304	-0.000216	-0.000207	-5.539505E-5	T	29486	2017.09.19 16:33:32.954635971	0000678	
64	0.000311	-0.000206	-0.000226	-5.539767E-5	T	29486	2017.09.19 16:33:32.964635971	0000678	
64	0.000315	-0.000211	-0.000231	-4.033681E-5	T	29486	2017.09.19 16:33:32.974635971	0000678	
64	0.000305	-0.000216	-0.000216	-1.735929E-5	T	29486	2017.09.19 16:33:32.984635971	0000678	
64	0.000339	-0.000254	-0.000211	-7.406395E-5	T	29486	2017.09.19 16:33:32.994635971	0000678	
65	0.000316	-0.000216	-0.000221	-6.433658E-5	T	29493	2017.09.19 16:33:33.004679721	0000678	
65	0.000306	-0.000206	-0.000216	-6.943858E-5	T	29493	2017.09.19 16:33:33.014679721	0000678	
65	0.000314	-0.000216	-0.000226	-3.631700E-5	T	29493	2017.09.19 16:33:33.024679721	0000678	
65	0.000335	-0.000230	-0.000239	-4.514447E-5	T	29493	2017.09.19 16:33:33.034679721	0000678	
65	0.000316	-0.000216	-0.000226	-5.031641E-5	T	29493	2017.09.19 16:33:33.044679721	0000678	
65	0.000307	-0.000216	-0.000212	-5.537430E-5	T	29493	2017.09.19 16:33:33.054679721	0000678	
65	0.000316	-0.000221	-0.000221	-5.029643E-5	T	29493	2017.09.19 16:33:33.064679721	0000678	
65	0.000347	-0.000263	-0.000225	-3.093433E-5	T	29493	2017.09.19 16:33:33.074679721	0000678	
65	0.000308	-0.000216	-0.000207	-7.439426E-5	T	29493	2017.09.19 16:33:33.084679721	0000678	
65	0.000330	-0.000235	-0.000221	-6.918159E-5	T	29493	2017.09.19 16:33:33.094679721	0000678	
66	0.000347	-0.000254	-0.000230	-4.998610E-5	T	29492	2017.09.19 16:33:33.104723471	0000678	
66	0.000315	-0.000221	-0.000216	-6.431660E-5	T	29492	2017.09.19 16:33:33.114723471	0000678	
66	0.000331	-0.000240	-0.000220	-5.514144E-5	T	29492	2017.09.19 16:33:33.124723471	0000678	
66	0.000323	-0.000216	-0.000231	-6.429508E-5	T	29492	2017.09.19 16:33:33.134723471	0000678	
66	0.000329	-0.000254	-0.000206	-4.008612E-5	T	29492	2017.09.19 16:33:33.144723471	0000678	
66	0.000338	-0.000222	-0.000231	-0.000107	T	29492	2017.09.19 16:33:33.154723471	0000678	
66	0.000323	-0.000230	-0.000216	-6.924307E-5	T	29492	2017.09.19 16:33:33.164723471	0000678	
66	0.000353	-0.000263	-0.000234	-3.089698E-5	T	29492	2017.09.19 16:33:33.174723471	0000678	
66	0.000350	-0.000254	-0.000230	-6.898531E-5	T	29492	2017.09.19 16:33:33.184723471	0000678	
66	0.000355	-0.000268	-0.000225	-5.989239E-5	T	29492	2017.09.19 16:33:33.194723471	0000678	
67	0.000339	-0.000240	-0.000216	-0.000102	T	29495	2017.09.19 16:33:33.204767221	0000678	
67	0.000318	-0.000211	-0.000231	-5.533618E-5	T	29495	2017.09.19 16:33:33.214767221	0000678	
67	0.000335	-0.000221	-0.000245	-5.519662E-5	T	29495	2017.09.19 16:33:33.224767221	0000678	
67	0.000324	-0.000225	-0.000226	-6.024268E-5	T	29495	2017.09.19 16:33:33.234767221	0000678	
67	0.000311	-0.000202	-0.000231	-5.040971E-5	T	29495	2017.09.19 16:33:33.244767221	0000678	
67	0.000322	-0.000230	-0.000216	-6.424328E-5	T	29495	2017.09.19 16:33:33.254767221	0000678	
67	0.000323	-0.000216	-0.000221	-9.333536E-5	T	29495	2017.09.19 16:33:33.264767221	0000678	
67	0.000355	-0.000268	-0.000225	-5.989239E-5	T	29495	2017.09.19 16:33:33.274767221	0000678	
67	0.000309	-0.000197	-0.000221	-8.849035E-5	T	29495	2017.09.19 16:33:33.284767221	0000678	
67	0.000335	-0.000244	-0.000225	-4.008873E-5	T	29495	2017.09.19 16:33:33.294767221	0000678	
68	0.000318	-0.000230	-0.000207	-7.428021E-5	T	29488	2017.09.19 16:33:33.304810971	0000678	
68	0.000331	-0.000225	-0.000235	-6.020533E-5	T	29488	2017.09.19 16:33:33.314810971	0000678	
68	0.000300	-0.000206	-0.000207	-6.947593E-5	T	29488	2017.09.19 16:33:33.324810971	0000678	
68	0.000332	-0.000240	-0.000220	-6.414107E-5	T	29488	2017.09.19 16:33:33.334810971	0000678	
68	0.000342	-0.000249	-0.000225	-6.404700E-5	T	29488	2017.09.19 16:33:33.344810971	0000678	
68	0.000329	-0.000230	-0.000221	-7.922190E-5	T	29488	2017.09.19 16:33:33.354810971	0000678	
68	0.000297	-0.000192	-0.000221	-5.053267E-5	T	29488	2017.09.19 16:33:33.364810971	0000678	
68	0.000298	-0.000197	-0.000221	-3.649253E-5	T	29488	2017.09.19 16:33:33.374810971	0000678	
68	0.000318	-0.000216	-0.000231	-3.629625E-5	T	29488	2017.09.19 16:33:33.384810971	0000678	
68	0.000281	-0.000183	-0.000207	-5.066409E-5	T	29488	2017.09.19 16:33:33.394810971	0000678	
69	0.000314	-0.000206	-0.000221	-8.341725E-5	T	29488	2017.09.19 16:33:33.404854721	0000678	
69	0.000301	-0.000192	-0.000221	-6.953188E-5	T	29488	2017.09.19 16:33:33.414854721	0000678	
69	0.000316	-0.000225	-0.000216	-5.528439E-5	T	29488	2017.09.19 16:33:33.424854721	0000678	
69	0.000307	-0.000211	-0.000221	-3.637848E-5	T	29488	2017.09.19 16:33:33.434854721	0000678	
69	0.000287	-0.000192	-0.000202	-6.961073E-5	T	29488	2017.09.19 16:33:33.444854721	0000678	
69	0.000308	-0.000216	-0.000212	-6.037409E-5	T	29488	2017.09.19 16:33:33.454854721	0000678	
69	0.000304	-0.000202	-0.000216	-6.947117E-5	T	29488	2017.09.19 16:33:33.464854721	0000678	
69	0.000322	-0.000235	-0.000207	-7.423948E-5	T	29488	2017.09.19 16:33:33.474854721	0000678	
69	0.000340	-0.000259	-0.000211	-6.402364E-5	T	29488	2017.09.19 16:33:33.484854721	0000678	
69	0.000300	-0.000206	-0.000216	-3.643996E-5	T	29488	2017.09.19 16:33:33.494854721	0000678	
70	0.000320	-0.000240	-0.000211	-1.718038E-5	T	29495	2017.09.19 16:33:33.504898471	0000678	
70	0.000336	-0.000254	-0.000211	-6.006453E-5	T	29495	2017.09.19 16:33:33.514898471	0000678	
70	0.000304	-0.000211	-0.000216	-3.639923E-5	T	29495	2017.09.19 16:33:33.524898471	0000678	
70	0.000364	-0.000259	-0.000248	-5.987025E-5	T	29495	2017.09.19 16:33:33.534898471	0000678	
70	0.000319	-0.000225	-0.000221	-5.026385E-5	T	29495	2017.09.19 16:33:33.544898471	0000678	
70	0.000317	-0.000221	-0.000226	-3.127647E-5	T	29495	2017.09.19 16:33:33.554898471	0000678	
70	0.000355	-0.000259	-0.000230	-7.394437E-5	T	29495	2017.09.19 16:33:33.564898471	0000678	
70	0.000339	-0.000244	-0.000225	-6.908752E-5	T	29495	2017.09.19 16:33:33.574898471	0000678	
70	0.000329	-0.000230	-0.000226	-6.420178E-5	T	29495	2017.09.19 16:33:33.584898471	0000678	
70	0.000343	-0.000244	-0.000234	-5.505076E-5	T	29495	2017.09.19 16:33:33.594898471	0000678	
71	0.000310	-0.000216	-0.000212	-6.937372E-5	T	29487	2017.09.19 16:33:33.604942221	0000678	
71	0.000317	-0.000221	-0.000221	-5.529622E-5	T	29487	2017.09.19 16:33:33.614942221	0000678	
71	0.000336	-0.000240	-0.000234	-1.708493E-5	T	29487	2017.09.19 16:33:33.624942221	0000678	
71	0.000330	-0.000240	-0.000220	-5.014165E-5	T	29487	2017.09.19 16:33:33.634942221	0000678	
71	0.000303	-0.000202	-0.000221	-4.545142E-5	T	29487	2017.09.19 16:33:33.644942221	0000678	
71	0.000334	-0.000235	-0.000226	-7.416063E-5	T	29487	2017.09.19 16:33:33.654942221	0000678	
71	0.000328	-0.000230	-0.000226	-6.020195E-5	T	29487	2017.09.19 16:33:33.664942221	0000678	
71	0.000317	-0.000225	-0.000216	-6.028418E-5	T	29487	2017.09.19 16:33:33.674942221	0000678	
71	0.000311	-0.000216	-0.000221	-3.633775E-5	T	29487	2017.09.19 16:33:33.684942221	0000678	
71	0.000327	-0.000221	-0.000235	-5.523812E-5	T	29487	2017.09.19 16:33:33.694942221	0000678	
72	0.000319	-0.000230	-0.000212	-6.425988E-5	T	29490	2017.09.19 16:33:33.704985971	0000678	
72	0.000320	-0.000221	-0.000226	-5.027568E-5	T	29490	2017.09.19 16:33:33.714985971	0000678	
72	0.000320	-0.000216	-0.000231	-5.029566E-5	T	29490	2017.09.19 16:33:33.724985971	0000678	
72	0.000332	-0.000235	-0.000230	-4.514109E-5	T	29490	2017.09.19 16:33:33.734985971	0000678	
72	0.000334	-0.000249	-0.000215	-5.508887E-5	T	29490	2017.09.19 16:33:33.744985971	0000678	
72	0.000333	-0.000249	-0.000211	-6.410510E-5	T	29490	2017.09.19 16:33:33.754985971	0000678	
72	0.000311	-0.000211	-0.000216	-7.439764E-5	T	29490	2017.09.19 16:33:33.764985971	0000678	
72	0.000322	-0.000202	-0.000245	-5.035161E-5	T	29490	2017.09.19 16:33:33.774985971	0000678	
72	0.000291	-0.000188	-0.000216	-5.058601E-5	T	29490	2017.09.19 16:33:33.784985971	0000678	
72	0.000304	-0.000202	-0.000226	-2.643146E-5	T	29490	2017.09.19 16:33:33.794985971	0000678	
73	0.000337	-0.000235	-0.000231	-6.914009E-5	T	29493	2017.09.19 16:33:33.805029721	0000678	
73	0.000317	-0.000225	-0.000221	-3.626443E-5	T	29493	2017.09.19 16:33:33.815029721	0000678	
73	0.000280	-0.000188	-0.000202	-5.064411E-5	T	29493	2017.09.19 16:33:33.825029721	0000678	
73	0.000344	-0.000249	-0.000230	-5.502662E-5	T	29493	2017.09.19 16:33:33.835029721	0000678	
73	0.000313	-0.000216	-0.000221	-5.033716E-5	T	29493	2017.09.19 16:33:33.845029721	0000678	
73	0.000304	-0.000221	-0.000202	-5.537507E-5	T	29493	2017.09.19 16:33:33.855029721	0000678	
73	0.000321	-0.000240	-0.000211	-2.618000E-5	T	29493	2017.09.19 16:33:33.865029721	0000678	
73	0.000299	-0.000206	-0.000216	-2.644038E-5	T	29493	2017.09.19 16:33:33.875029721	0000678	
73	0.000310	-0.000206	-0.000221	-6.941783E-5	T	29493	2017.09.19 16:33:33.885029721	0000678	
73	0.000292	-0.000211	-0.000198	-4.047376E-5	T	29493	2017.09.19 16:33:33.895029721	0000678	
74	0.000316	-0.000240	-0.000201	-4.522071E-5	T	29493	2017.09.19 16:33:33.905073471	0000678	
74	0.000305	-0.000206	-0.000216	-6.443879E-5	T	29493	2017.09.19 16:33:33.915073471	0000678	
74	0.000330	-0.000240	-0.000215	-6.916161E-5	T	29493	2017.09.19 16:33:33.925073471	0000678	
74	0.000300	-0.000211	-0.000212	-3.141604E-5	T	29493	2017.09.19 16:33:33.935073471	0000678	
74	0.000300	-0.000192	-0.000221	-6.453209E-5	T	29493	2017.09.19 16:33:33.945073471	0000678	
74	0.000306	-0.000225	-0.000198	-6.435871E-5	T	29493	2017.09.19 16:33:33.955073471	0000678	
74	0.000322	-0.000235	-0.000220	-1.218397E-5	T	29493	2017.09.19 16:33:33.965073471	0000678	
74	0.000322	-0.000221	-0.000226	-6.027526E-5	T	29493	2017.09.19 16:33:33.975073471	0000678	
74	0.000317	-0.000225	-0.000216	-6.028418E-5	T	29493	2017.09.19 16:33:33.985073471	0000678	
74	0.000309	-0.000230	-0.000198	-6.031815E-5	T	29493	2017.09.19 16:33:33.995073471	0000678	
75	0.000311	-0.000197	-0.000235	-5.043384E-5	T	29490	2017.09.19 16:33:34.005117221	0000678	
75	0.000317	-0.000211	-0.000221	-8.337651E-5	T	29490	2017.09.19 16:33:34.015117221	0000678	
75	0.000325	-0.000235	-0.000215	-6.020271E-5	T	29490	2017.09.19 16:33:34.025117221	0000678	
75	0.000322	-0.000230	-0.000207	-8.827963E-5	T	29490	2017.09.19 16:33:34.035117221	0000678	
75	0.000320	-0.000235	-0.000215	-3.120393E-5	T	29490	2017.09.19 16:33:34.045117221	0000678	
75	0.000332	-0.000221	-0.000231	-8.825334E-5	T	29490	2017.09.19 16:33:34.055117221	0000678	
75	0.000333	-0.000235	-0.000226	-6.916084E-5	T	29490	2017.09.19 16:33:34.065117221	0000678	
75	0.000320	-0.000225	-0.000221	-5.526364E-5	T	29490	2017.09.19 16:33:34.075117221	0000678	
75	0.000309	-0.000221	-0.000215	-2.131839E-5	T	29490	2017.09.19 16:33:34.085117221	0000678	
75	0.000327	-0.000235	-0.000220	-5.518217E-5	T	29490	2017.09.19 16:33:34.095117221	0000678	
76	0.000314	-0.000211	-0.000226	-5.535693E-5	T	29486	2017.09.19 16:33:34.105160971	0000678	
76	0.000339	-0.000244	-0.000230	-4.506777E-5	T	29486	2017.09.19 16:33:34.115160971	0000678	
76	0.000315	-0.000206	-0.000231	-6.037671E-5	T	29486	2017.09.19 16:33:34.125160971	0000678	
76	0.000322	-0.000230	-0.000216	-6.424328E-5	T	29486	2017.09.19 16:33:34.135160971	0000678	
76	0.000297	-0.000197	-0.000216	-5.051269E-5	T	29486	2017.09.19 16:33:34.145160971	0000678	
76	0.000321	-0.000221	-0.000231	-3.125572E-5	T	29486	2017.09.19 16:33:34.155160971	0000678	
76	0.000325	-0.000244	-0.000211	-3.614700E-5	T	29486	2017.09.19 16:33:34.165160971	0000678	
76	0.000310	-0.000211	-0.000221	-5.537768E-5	T	29486	2017.09.19 16:33:34.175160971	0000678	
76	0.000315	-0.000230	-0.000211	-4.026088E-5	T	29486	2017.09.19 16:33:34.185160971	0000678	
76	0.000315	-0.000211	-0.000231	-3.633698E-5	T	29486	2017.09.19 16:33:34.195160971	0000678	
77	0.000294	-0.000206	-0.000198	-6.951328E-5	T	29487	2017.09.19 16:33:34.205204721	0000678	
77	0.000310	-0.000211	-0.000221	-5.537768E-5	T	29487	2017.09.19 16:33:34.215204721	0000678	
77	0.000304	-0.000216	-0.000212	-3.137531E-5	T	29487	2017.09.19 16:33:34.225204721	0000678	
77	0.000347	-0.000254	-0.000230	-4.998610E-5	T	29487	2017.09.19 16:33:34.235204721	0000678	
77	0.000306	-0.000197	-0.000216	-8.851110E-5	T	29487	2017.09.19 16:33:34.245204721	0000678	
77	0.000327	-0.000244	-0.000215	-3.113061E-5	T	29487	2017.09.19 16:33:34.255204721	0000678	
77	0.000322	-0.000225	-0.000221	-6.426326E-5	T	29487	2017.09.19 16:33:34.265204721	0000678	
77	0.000319	-0.000244	-0.000201	-4.018833E-5	T	29487	2017.09.19 16:33:34.275204721	0000678	
77	0.000288	-0.000188	-0.000207	-6.962257E-5	T	29487	2017.09.19 16:33:34.285204721	0000678	
77	0.000333	-0.000240	-0.000230	-1.710153E-5	T	29487	2017.09.19 16:33:34.295204721	0000678	
78	0.000317	-0.000216	-0.000226	-5.531620E-5	T	29500	2017.09.19 16:33:34.305248471	0000678	
78	0.000330	-0.000244	-0.000211	-6.914562E-5	T	29500	2017.09.19 16:33:34.315248471	0000678	
78	0.000326	-0.000240	-0.000220	-2.114286E-5	T	29500	2017.09.19 16:33:34.325248471	0000678	
78	0.000316	-0.000230	-0.000215	-2.124508E-5	T	29500	2017.09.19 16:33:34.335248471	0000678	
78	0.000317	-0.000221	-0.000226	-3.127647E-5	T	29500	2017.09.19 16:33:34.345248471	0000678	
78	0.000341	-0.000263	-0.000215	-3.097583E-5	T	29500	2017.09.19 16:33:34.355248471	0000678	
78	0.000316	-0.000202	-0.000235	-6.039269E-5	T	29500	2017.09.19 16:33:34.365248471	0000678	
78	0.000304	-0.000178	-0.000240	-5.556766E-5	T	29500	2017.09.19 16:33:34.375248471	0000678	
78	0.000327	-0.000244	-0.000211	-5.014642E-5	T	29500	2017.09.19 16:33:34.385248471	0000678	
78	0.000303	-0.000225	-0.000198	-4.535951E-5	T	29500	2017.09.19 16:33:34.395248471	0000678	
79	0.000324	-0.000235	-0.000215	-5.520292E-5	T	29498	2017.09.19 16:33:34.405292221	0000678	
79	0.000313	-0.000211	-0.000226	-5.035714E-5	T	29498	2017.09.19 16:33:34.415292221	0000678	
79	0.000335	-0.000254	-0.000211	-5.506474E-5	T	29498	2017.09.19 16:33:34.425292221	0000678	
79	0.000312	-0.000221	-0.000220	-7.298228E-6	T	29498	2017.09.19 16:33:34.435292221	0000678	
79	0.000316	-0.000221	-0.000221	-5.029643E-5	T	29498	2017.09.19 16:33:34.445292221	0000678	
79	0.000334	-0.000244	-0.000215	-7.412881E-5	T	29498	2017.09.19 16:33:34.455292221	0000678	
79	0.000349	-0.000254	-0.000234	-4.996950E-5	T	29498	2017.09.19 16:33:34.465292221	0000678	
79	0.000292	-0.000192	-0.000212	-6.056961E-5	T	29498	2017.09.19 16:33:34.475292221	0000678	
79	0.000324	-0.000240	-0.000206	-6.919896E-5	T	29498	2017.09.19 16:33:34.485292221	0000678	
79	0.000321	-0.000235	-0.000215	-4.020355E-5	T	29498	2017.09.19 16:33:34.495292221	0000678	
80	0.000308	-0.000202	-0.000226	-5.543025E-5	T	29482	2017.09.19 16:33:34.505335971	0000678	
80	0.000304	-0.000197	-0.000221	-6.949115E-5	T	29482	2017.09.19 16:33:34.515335971	0000678	
80	0.000333	-0.000249	-0.000211	-6.410510E-5	T	29482	2017.09.19 16:33:34.525335971	0000678	
80	0.000321	-0.000221	-0.000231	-3.625552E-5	T	29482	2017.09.19 16:33:34.535335971	0000678	
80	0.000315	-0.000225	-0.000220	-1.726522E-5	T	29482	2017.09.19 16:33:34.545335971	0000678	
80	0.000319	-0.000211	-0.000231	-6.033598E-5	T	29482	2017.09.19 16:33:34.555335971	0000678	
80	0.000325	-0.000216	-0.000226	-8.831482E-5	T	29482	2017.09.19 16:33:34.565335971	0000678	
80	0.000337	-0.000254	-0.000215	-5.504814E-5	T	29482	2017.09.19 16:33:34.575335971	0000678	
80	0.000311	-0.000225	-0.000207	-6.032153E-5	T	29482	2017.09.19 16:33:34.585335971	0000678	
80	0.000324	-0.000230	-0.000225	-3.620295E-5	T	29482	2017.09.19 16:33:34.595335971	0000678	
81	0.000349	-0.000268	-0.000215	-5.993389E-5	T	29484	2017.09.19 16:33:34.605379721	0000678	
81	0.000320	-0.000235	-0.000207	-6.923969E-5	T	29484	2017.09.19 16:33:34.615379721	0000678	
81	0.000328	-0.000235	-0.000220	-6.018196E-5	T	29484	2017.09.19 16:33:34.625379721	0000678	
81	0.000323	-0.000225	-0.000226	-5.524289E-5	T	29484	2017.09.19 16:33:34.635379721	0000678	
81	0.000310	-0.000221	-0.000212	-5.033378E-5	T	29484	2017.09.19 16:33:34.645379721	0000678	
81	0.000349	-0.000254	-0.000234	-4.496971E-5	T	29484	2017.09.19 16:33:34.655379721	0000678	
81	0.000326	-0.000240	-0.000215	-4.516261E-5	T	29484	2017.09.19 16:33:34.665379721	0000678	
81	0.000319	-0.000235	-0.000211	-4.022015E-5	T	29484	2017.09.19 16:33:34.675379721	0000678	
81	0.000338	-0.000230	-0.000240	-6.014384E-5	T	29484	2017.09.19 16:33:34.685379721	0000678	
81	0.000335	-0.000235	-0.000226	-7.916042E-5	T	29484	2017.09.19 16:33:34.695379721	0000678	
82	0.000335	-0.000244	-0.000220	-6.410848E-5	T	29500	2017.09.19 16:33:34.705423471	0000678	
82	0.000310	-0.000202	-0.000221	-7.945000E-5	T	29500	2017.09.19 16:33:34.715423471	0000678	
82	0.000325	-0.000230	-0.000216	-7.924265E-5	T	29500	2017.09.19 16:33:34.725423471	0000678	
82	0.000318	-0.000225	-0.000221	-4.026426E-5	T	29500	2017.09.19 16:33:34.735423471	0000678	
82	0.000311	-0.000225	-0.000207	-6.032153E-5	T	29500	2017.09.19 16:33:34.745423471	0000678	
82	0.000345	-0.000263	-0.000215	-5.997462E-5	T	29500	2017.09.19 16:33:34.755423471	0000678	
82	0.000324	-0.000225	-0.000221	-7.426284E-5	T	29500	2017.09.19 16:33:34.765423471	0000678	
82	0.000328	-0.000230	-0.000230	-4.018203E-5	T	29500	2017.09.19 16:33:34.775423471	0000678	
82	0.000307	-0.000216	-0.000212	-5.037451E-5	T	29500	2017.09.19 16:33:34.785423471	0000678	
82	0.000308	-0.000240	-0.000187	-4.527881E-5	T	29500	2017.09.19 16:33:34.795423471	0000678	
83	0.000312	-0.000202	-0.000226	-7.442946E-5	T	29500	2017.09.19 16:33:34.805467221	0000678	
83	0.000322	-0.000221	-0.000221	-7.929522E-5	T	29500	2017.09.19 16:33:34.815467221	0000678	
83	0.000310	-0.000225	-0.000211	-3.130199E-5	T	29500	2017.09.19 16:33:34.825467221	0000678	
83	0.000314	-0.000221	-0.000216	-5.531697E-5	T	29500	2017.09.19 16:33:34.835467221	0000678	
83	0.000339	-0.000268	-0.000206	-3.097245E-5	T	29500	2017.09.19 16:33:34.845467221	0000678	
83	0.000298	-0.000197	-0.000207	-8.354866E-5	T	29500	2017.09.19 16:33:34.855467221	0000678	
83	0.000314	-0.000202	-0.000231	-6.440912E-5	T	29500	2017.09.19 16:33:34.865467221	0000678	
83	0.000339	-0.000254	-0.000206	-8.808411E-5	T	29500	2017.09.19 16:33:34.875467221	0000678	
83	0.000327	-0.000221	-0.000235	-5.523812E-5	T	29500	2017.09.19 16:33:34.885467221	0000678	
83	0.000324	-0.000240	-0.000211	-5.017900E-5	T	29500	2017.09.19 16:33:34.895467221	0000678	
84	0.000337	-0.000259	-0.000206	-6.404439E-5	T	29486	2017.09.19 16:33:34.905510971	0000678	
84	0.000323	-0.000235	-0.000211	-6.421915E-5	T	29486	2017.09.19 16:33:34.915510971	0000678	
84	0.000285	-0.000183	-0.000216	-3.162753E-5	T	29486	2017.09.19 16:33:34.925510971	0000678	
84	0.000348	-0.000259	-0.000230	-3.594596E-5	T	29486	2017.09.19 16:33:34.935510971	0000678	
84	0.000325	-0.000235	-0.000220	-4.518259E-5	T	29486	2017.09.19 16:33:34.945510971	0000678	
84	0.000338	-0.000230	-0.000235	-7.916380E-5	T	29486	2017.09.19 16:33:34.955510971	0000678	
84	0.000335	-0.000235	-0.000230	-6.014046E-5	T	29486	2017.09.19 16:33:34.965510971	0000678	
84	0.000316	-0.000216	-0.000221	-6.433658E-5	T	29486	2017.09.19 16:33:34.975510971	0000678	
84	0.000329	-0.000235	-0.000220	-6.418180E-5	T	29486	2017.09.19 16:33:34.985510971	0000678	
84	0.000338	-0.000244	-0.000225	-6.008790E-5	T	29486	2017.09.19 16:33:34.995510971	0000678	
85	0.000313	-0.000211	-0.000221	-6.937710E-5	T	29486	2017.09.19 16:33:35.005554721	0000678	
85	0.000338	-0.000236	-0.000216	-0.000112	T	29486	2017.09.19 16:33:35.015554721	0000678	
85	0.000302	-0.000211	-0.000216	-2.139986E-5	T	29486	2017.09.19 16:33:35.025554721	0000678	
85	0.000323	-0.000235	-0.000220	-2.118359E-5	T	29486	2017.09.19 16:33:35.035554721	0000678	
85	0.000306	-0.000211	-0.000221	-2.637890E-5	T	29486	2017.09.19 16:33:35.045554721	0000678	
85	0.000322	-0.000235	-0.000207	-7.423948E-5	T	29486	2017.09.19 16:33:35.055554721	0000678	
85	0.000338	-0.000240	-0.000230	-6.009973E-5	T	29486	2017.09.19 16:33:35.065554721	0000678	
85	0.000319	-0.000211	-0.000235	-4.532000E-5	T	29486	2017.09.19 16:33:35.075554721	0000678	
85	0.000337	-0.000235	-0.000234	-5.512407E-5	T	29486	2017.09.19 16:33:35.085554721	0000678	
85	0.000305	-0.000211	-0.000207	-7.443499E-5	T	29486	2017.09.19 16:33:35.095554721	0000678	
86	0.000316	-0.000211	-0.000221	-7.937668E-5	T	29489	2017.09.19 16:33:35.105598471	0000678	
86	0.000298	-0.000211	-0.000202	-6.045633E-5	T	29489	2017.09.19 16:33:35.115598471	0000678	
86	0.000336	-0.000235	-0.000226	-8.316025E-5	T	29489	2017.09.19 16:33:35.125598471	0000678	
86	0.000297	-0.000202	-0.000202	-7.952885E-5	T	29489	2017.09.19 16:33:35.135598471	0000678	
86	0.000311	-0.000216	-0.000216	-6.035749E-5	T	29489	2017.09.19 16:33:35.145598471	0000678	
86	0.000335	-0.000240	-0.000225	-6.012048E-5	T	29489	2017.09.19 16:33:35.155598471	0000678	
86	0.000326	-0.000230	-0.000221	-6.922232E-5	T	29489	2017.09.19 16:33:35.165598471	0000678	
86	0.000318	-0.000249	-0.000192	-5.018453E-5	T	29489	2017.09.19 16:33:35.175598471	0000678	
86	0.000295	-0.000192	-0.000221	-3.653326E-5	T	29489	2017.09.19 16:33:35.185598471	0000678	
86	0.000335	-0.000263	-0.000206	-3.101318E-5	T	29489	2017.09.19 16:33:35.195598471	0000678	
87	0.000328	-0.000249	-0.000201	-6.914639E-5	T	29492	2017.09.19 16:33:35.205642221	0000678	
87	0.000314	-0.000221	-0.000212	-6.933299E-5	T	29492	2017.09.19 16:33:35.215642221	0000678	
87	0.000317	-0.000216	-0.000226	-5.531620E-5	T	29492	2017.09.19 16:33:35.225642221	0000678	
87	0.000317	-0.000235	-0.000202	-6.926044E-5	T	29492	2017.09.19 16:33:35.235642221	0000678	
87	0.000340	-0.000254	-0.000220	-5.002760E-5	T	29492	2017.09.19 16:33:35.245642221	0000678	
87	0.000323	-0.000240	-0.000206	-6.419917E-5	T	29492	2017.09.19 16:33:35.255642221	0000678	
87	0.000312	-0.000221	-0.000216	-4.531739E-5	T	29492	2017.09.19 16:33:35.265642221	0000678	
87	0.000311	-0.000216	-0.000216	-6.035749E-5	T	29492	2017.09.19 16:33:35.275642221	0000678	
87	0.000314	-0.000235	-0.000201	-5.526102E-5	T	29492	2017.09.19 16:33:35.285642221	0000678	
87	0.000330	-0.000230	-0.000234	-3.616560E-5	T	29492	2017.09.19 16:33:35.295642221	0000678	
88	0.000324	-0.000221	-0.000226	-6.927489E-5	T	29490	2017.09.19 16:33:35.305685971	0000678	
88	0.000321	-0.000230	-0.000216	-6.024345E-5	T	29490	2017.09.19 16:33:35.315685971	0000678	
88	0.000299	-0.000202	-0.000207	-7.450831E-5	T	29490	2017.09.19 16:33:35.325685971	0000678	
88	0.000340	-0.000249	-0.000215	-8.308770E-5	T	29490	2017.09.19 16:33:35.335685971	0000678	
88	0.000325	-0.000230	-0.000216	-7.924265E-5	T	29490	2017.09.19 16:33:35.345685971	0000678	
88	0.000330	-0.000235	-0.000225	-5.516142E-5	T	29490	2017.09.19 16:33:35.355685971	0000678	
88	0.000308	-0.000221	-0.000207	-5.535432E-5	T	29490	2017.09.19 16:33:35.365685971	0000678	
88	0.000309	-0.000216	-0.000216	-5.035791E-5	T	29490	2017.09.19 16:33:35.375685971	0000678	
88	0.000343	-0.000249	-0.000220	-8.306695E-5	T	29490	2017.09.19 16:33:35.385685971	0000678	
88	0.000330	-0.000244	-0.000220	-3.110986E-5	T	29490	2017.09.19 16:33:35.395685971	0000678	
89	0.000327	-0.000225	-0.000231	-5.522214E-5	T	29479	2017.09.19 16:33:35.405729721	0000678	
89	0.000310	-0.000230	-0.000206	-3.128201E-5	T	29479	2017.09.19 16:33:35.415729721	0000678	
89	0.000314	-0.000221	-0.000216	-5.531697E-5	T	29479	2017.09.19 16:33:35.425729721	0000678	
89	0.000337	-0.000240	-0.000230	-5.509994E-5	T	29479	2017.09.19 16:33:35.435729721	0000678	
89	0.000328	-0.000249	-0.000211	-3.110648E-5	T	29479	2017.09.19 16:33:35.445729721	0000678	
89	0.000328	-0.000240	-0.000215	-6.016198E-5	T	29479	2017.09.19 16:33:35.455729721	0000678	
89	0.000312	-0.000216	-0.000216	-6.435733E-5	T	29479	2017.09.19 16:33:35.465729721	0000678	
89	0.000326	-0.000240	-0.000220	-1.714303E-5	T	29479	2017.09.19 16:33:35.475729721	0000678	
89	0.000331	-0.000235	-0.000225	-6.016121E-5	T	29479	2017.09.19 16:33:35.485729721	0000678	
89	0.000344	-0.000249	-0.000230	-5.502662E-5	T	29479	2017.09.19 16:33:35.495729721	0000678	
90	0.000325	-0.000230	-0.000221	-6.422253E-5	T	29498	2017.09.19 16:33:35.505773471	0000678	
90	0.000347	-0.000254	-0.000230	-4.998610E-5	T	29498	2017.09.19 16:33:35.515773471	0000678	
90	0.000344	-0.000254	-0.000225	-5.500664E-5	T	29498	2017.09.19 16:33:35.525773471	0000678	
90	0.000330	-0.000240	-0.000211	-7.917779E-5	T	29498	2017.09.19 16:33:35.535773471	0000678	
90	0.000304	-0.000211	-0.000216	-4.039906E-5	T	29498	2017.09.19 16:33:35.545773471	0000678	
90	0.000318	-0.000225	-0.000221	-4.526405E-5	T	29498	2017.09.19 16:33:35.555773471	0000678	
90	0.000321	-0.000221	-0.000226	-5.527547E-5	T	29498	2017.09.19 16:33:35.565773471	0000678	
90	0.000322	-0.000230	-0.000216	-6.424328E-5	T	29498	2017.09.19 16:33:35.575773471	0000678	
90	0.000322	-0.000211	-0.000240	-4.029946E-5	T	29498	2017.09.19 16:33:35.585773471	0000678	
90	0.000327	-0.000235	-0.000220	-5.518217E-5	T	29498	2017.09.19 16:33:35.595773471	0000678	
91	0.000320	-0.000221	-0.000226	-5.027568E-5	T	29496	2017.09.19 16:33:35.605817221	0000678	
91	0.000333	-0.000240	-0.000220	-6.914086E-5	T	29496	2017.09.19 16:33:35.615817221	0000678	
91	0.000332	-0.000249	-0.000215	-4.508929E-5	T	29496	2017.09.19 16:33:35.625817221	0000678	
91	0.000309	-0.000221	-0.000207	-6.435395E-5	T	29496	2017.09.19 16:33:35.635817221	0000678	
91	0.000314	-0.000221	-0.000221	-3.629702E-5	T	29496	2017.09.19 16:33:35.645817221	0000678	
91	0.000307	-0.000206	-0.000212	-8.345460E-5	T	29496	2017.09.19 16:33:35.655817221	0000678	
91	0.000314	-0.000225	-0.000212	-5.530099E-5	T	29496	2017.09.19 16:33:35.665817221	0000678	
91	0.000304	-0.000211	-0.000216	-4.039906E-5	T	29496	2017.09.19 16:33:35.675817221	0000678	
91	0.000313	-0.000216	-0.000221	-5.033716E-5	T	29496	2017.09.19 16:33:35.685817221	0000678	
91	0.000321	-0.000235	-0.000215	-3.620372E-5	T	29496	2017.09.19 16:33:35.695817221	0000678	
92	0.000305	-0.000211	-0.000212	-6.041483E-5	T	29495	2017.09.19 16:33:35.705860971	0000678	
92	0.000314	-0.000235	-0.000201	-5.526102E-5	T	29495	2017.09.19 16:33:35.715860971	0000678	
92	0.000355	-0.000278	-0.000215	-4.985284E-5	T	29495	2017.09.19 16:33:35.725860971	0000678	
92	0.000330	-0.000240	-0.000211	-7.917779E-5	T	29495	2017.09.19 16:33:35.735860971	0000678	
92	0.000330	-0.000244	-0.000220	-3.110986E-5	T	29495	2017.09.19 16:33:35.745860971	0000678	
92	0.000336	-0.000259	-0.000211	-4.002464E-5	T	29495	2017.09.19 16:33:35.755860971	0000678	
92	0.000316	-0.000206	-0.000231	-6.437654E-5	T	29495	2017.09.19 16:33:35.765860971	0000678	
92	0.000328	-0.000240	-0.000220	-3.614224E-5	T	29495	2017.09.19 16:33:35.775860971	0000678	
92	0.000337	-0.000244	-0.000225	-5.508811E-5	T	29495	2017.09.19 16:33:35.785860971	0000678	
92	0.000304	-0.000202	-0.000221	-5.045121E-5	T	29495	2017.09.19 16:33:35.795860971	0000678	
93	0.000322	-0.000225	-0.000221	-6.426326E-5	T	29505	2017.09.19 16:33:35.805904721	0000678	
93	0.000320	-0.000230	-0.000216	-5.524365E-5	T	29505	2017.09.19 16:33:35.815904721	0000678	
93	0.000316	-0.000230	-0.000207	-6.428063E-5	T	29505	2017.09.19 16:33:35.825904721	0000678	
93	0.000306	-0.000197	-0.000216	-8.851110E-5	T	29505	2017.09.19 16:33:35.835904721	0000678	
93	0.000323	-0.000225	-0.000226	-5.024309E-5	T	29505	2017.09.19 16:33:35.845904721	0000678	
93	0.000322	-0.000211	-0.000240	-4.029946E-5	T	29505	2017.09.19 16:33:35.855904721	0000678	
93	0.000346	-0.000244	-0.000239	-5.003021E-5	T	29505	2017.09.19 16:33:35.865904721	0000678	
93	0.000336	-0.000235	-0.000226	-8.316025E-5	T	29505	2017.09.19 16:33:35.875904721	0000678	
93	0.000304	-0.000206	-0.000216	-6.043896E-5	T	29505	2017.09.19 16:33:35.885904721	0000678	
93	0.000319	-0.000221	-0.000216	-7.931597E-5	T	29505	2017.09.19 16:33:35.895904721	0000678	
94	0.000290	-0.000206	-0.000202	-3.149827E-5	T	29478	2017.09.19 16:33:35.905948471	0000678	
94	0.000323	-0.000235	-0.000215	-5.020313E-5	T	29478	2017.09.19 16:33:35.915948471	0000678	
94	0.000297	-0.000206	-0.000212	-3.145677E-5	T	29478	2017.09.19 16:33:35.925948471	0000678	
94	0.000341	-0.000244	-0.000225	-7.408731E-5	T	29478	2017.09.19 16:33:35.935948471	0000678	
94	0.000299	-0.000197	-0.000221	-4.049236E-5	T	29478	2017.09.19 16:33:35.945948471	0000678	
94	0.000329	-0.000225	-0.000221	-9.326205E-5	T	29478	2017.09.19 16:33:35.955948471	0000678	
94	0.000317	-0.000225	-0.000212	-6.930040E-5	T	29478	2017.09.19 16:33:35.965948471	0000678	
94	0.000342	-0.000249	-0.000220	-7.906712E-5	T	29478	2017.09.19 16:33:35.975948471	0000678	
94	0.000317	-0.000211	-0.000231	-5.033639E-5	T	29478	2017.09.19 16:33:35.985948471	0000678	
94	0.000336	-0.000235	-0.000239	-1.710491E-5	T	29478	2017.09.19 16:33:35.995948471	0000678	
95	0.000302	-0.000202	-0.000221	-4.045163E-5	T	29482	2017.09.19 16:33:36.005992221	0000678	
95	0.000333	-0.000254	-0.000211	-4.506516E-5	T	29482	2017.09.19 16:33:36.015992221	0000678	
95	0.000317	-0.000216	-0.000216	-8.335653E-5	T	29482	2017.09.19 16:33:36.025992221	0000678	
95	0.000330	-0.000235	-0.000225	-5.016163E-5	T	29482	2017.09.19 16:33:36.035992221	0000678	
95	0.000310	-0.000216	-0.000221	-3.133796E-5	T	29482	2017.09.19 16:33:36.045992221	0000678	
95	0.000316	-0.000235	-0.000206	-4.524069E-5	T	29482	2017.09.19 16:33:36.055992221	0000678	
95	0.000321	-0.000225	-0.000221	-6.026343E-5	T	29482	2017.09.19 16:33:36.065992221	0000678	
95	0.000321	-0.000203	-0.000231	-9.340791E-5	T	29482	2017.09.19 16:33:36.075992221	0000678	
95	0.000335	-0.000240	-0.000225	-6.012048E-5	T	29482	2017.09.19 16:33:36.085992221	0000678	
95	0.000322	-0.000230	-0.000220	-4.522332E-5	T	29482	2017.09.19 16:33:36.095992221	0000678	
96	0.000329	-0.000225	-0.000235	-5.020574E-5	T	29483	2017.09.19 16:33:36.106035971	0000678	
96	0.000330	-0.000230	-0.000231	-5.518140E-5	T	29483	2017.09.19 16:33:36.116035971	0000678	
96	0.000318	-0.000230	-0.000212	-6.026005E-5	T	29483	2017.09.19 16:33:36.126035971	0000678	
96	0.000329	-0.000235	-0.000225	-4.516184E-5	T	29483	2017.09.19 16:33:36.136035971	0000678	
96	0.000320	-0.000249	-0.000201	-1.714856E-5	T	29483	2017.09.19 16:33:36.146035971	0000678	
96	0.000305	-0.000211	-0.000212	-6.041483E-5	T	29483	2017.09.19 16:33:36.156035971	0000678	
96	0.000329	-0.000230	-0.000226	-6.420178E-5	T	29483	2017.09.19 16:33:36.166035971	0000678	
96	0.000330	-0.000244	-0.000220	-2.611007E-5	T	29483	2017.09.19 16:33:36.176035971	0000678	
96	0.000297	-0.000202	-0.000207	-6.950852E-5	T	29483	2017.09.19 16:33:36.186035971	0000678	
96	0.000312	-0.000225	-0.000215	-2.128581E-5	T	29483	2017.09.19 16:33:36.196035971	0000678	
97	0.000323	-0.000216	-0.000235	-5.027906E-5	T	29498	2017.09.19 16:33:36.206079721	0000678	
97	0.000346	-0.000254	-0.000230	-4.498631E-5	T	29498	2017.09.19 16:33:36.216079721	0000678	
97	0.000304	-0.000211	-0.000202	-8.345537E-5	T	29498	2017.09.19 16:33:36.226079721	0000678	
97	0.000314	-0.000216	-0.000226	-3.131721E-5	T	29498	2017.09.19 16:33:36.236079721	0000678	
97	0.000335	-0.000230	-0.000231	-7.918040E-5	T	29498	2017.09.19 16:33:36.246079721	0000678	
97	0.000303	-0.000225	-0.000201	-3.134349E-5	T	29498	2017.09.19 16:33:36.256079721	0000678	
97	0.000337	-0.000254	-0.000215	-5.004835E-5	T	29498	2017.09.19 16:33:36.266079721	0000678	
97	0.000319	-0.000230	-0.000212	-6.425988E-5	T	29498	2017.09.19 16:33:36.276079721	0000678	
97	0.000351	-0.000254	-0.000230	-7.398510E-5	T	29498	2017.09.19 16:33:36.286079721	0000678	
97	0.000312	-0.000202	-0.000226	-7.442946E-5	T	29498	2017.09.19 16:33:36.296079721	0000678	
98	0.000314	-0.000221	-0.000216	-5.531697E-5	T	29484	2017.09.19 16:33:36.306123471	0000678	
98	0.000341	-0.000249	-0.000215	-8.808750E-5	T	29484	2017.09.19 16:33:36.316123471	0000678	
98	0.000328	-0.000240	-0.000215	-6.016198E-5	T	29484	2017.09.19 16:33:36.326123471	0000678	
98	0.000305	-0.000221	-0.000207	-4.035495E-5	T	29484	2017.09.19 16:33:36.336123471	0000678	
98	0.000335	-0.000244	-0.000225	-4.508852E-5	T	29484	2017.09.19 16:33:36.346123471	0000678	
98	0.000318	-0.000221	-0.000221	-6.029601E-5	T	29484	2017.09.19 16:33:36.356123471	0000678	
98	0.000319	-0.000216	-0.000231	-4.029608E-5	T	29484	2017.09.19 16:33:36.366123471	0000678	
98	0.000339	-0.000244	-0.000225	-6.908752E-5	T	29484	2017.09.19 16:33:36.376123471	0000678	
98	0.000333	-0.000249	-0.000215	-5.008908E-5	T	29484	2017.09.19 16:33:36.386123471	0000678	
98	0.000345	-0.000254	-0.000230	-3.998652E-5	T	29484	2017.09.19 16:33:36.396123471	0000678	
99	0.000324	-0.000235	-0.000215	-5.520292E-5	T	29493	2017.09.19 16:33:36.406167221	0000678	
99	0.000342	-0.000249	-0.000225	-6.404700E-5	T	29493	2017.09.19 16:33:36.416167221	0000678	
99	0.000339	-0.000235	-0.000239	-4.510374E-5	T	29493	2017.09.19 16:33:36.426167221	0000678	
99	0.000294	-0.000211	-0.000202	-4.045716E-5	T	29493	2017.09.19 16:33:36.436167221	0000678	
99	0.000327	-0.000235	-0.000220	-5.518217E-5	T	29493	2017.09.19 16:33:36.446167221	0000678	
99	0.000293	-0.000202	-0.000202	-6.452948E-5	T	29493	2017.09.19 16:33:36.456167221	0000678	
99	0.000346	-0.000249	-0.000225	-8.304620E-5	T	29493	2017.09.19 16:33:36.466167221	0000678	
99	0.000321	-0.000240	-0.000206	-5.519954E-5	T	29493	2017.09.19 16:33:36.476167221	0000678	
99	0.000330	-0.000240	-0.000225	-2.112211E-5	T	29493	2017.09.19 16:33:36.486167221	0000678	
99	0.000325	-0.000244	-0.000211	-3.614700E-5	T	29493	2017.09.19 16:33:36.496167221	0000678	
100	0.000309	-0.000216	-0.000212	-6.437393E-5	T	29478	2017.09.19 16:33:36.506210971	0000678	
100	0.000301	-0.000206	-0.000216	-4.043979E-5	T	29478	2017.09.19 16:33:36.516210971	0000678	
100	0.000333	-0.000240	-0.000225	-5.012090E-5	T	29478	2017.09.19 16:33:36.526210971	0000678	
100	0.000322	-0.000225	-0.000221	-6.426326E-5	T	29478	2017.09.19 16:33:36.536210971	0000678	
100	0.000295	-0.000178	-0.000226	-6.462539E-5	T	29478	2017.09.19 16:33:36.546210971	0000678	
100	0.000279	-0.000183	-0.000202	-6.068442E-5	T	29478	2017.09.19 16:33:36.556210971	0000678	
100	0.000349	-0.000244	-0.000234	-8.304959E-5	T	29478	2017.09.19 16:33:36.566210971	0000678	
100	0.000301	-0.000202	-0.000216	-5.547175E-5	T	29478	2017.09.19 16:33:36.576210971	0000678	
100	0.000336	-0.000249	-0.000225	-1.704896E-5	T	29478	2017.09.19 16:33:36.586210971	0000678	
100	0.000289	-0.000202	-0.000198	-6.054624E-5	T	29478	2017.09.19 16:33:36.596210971	0000678	
101	0.000334	-0.000230	-0.000235	-6.016460E-5	T	29497	2017.09.19 16:33:36.606254721	0000678	
101	0.000332	-0.000235	-0.000225	-6.416105E-5	T	29497	2017.09.19 16:33:36.616254721	0000678	
101	0.000328	-0.000244	-0.000211	-6.014600E-5	T	29497	2017.09.19 16:33:36.626254721	0000678	
101	0.000303	-0.000206	-0.000221	-3.141942E-5	T	29497	2017.09.19 16:33:36.636254721	0000678	
101	0.000307	-0.000211	-0.000212	-6.941445E-5	T	29497	2017.09.19 16:33:36.646254721	0000678	
101	0.000318	-0.000225	-0.000212	-7.430019E-5	T	29497	2017.09.19 16:33:36.656254721	0000678	
101	0.000317	-0.000230	-0.000215	-3.124466E-5	T	29497	2017.09.19 16:33:36.666254721	0000678	
101	0.000313	-0.000225	-0.000212	-5.030120E-5	T	29497	2017.09.19 16:33:36.676254721	0000678	
101	0.000309	-0.000216	-0.000207	-7.939405E-5	T	29497	2017.09.19 16:33:36.686254721	0000678	
101	0.000305	-0.000206	-0.000221	-4.041904E-5	T	29497	2017.09.19 16:33:36.696254721	0000678	
102	0.000326	-0.000244	-0.000211	-4.514662E-5	T	29494	2017.09.19 16:33:36.706298471	0000678	
102	0.000304	-0.000211	-0.000216	-3.639923E-5	T	29494	2017.09.19 16:33:36.716298471	0000678	
102	0.000310	-0.000211	-0.000221	-5.537768E-5	T	29494	2017.09.19 16:33:36.726298471	0000678	
102	0.000311	-0.000211	-0.000221	-6.037748E-5	T	29494	2017.09.19 16:33:36.736298471	0000678	
102	0.000326	-0.000240	-0.000215	-5.016240E-5	T	29494	2017.09.19 16:33:36.746298471	0000678	
102	0.000324	-0.000216	-0.000231	-6.929487E-5	T	29494	2017.09.19 16:33:36.756298471	0000678	
102	0.000340	-0.000249	-0.000215	-8.308770E-5	T	29494	2017.09.19 16:33:36.766298471	0000678	
102	0.000306	-0.000211	-0.000212	-6.441466E-5	T	29494	2017.09.19 16:33:36.776298471	0000678	
102	0.000309	-0.000211	-0.000216	-6.439806E-5	T	29494	2017.09.19 16:33:36.786298471	0000678	
102	0.000323	-0.000230	-0.000221	-5.522290E-5	T	29494	2017.09.19 16:33:36.796298471	0000678	
103	0.000316	-0.000211	-0.000221	-7.937668E-5	T	29490	2017.09.19 16:33:36.806342221	0000678	
103	0.000328	-0.000240	-0.000220	-4.014207E-5	T	29490	2017.09.19 16:33:36.816342221	0000678	
103	0.000318	-0.000221	-0.000216	-7.431618E-5	T	29490	2017.09.19 16:33:36.826342221	0000678	
103	0.000305	-0.000206	-0.000221	-4.041904E-5	T	29490	2017.09.19 16:33:36.836342221	0000678	
103	0.000325	-0.000230	-0.000225	-4.020278E-5	T	29490	2017.09.19 16:33:36.846342221	0000678	
103	0.000321	-0.000221	-0.000231	-3.625552E-5	T	29490	2017.09.19 16:33:36.856342221	0000678	
103	0.000323	-0.000225	-0.000221	-6.926305E-5	T	29490	2017.09.19 16:33:36.866342221	0000678	
103	0.000318	-0.000216	-0.000231	-3.129646E-5	T	29490	2017.09.19 16:33:36.876342221	0000678	
103	0.000343	-0.000230	-0.000249	-5.510670E-5	T	29490	2017.09.19 16:33:36.886342221	0000678	
103	0.000326	-0.000221	-0.000221	-9.329463E-5	T	29490	2017.09.19 16:33:36.896342221	0000678	
104	0.000307	-0.000202	-0.000226	-5.043046E-5	T	29468	2017.09.19 16:33:36.906385971	0000678	
104	0.000324	-0.000235	-0.000215	-5.520292E-5	T	29468	2017.09.19 16:33:36.916385971	0000678	
104	0.000342	-0.000254	-0.000225	-4.500706E-5	T	29468	2017.09.19 16:33:36.926385971	0000678	
104	0.000308	-0.000216	-0.000216	-4.035833E-5	T	29468	2017.09.19 16:33:36.936385971	0000678	
104	0.000298	-0.000202	-0.000216	-3.647255E-5	T	29468	2017.09.19 16:33:36.946385971	0000678	
104	0.000286	-0.000188	-0.000212	-4.060303E-5	T	29468	2017.09.19 16:33:36.956385971	0000678	
104	0.000316	-0.000225	-0.000220	-2.626485E-5	T	29468	2017.09.19 16:33:36.966385971	0000678	
104	0.000305	-0.000197	-0.000231	-3.145124E-5	T	29468	2017.09.19 16:33:36.976385971	0000678	
104	0.000321	-0.000216	-0.000235	-3.627965E-5	T	29468	2017.09.19 16:33:36.986385971	0000678	
104	0.000328	-0.000221	-0.000231	-7.425393E-5	T	29468	2017.09.19 16:33:36.996385971	0000678	
105	0.000321	-0.000230	-0.000220	-4.022353E-5	T	29491	2017.09.19 16:33:37.006429721	0000678	
105	0.000314	-0.000216	-0.000216	-7.435691E-5	T	29491	2017.09.19 16:33:37.016429721	0000678	
105	0.000328	-0.000235	-0.000212	-8.821814E-5	T	29491	2017.09.19 16:33:37.026429721	0000678	
105	0.000303	-0.000221	-0.000207	-2.635553E-5	T	29491	2017.09.19 16:33:37.036429721	0000678	
105	0.000302	-0.000206	-0.000212	-6.045556E-5	T	29491	2017.09.19 16:33:37.046429721	0000678	
105	0.000306	-0.000202	-0.000226	-4.543067E-5	T	29491	2017.09.19 16:33:37.056429721	0000678	
105	0.000322	-0.000216	-0.000231	-6.029524E-5	T	29491	2017.09.19 16:33:37.066429721	0000678	
105	0.000316	-0.000235	-0.000211	-1.722111E-5	T	29491	2017.09.19 16:33:37.076429721	0000678	
105	0.000325	-0.000235	-0.000215	-6.420255E-5	T	29491	2017.09.19 16:33:37.086429721	0000678	
105	0.000330	-0.000235	-0.000225	-5.516142E-5	T	29491	2017.09.19 16:33:37.096429721	0000678	
106	0.000338	-0.000235	-0.000226	-8.816004E-5	T	29496	2017.09.19 16:33:37.106473471	0000678	
106	0.000303	-0.000206	-0.000221	-3.141942E-5	T	29496	2017.09.19 16:33:37.116473471	0000678	
106	0.000294	-0.000192	-0.000212	-6.956923E-5	T	29496	2017.09.19 16:33:37.126473471	0000678	
106	0.000325	-0.000235	-0.000220	-4.518259E-5	T	29496	2017.09.19 16:33:37.136473471	0000678	
106	0.000320	-0.000221	-0.000221	-6.929564E-5	T	29496	2017.09.19 16:33:37.146473471	0000678	
106	0.000303	-0.000178	-0.000231	-7.960401E-5	T	29496	2017.09.19 16:33:37.156473471	0000678	
106	0.000334	-0.000240	-0.000220	-7.414065E-5	T	29496	2017.09.19 16:33:37.166473471	0000678	
106	0.000323	-0.000216	-0.000235	-5.027906E-5	T	29496	2017.09.19 16:33:37.176473471	0000678	
106	0.000313	-0.000216	-0.000226	-2.631741E-5	T	29496	2017.09.19 16:33:37.186473471	0000678	
106	0.000290	-0.000188	-0.000216	-4.558622E-5	T	29496	2017.09.19 16:33:37.196473471	0000678	
