Block	B	Bx	By	Bz	Units	Temperature	Timestamp	Serial No.	Comment
0	0.000292	0.000181	0.000214	-8.435117E-5	T	29487	2017.09.19 16:20:29.862204721	0000678	
0	0.000256	0.000172	0.000186	-3.616366E-5	T	29487	2017.09.19 16:20:29.872204721	0000678	
0	0.000279	0.000158	0.000224	-5.020673E-5	T	29487	2017.09.19 16:20:29.882204721	0000678	
0	0.000277	0.000172	0.000214	-3.627986E-5	T	29487	2017.09.19 16:20:29.892204721	0000678	
0	0.000311	0.000200	0.000228	-6.556900E-5	T	29487	2017.09.19 16:20:29.902204721	0000678	
0	0.000306	0.000219	0.000204	-6.562417E-5	T	29487	2017.09.19 16:20:29.912204721	0000678	
0	0.000294	0.000196	0.000209	-6.545756E-5	T	29487	2017.09.19 16:20:29.922204721	0000678	
0	0.000310	0.000210	0.000213	-7.958762E-5	T	29487	2017.09.19 16:20:29.932204721	0000678	
0	0.000285	0.000200	0.000199	-3.644986E-5	T	29487	2017.09.19 16:20:29.942204721	0000678	
0	0.000296	0.000191	0.000213	-7.443305E-5	T	29487	2017.09.19 16:20:29.952204721	0000678	
1	0.000308	0.000191	0.000228	-7.949509E-5	T	29496	2017.09.19 16:20:29.962248471	0000678	
1	0.000275	0.000163	0.000214	-5.520575E-5	T	29496	2017.09.19 16:20:29.972248471	0000678	
1	0.000301	0.000186	0.000229	-6.045516E-5	T	29496	2017.09.19 16:20:29.982248471	0000678	
1	0.000292	0.000186	0.000219	-5.541386E-5	T	29496	2017.09.19 16:20:29.992248471	0000678	
1	0.000305	0.000215	0.000209	-5.561276E-5	T	29496	2017.09.19 16:20:30.002248471	0000678	
1	0.000300	0.000210	0.000209	-4.157261E-5	T	29496	2017.09.19 16:20:30.012248471	0000678	
1	0.000312	0.000205	0.000223	-7.458860E-5	T	29496	2017.09.19 16:20:30.022248471	0000678	
1	0.000308	0.000215	0.000209	-6.961217E-5	T	29496	2017.09.19 16:20:30.032248471	0000678	
1	0.000266	0.000144	0.000214	-6.505055E-5	T	29496	2017.09.19 16:20:30.042248471	0000678	
1	0.000292	0.000205	0.000204	-3.651134E-5	T	29496	2017.09.19 16:20:30.052248471	0000678	
2	0.000320	0.000229	0.000209	-7.972580E-5	T	29484	2017.09.19 16:20:30.062292221	0000678	
2	0.000281	0.000191	0.000205	-2.639771E-5	T	29484	2017.09.19 16:20:30.072292221	0000678	
2	0.000273	0.000158	0.000214	-6.016481E-5	T	29484	2017.09.19 16:20:30.082292221	0000678	
2	0.000284	0.000191	0.000205	-4.539691E-5	T	29484	2017.09.19 16:20:30.092292221	0000678	
2	0.000307	0.000200	0.000213	-9.350557E-5	T	29484	2017.09.19 16:20:30.102292221	0000678	
2	0.000280	0.000181	0.000210	-4.133637E-5	T	29484	2017.09.19 16:20:30.112292221	0000678	
2	0.000297	0.000224	0.000190	-4.560764E-5	T	29484	2017.09.19 16:20:30.122292221	0000678	
2	0.000276	0.000163	0.000214	-6.020554E-5	T	29484	2017.09.19 16:20:30.132292221	0000678	
2	0.000286	0.000191	0.000210	-3.641804E-5	T	29484	2017.09.19 16:20:30.142292221	0000678	
2	0.000274	0.000177	0.000196	-7.424430E-5	T	29484	2017.09.19 16:20:30.152292221	0000678	
3	0.000290	0.000186	0.000210	-7.437572E-5	T	29485	2017.09.19 16:20:30.162335971	0000678	
3	0.000295	0.000205	0.000199	-7.448900E-5	T	29485	2017.09.19 16:20:30.172335971	0000678	
3	0.000271	0.000177	0.000200	-4.526212E-5	T	29485	2017.09.19 16:20:30.182335971	0000678	
3	0.000295	0.000177	0.000224	-7.436050E-5	T	29485	2017.09.19 16:20:30.192335971	0000678	
3	0.000303	0.000205	0.000213	-6.554748E-5	T	29485	2017.09.19 16:20:30.202335971	0000678	
3	0.000284	0.000172	0.000214	-7.427827E-5	T	29485	2017.09.19 16:20:30.212335971	0000678	
3	0.000290	0.000196	0.000204	-6.043702E-5	T	29485	2017.09.19 16:20:30.222335971	0000678	
3	0.000290	0.000200	0.000204	-5.047002E-5	T	29485	2017.09.19 16:20:30.232335971	0000678	
3	0.000318	0.000215	0.000223	-6.967027E-5	T	29485	2017.09.19 16:20:30.242335971	0000678	
3	0.000283	0.000186	0.000205	-6.035556E-5	T	29485	2017.09.19 16:20:30.252335971	0000678	
4	0.000295	0.000200	0.000209	-5.549056E-5	T	29480	2017.09.19 16:20:30.262379721	0000678	
4	0.000286	0.000181	0.000219	-3.637393E-5	T	29480	2017.09.19 16:20:30.272379721	0000678	
4	0.000282	0.000177	0.000210	-6.530278E-5	T	29480	2017.09.19 16:20:30.282379721	0000678	
4	0.000296	0.000186	0.000219	-7.441307E-5	T	29480	2017.09.19 16:20:30.292379721	0000678	
4	0.000295	0.000200	0.000209	-5.549056E-5	T	29480	2017.09.19 16:20:30.302379721	0000678	
4	0.000318	0.000219	0.000218	-7.468190E-5	T	29480	2017.09.19 16:20:30.312379721	0000678	
4	0.000297	0.000205	0.000209	-5.053150E-5	T	29480	2017.09.19 16:20:30.322379721	0000678	
4	0.000301	0.000200	0.000209	-8.448935E-5	T	29480	2017.09.19 16:20:30.332379721	0000678	
4	0.000273	0.000177	0.000200	-6.026149E-5	T	29480	2017.09.19 16:20:30.342379721	0000678	
4	0.000330	0.000210	0.000232	-0.000104	T	29480	2017.09.19 16:20:30.352379721	0000678	
5	0.000288	0.000186	0.000214	-5.039332E-5	T	29481	2017.09.19 16:20:30.362423471	0000678	
5	0.000277	0.000167	0.000214	-5.523833E-5	T	29481	2017.09.19 16:20:30.372423471	0000678	
5	0.000275	0.000172	0.000200	-7.921996E-5	T	29481	2017.09.19 16:20:30.382423471	0000678	
5	0.000263	0.000134	0.000219	-5.499026E-5	T	29481	2017.09.19 16:20:30.392423471	0000678	
5	0.000303	0.000200	0.000218	-6.552750E-5	T	29481	2017.09.19 16:20:30.402423471	0000678	
5	0.000298	0.000196	0.000209	-7.945697E-5	T	29481	2017.09.19 16:20:30.412423471	0000678	
5	0.000300	0.000196	0.000209	-8.845660E-5	T	29481	2017.09.19 16:20:30.422423471	0000678	
5	0.000281	0.000158	0.000219	-7.918477E-5	T	29481	2017.09.19 16:20:30.432423471	0000678	
5	0.000306	0.000191	0.000233	-5.551270E-5	T	29481	2017.09.19 16:20:30.442423471	0000678	
5	0.000286	0.000196	0.000199	-6.041627E-5	T	29481	2017.09.19 16:20:30.452423471	0000678	
6	0.000289	0.000177	0.000219	-6.534013E-5	T	29497	2017.09.19 16:20:30.462467221	0000678	
6	0.000269	0.000172	0.000205	-3.124272E-5	T	29497	2017.09.19 16:20:30.472467221	0000678	
6	0.000283	0.000172	0.000219	-5.030003E-5	T	29497	2017.09.19 16:20:30.482467221	0000678	
6	0.000276	0.000177	0.000205	-5.528245E-5	T	29497	2017.09.19 16:20:30.492467221	0000678	
6	0.000315	0.000215	0.000223	-5.567086E-5	T	29497	2017.09.19 16:20:30.502467221	0000678	
6	0.000297	0.000205	0.000204	-6.551013E-5	T	29497	2017.09.19 16:20:30.512467221	0000678	
6	0.000307	0.000210	0.000213	-6.958804E-5	T	29497	2017.09.19 16:20:30.522467221	0000678	
6	0.000309	0.000191	0.000232	-6.951211E-5	T	29497	2017.09.19 16:20:30.532467221	0000678	
6	0.000305	0.000210	0.000213	-6.058842E-5	T	29497	2017.09.19 16:20:30.542467221	0000678	
6	0.000285	0.000167	0.000214	-8.823696E-5	T	29497	2017.09.19 16:20:30.552467221	0000678	
7	0.000291	0.000200	0.000199	-6.944848E-5	T	29493	2017.09.19 16:20:30.562510971	0000678	
7	0.000301	0.000196	0.000218	-6.549491E-5	T	29493	2017.09.19 16:20:30.572510971	0000678	
7	0.000262	0.000163	0.000196	-6.013084E-5	T	29493	2017.09.19 16:20:30.582510971	0000678	
7	0.000303	0.000200	0.000209	-8.848918E-5	T	29493	2017.09.19 16:20:30.592510971	0000678	
7	0.000294	0.000186	0.000219	-6.541345E-5	T	29493	2017.09.19 16:20:30.602510971	0000678	
7	0.000291	0.000191	0.000199	-9.337416E-5	T	29493	2017.09.19 16:20:30.612510971	0000678	
7	0.000296	0.000191	0.000219	-5.545460E-5	T	29493	2017.09.19 16:20:30.622510971	0000678	
7	0.000305	0.000219	0.000209	-3.664614E-5	T	29493	2017.09.19 16:20:30.632510971	0000678	
7	0.000313	0.000224	0.000209	-6.568566E-5	T	29493	2017.09.19 16:20:30.642510971	0000678	
7	0.000274	0.000177	0.000205	-4.528287E-5	T	29493	2017.09.19 16:20:30.652510971	0000678	
8	0.000278	0.000172	0.000210	-6.026226E-5	T	29483	2017.09.19 16:20:30.662554721	0000678	
8	0.000311	0.000200	0.000228	-6.556900E-5	T	29483	2017.09.19 16:20:30.672554721	0000678	
8	0.000282	0.000181	0.000210	-5.033599E-5	T	29483	2017.09.19 16:20:30.682554721	0000678	
8	0.000293	0.000215	0.000190	-6.053370E-5	T	29483	2017.09.19 16:20:30.692554721	0000678	
8	0.000275	0.000172	0.000210	-4.526288E-5	T	29483	2017.09.19 16:20:30.702554721	0000678	
8	0.000299	0.000210	0.000209	-3.657282E-5	T	29483	2017.09.19 16:20:30.712554721	0000678	
8	0.000258	0.000148	0.000200	-6.902487E-5	T	29483	2017.09.19 16:20:30.722554721	0000678	
8	0.000274	0.000172	0.000205	-6.024151E-5	T	29483	2017.09.19 16:20:30.732554721	0000678	
8	0.000320	0.000219	0.000223	-6.970286E-5	T	29483	2017.09.19 16:20:30.742554721	0000678	
8	0.000281	0.000196	0.000190	-6.537871E-5	T	29483	2017.09.19 16:20:30.752554721	0000678	
9	0.000273	0.000177	0.000191	-8.422313E-5	T	29486	2017.09.19 16:20:30.762598471	0000678	
9	0.000283	0.000177	0.000210	-6.930261E-5	T	29486	2017.09.19 16:20:30.772598471	0000678	
9	0.000255	0.000158	0.000196	-4.109090E-5	T	29486	2017.09.19 16:20:30.782598471	0000678	
9	0.000305	0.000200	0.000218	-7.452712E-5	T	29486	2017.09.19 16:20:30.792598471	0000678	
9	0.000278	0.000186	0.000196	-6.931783E-5	T	29486	2017.09.19 16:20:30.802598471	0000678	
9	0.000325	0.000224	0.000223	-7.474338E-5	T	29486	2017.09.19 16:20:30.812598471	0000678	
9	0.000299	0.000205	0.000213	-4.154848E-5	T	29486	2017.09.19 16:20:30.822598471	0000678	
9	0.000282	0.000200	0.000190	-5.541171E-5	T	29486	2017.09.19 16:20:30.832598471	0000678	
9	0.000279	0.000205	0.000185	-4.143228E-5	T	29486	2017.09.19 16:20:30.842598471	0000678	
9	0.000331	0.000205	0.000237	-0.000108	T	29486	2017.09.19 16:20:30.852598471	0000678	
10	0.000314	0.000229	0.000204	-6.570564E-5	T	29493	2017.09.19 16:20:30.862642221	0000678	
10	0.000274	0.000177	0.000196	-7.424430E-5	T	29493	2017.09.19 16:20:30.872642221	0000678	
10	0.000322	0.000238	0.000209	-5.580012E-5	T	29493	2017.09.19 16:20:30.882642221	0000678	
10	0.000280	0.000200	0.000185	-6.539054E-5	T	29493	2017.09.19 16:20:30.892642221	0000678	
10	0.000307	0.000200	0.000213	-9.350557E-5	T	29493	2017.09.19 16:20:30.902642221	0000678	
10	0.000295	0.000181	0.000219	-7.937213E-5	T	29493	2017.09.19 16:20:30.912642221	0000678	
10	0.000282	0.000181	0.000205	-6.931445E-5	T	29493	2017.09.19 16:20:30.922642221	0000678	
10	0.000309	0.000215	0.000213	-6.062915E-5	T	29493	2017.09.19 16:20:30.932642221	0000678	
10	0.000299	0.000191	0.000224	-5.547535E-5	T	29493	2017.09.19 16:20:30.942642221	0000678	
10	0.000297	0.000177	0.000229	-6.938146E-5	T	29493	2017.09.19 16:20:30.952642221	0000678	
11	0.000284	0.000191	0.000205	-4.539691E-5	T	29489	2017.09.19 16:20:30.962685971	0000678	
11	0.000290	0.000200	0.000199	-6.544864E-5	T	29489	2017.09.19 16:20:30.972685971	0000678	
11	0.000315	0.000215	0.000218	-7.464931E-5	T	29489	2017.09.19 16:20:30.982685971	0000678	
11	0.000313	0.000219	0.000218	-4.568311E-5	T	29489	2017.09.19 16:20:30.992685971	0000678	
11	0.000262	0.000163	0.000200	-4.514807E-5	T	29489	2017.09.19 16:20:31.002685971	0000678	
11	0.000326	0.000229	0.000218	-7.976315E-5	T	29489	2017.09.19 16:20:31.012685971	0000678	
11	0.000277	0.000177	0.000210	-3.630399E-5	T	29489	2017.09.19 16:20:31.022685971	0000678	
11	0.000291	0.000210	0.000195	-5.051413E-5	T	29489	2017.09.19 16:20:31.032685971	0000678	
11	0.000276	0.000177	0.000205	-5.528245E-5	T	29489	2017.09.19 16:20:31.042685971	0000678	
11	0.000310	0.000205	0.000218	-7.956764E-5	T	29489	2017.09.19 16:20:31.052685971	0000678	
12	0.000309	0.000196	0.000223	-8.451487E-5	T	29496	2017.09.19 16:20:31.062729721	0000678	
12	0.000288	0.000186	0.000219	-2.241524E-5	T	29496	2017.09.19 16:20:31.072729721	0000678	
12	0.000294	0.000191	0.000209	-7.941624E-5	T	29496	2017.09.19 16:20:31.082729721	0000678	
12	0.000290	0.000196	0.000210	-4.145856E-5	T	29496	2017.09.19 16:20:31.092729721	0000678	
12	0.000292	0.000177	0.000219	-7.933955E-5	T	29496	2017.09.19 16:20:31.102729721	0000678	
12	0.000302	0.000200	0.000204	-9.846802E-5	T	29496	2017.09.19 16:20:31.112729721	0000678	
12	0.000308	0.000191	0.000232	-6.551228E-5	T	29496	2017.09.19 16:20:31.122729721	0000678	
12	0.000287	0.000196	0.000199	-6.541606E-5	T	29496	2017.09.19 16:20:31.132729721	0000678	
12	0.000308	0.000196	0.000223	-7.951508E-5	T	29496	2017.09.19 16:20:31.142729721	0000678	
12	0.000272	0.000185	0.000180	-8.425495E-5	T	29496	2017.09.19 16:20:31.152729721	0000678	
13	0.000292	0.000186	0.000219	-5.541386E-5	T	29494	2017.09.19 16:20:31.162773471	0000678	
13	0.000285	0.000181	0.000210	-6.933520E-5	T	29494	2017.09.19 16:20:31.172773471	0000678	
13	0.000309	0.000215	0.000213	-6.062915E-5	T	29494	2017.09.19 16:20:31.182773471	0000678	
13	0.000292	0.000181	0.000204	-0.000103	T	29494	2017.09.19 16:20:31.192773471	0000678	
13	0.000288	0.000186	0.000210	-6.537610E-5	T	29494	2017.09.19 16:20:31.202773471	0000678	
13	0.000307	0.000224	0.000195	-7.962697E-5	T	29494	2017.09.19 16:20:31.212773471	0000678	
13	0.000318	0.000229	0.000209	-6.972622E-5	T	29494	2017.09.19 16:20:31.222773471	0000678	
13	0.000271	0.000177	0.000196	-6.024489E-5	T	29494	2017.09.19 16:20:31.232773471	0000678	
13	0.000297	0.000181	0.000219	-8.837175E-5	T	29494	2017.09.19 16:20:31.242773471	0000678	
13	0.000289	0.000186	0.000210	-6.937593E-5	T	29494	2017.09.19 16:20:31.252773471	0000678	
14	0.000264	0.000167	0.000200	-4.118082E-5	T	29488	2017.09.19 16:20:31.262817221	0000678	
14	0.000293	0.000186	0.000214	-7.439232E-5	T	29488	2017.09.19 16:20:31.272817221	0000678	
14	0.000283	0.000186	0.000210	-4.137710E-5	T	29488	2017.09.19 16:20:31.282817221	0000678	
14	0.000260	0.000153	0.000200	-6.506577E-5	T	29488	2017.09.19 16:20:31.292817221	0000678	
14	0.000282	0.000177	0.000214	-5.032001E-5	T	29488	2017.09.19 16:20:31.302817221	0000678	
14	0.000293	0.000167	0.000224	-8.827846E-5	T	29488	2017.09.19 16:20:31.312817221	0000678	
14	0.000305	0.000200	0.000218	-7.452712E-5	T	29488	2017.09.19 16:20:31.322817221	0000678	
14	0.000304	0.000191	0.000228	-6.049589E-5	T	29488	2017.09.19 16:20:31.332817221	0000678	
14	0.000267	0.000172	0.000200	-4.522138E-5	T	29488	2017.09.19 16:20:31.342817221	0000678	
14	0.000285	0.000167	0.000224	-5.527984E-5	T	29488	2017.09.19 16:20:31.352817221	0000678	
15	0.000279	0.000172	0.000205	-7.924071E-5	T	29494	2017.09.19 16:20:31.362860971	0000678	
15	0.000310	0.000210	0.000204	-0.000104	T	29494	2017.09.19 16:20:31.372860971	0000678	
15	0.000287	0.000167	0.000224	-6.527942E-5	T	29494	2017.09.19 16:20:31.382860971	0000678	
15	0.000300	0.000215	0.000199	-6.557084E-5	T	29494	2017.09.19 16:20:31.392860971	0000678	
15	0.000303	0.000200	0.000218	-6.552750E-5	T	29494	2017.09.19 16:20:31.402860971	0000678	
15	0.000288	0.000196	0.000199	-6.941589E-5	T	29494	2017.09.19 16:20:31.412860971	0000678	
15	0.000322	0.000215	0.000223	-8.866948E-5	T	29494	2017.09.19 16:20:31.422860971	0000678	
15	0.000307	0.000205	0.000209	-9.352971E-5	T	29494	2017.09.19 16:20:31.432860971	0000678	
15	0.000286	0.000191	0.000205	-6.039629E-5	T	29494	2017.09.19 16:20:31.442860971	0000678	
15	0.000284	0.000191	0.000199	-6.537533E-5	T	29494	2017.09.19 16:20:31.452860971	0000678	
16	0.000295	0.000205	0.000199	-7.448900E-5	T	29491	2017.09.19 16:20:31.462904721	0000678	
16	0.000318	0.000210	0.000228	-6.965029E-5	T	29491	2017.09.19 16:20:31.472904721	0000678	
16	0.000325	0.000219	0.000223	-8.870206E-5	T	29491	2017.09.19 16:20:31.482904721	0000678	
16	0.000281	0.000186	0.000210	-1.337827E-5	T	29491	2017.09.19 16:20:31.492904721	0000678	
16	0.000297	0.000205	0.000204	-6.551013E-5	T	29491	2017.09.19 16:20:31.502904721	0000678	
16	0.000289	0.000210	0.000195	-3.651472E-5	T	29491	2017.09.19 16:20:31.512904721	0000678	
16	0.000290	0.000186	0.000210	-7.437572E-5	T	29491	2017.09.19 16:20:31.522904721	0000678	
16	0.000313	0.000219	0.000218	-4.568311E-5	T	29491	2017.09.19 16:20:31.532904721	0000678	
16	0.000270	0.000153	0.000214	-6.012408E-5	T	29491	2017.09.19 16:20:31.542904721	0000678	
16	0.000279	0.000163	0.000210	-8.418794E-5	T	29491	2017.09.19 16:20:31.552904721	0000678	
17	0.000292	0.000186	0.000214	-6.939253E-5	T	29491	2017.09.19 16:20:31.562948471	0000678	
17	0.000287	0.000191	0.000204	-6.539608E-5	T	29491	2017.09.19 16:20:31.572948471	0000678	
17	0.000296	0.000196	0.000209	-7.445718E-5	T	29491	2017.09.19 16:20:31.582948471	0000678	
17	0.000266	0.000177	0.000196	-3.124610E-5	T	29491	2017.09.19 16:20:31.592948471	0000678	
17	0.000291	0.000181	0.000219	-6.537272E-5	T	29491	2017.09.19 16:20:31.602948471	0000678	
17	0.000287	0.000186	0.000214	-4.539353E-5	T	29491	2017.09.19 16:20:31.612948471	0000678	
17	0.000297	0.000200	0.000209	-6.549014E-5	T	29491	2017.09.19 16:20:31.622948471	0000678	
17	0.000289	0.000191	0.000204	-7.439570E-5	T	29491	2017.09.19 16:20:31.632948471	0000678	
17	0.000309	0.000219	0.000213	-4.566236E-5	T	29491	2017.09.19 16:20:31.642948471	0000678	
17	0.000281	0.000177	0.000210	-6.030299E-5	T	29491	2017.09.19 16:20:31.652948471	0000678	
18	0.000292	0.000196	0.000195	-9.339829E-5	T	29492	2017.09.19 16:20:31.662992221	0000678	
18	0.000295	0.000191	0.000213	-6.943326E-5	T	29492	2017.09.19 16:20:31.672992221	0000678	
18	0.000260	0.000163	0.000200	-3.114865E-5	T	29492	2017.09.19 16:20:31.682992221	0000678	
18	0.000316	0.000219	0.000218	-6.568228E-5	T	29492	2017.09.19 16:20:31.692992221	0000678	
18	0.000306	0.000219	0.000209	-4.164593E-5	T	29492	2017.09.19 16:20:31.702992221	0000678	
18	0.000295	0.000191	0.000213	-6.943326E-5	T	29492	2017.09.19 16:20:31.712992221	0000678	
18	0.000269	0.000163	0.000196	-8.812967E-5	T	29492	2017.09.19 16:20:31.722992221	0000678	
18	0.000289	0.000191	0.000199	-8.437453E-5	T	29492	2017.09.19 16:20:31.732992221	0000678	
18	0.000297	0.000200	0.000209	-6.549014E-5	T	29492	2017.09.19 16:20:31.742992221	0000678	
18	0.000281	0.000186	0.000205	-5.035597E-5	T	29492	2017.09.19 16:20:31.752992221	0000678	
19	0.000270	0.000196	0.000181	-4.533804E-5	T	29488	2017.09.19 16:20:31.763035971	0000678	
19	0.000278	0.000177	0.000210	-4.530362E-5	T	29488	2017.09.19 16:20:31.773035971	0000678	
19	0.000263	0.000181	0.000186	-4.523660E-5	T	29488	2017.09.19 16:20:31.783035971	0000678	
19	0.000290	0.000181	0.000214	-7.435159E-5	T	29488	2017.09.19 16:20:31.793035971	0000678	
19	0.000286	0.000200	0.000190	-7.441092E-5	T	29488	2017.09.19 16:20:31.803035971	0000678	
19	0.000293	0.000200	0.000204	-6.546939E-5	T	29488	2017.09.19 16:20:31.813035971	0000678	
19	0.000278	0.000167	0.000210	-7.422094E-5	T	29488	2017.09.19 16:20:31.823035971	0000678	
19	0.000303	0.000200	0.000213	-7.950616E-5	T	29488	2017.09.19 16:20:31.833035971	0000678	
19	0.000310	0.000205	0.000223	-6.558898E-5	T	29488	2017.09.19 16:20:31.843035971	0000678	
19	0.000296	0.000177	0.000224	-7.936030E-5	T	29488	2017.09.19 16:20:31.853035971	0000678	
20	0.000297	0.000196	0.000219	-4.549575E-5	T	29496	2017.09.19 16:20:31.863079721	0000678	
20	0.000290	0.000196	0.000204	-6.043702E-5	T	29496	2017.09.19 16:20:31.873079721	0000678	
20	0.000339	0.000229	0.000237	-7.984200E-5	T	29496	2017.09.19 16:20:31.883079721	0000678	
20	0.000278	0.000191	0.000196	-5.035935E-5	T	29496	2017.09.19 16:20:31.893079721	0000678	
20	0.000299	0.000219	0.000199	-4.160443E-5	T	29496	2017.09.19 16:20:31.903079721	0000678	
20	0.000291	0.000205	0.000199	-5.548979E-5	T	29496	2017.09.19 16:20:31.913079721	0000678	
20	0.000335	0.000224	0.000232	-8.878015E-5	T	29496	2017.09.19 16:20:31.923079721	0000678	
20	0.000282	0.000177	0.000200	-9.326011E-5	T	29496	2017.09.19 16:20:31.933079721	0000678	
20	0.000242	0.000139	0.000196	-2.593675E-5	T	29496	2017.09.19 16:20:31.943079721	0000678	
20	0.000308	0.000219	0.000209	-5.564534E-5	T	29496	2017.09.19 16:20:31.953079721	0000678	
21	0.000309	0.000186	0.000228	-9.345378E-5	T	29494	2017.09.19 16:20:31.963123471	0000678	
21	0.000274	0.000177	0.000205	-4.528287E-5	T	29494	2017.09.19 16:20:31.973123471	0000678	
21	0.000282	0.000196	0.000200	-3.641727E-5	T	29494	2017.09.19 16:20:31.983123471	0000678	
21	0.000295	0.000167	0.000233	-6.931660E-5	T	29494	2017.09.19 16:20:31.993123471	0000678	
21	0.000303	0.000205	0.000209	-7.953029E-5	T	29494	2017.09.19 16:20:32.003123471	0000678	
21	0.000288	0.000177	0.000210	-8.830182E-5	T	29494	2017.09.19 16:20:32.013123471	0000678	
21	0.000270	0.000167	0.000210	-2.622295E-5	T	29494	2017.09.19 16:20:32.023123471	0000678	
21	0.000282	0.000167	0.000224	-3.628063E-5	T	29494	2017.09.19 16:20:32.033123471	0000678	
21	0.000318	0.000210	0.000218	-9.860758E-5	T	29494	2017.09.19 16:20:32.043123471	0000678	
21	0.000302	0.000196	0.000223	-5.051629E-5	T	29494	2017.09.19 16:20:32.053123471	0000678	
22	0.000298	0.000181	0.000224	-7.939288E-5	T	29479	2017.09.19 16:20:32.063167221	0000678	
22	0.000313	0.000205	0.000228	-6.060994E-5	T	29479	2017.09.19 16:20:32.073167221	0000678	
22	0.000292	0.000196	0.000204	-6.943664E-5	T	29479	2017.09.19 16:20:32.083167221	0000678	
22	0.000286	0.000172	0.000219	-6.529940E-5	T	29479	2017.09.19 16:20:32.093167221	0000678	
22	0.000290	0.000172	0.000214	-9.327748E-5	T	29479	2017.09.19 16:20:32.103167221	0000678	
22	0.000288	0.000163	0.000233	-4.528502E-5	T	29479	2017.09.19 16:20:32.113167221	0000678	
22	0.000295	0.000186	0.000213	-8.439190E-5	T	29479	2017.09.19 16:20:32.123167221	0000678	
22	0.000280	0.000177	0.000205	-7.428165E-5	T	29479	2017.09.19 16:20:32.133167221	0000678	
22	0.000272	0.000167	0.000210	-4.522215E-5	T	29479	2017.09.19 16:20:32.143167221	0000678	
22	0.000296	0.000200	0.000213	-4.150775E-5	T	29479	2017.09.19 16:20:32.153167221	0000678	
23	0.000294	0.000177	0.000229	-5.038226E-5	T	29490	2017.09.19 16:20:32.163210971	0000678	
23	0.000282	0.000172	0.000219	-4.130040E-5	T	29490	2017.09.19 16:20:32.173210971	0000678	
23	0.000279	0.000167	0.000210	-7.922073E-5	T	29490	2017.09.19 16:20:32.183210971	0000678	
23	0.000301	0.000191	0.000218	-7.945359E-5	T	29490	2017.09.19 16:20:32.193210971	0000678	
23	0.000288	0.000181	0.000214	-6.935180E-5	T	29490	2017.09.19 16:20:32.203210971	0000678	
23	0.000308	0.000210	0.000213	-7.458783E-5	T	29490	2017.09.19 16:20:32.213210971	0000678	
23	0.000280	0.000181	0.000205	-6.031482E-5	T	29490	2017.09.19 16:20:32.223210971	0000678	
23	0.000284	0.000186	0.000199	-7.933401E-5	T	29490	2017.09.19 16:20:32.233210971	0000678	
23	0.000281	0.000172	0.000205	-8.824034E-5	T	29490	2017.09.19 16:20:32.243210971	0000678	
23	0.000283	0.000181	0.000210	-6.033557E-5	T	29490	2017.09.19 16:20:32.253210971	0000678	
24	0.000301	0.000205	0.000209	-6.953071E-5	T	29506	2017.09.19 16:20:32.263254721	0000678	
24	0.000305	0.000205	0.000218	-5.556864E-5	T	29506	2017.09.19 16:20:32.273254721	0000678	
24	0.000294	0.000191	0.000219	-4.545501E-5	T	29506	2017.09.19 16:20:32.283254721	0000678	
24	0.000313	0.000210	0.000228	-3.665167E-5	T	29506	2017.09.19 16:20:32.293254721	0000678	
24	0.000294	0.000191	0.000209	-7.941624E-5	T	29506	2017.09.19 16:20:32.303254721	0000678	
24	0.000281	0.000167	0.000219	-5.525909E-5	T	29506	2017.09.19 16:20:32.313254721	0000678	
24	0.000294	0.000196	0.000204	-7.943622E-5	T	29506	2017.09.19 16:20:32.323254721	0000678	
24	0.000281	0.000191	0.000200	-5.037595E-5	T	29506	2017.09.19 16:20:32.333254721	0000678	
24	0.000302	0.000200	0.000213	-7.450637E-5	T	29506	2017.09.19 16:20:32.343254721	0000678	
24	0.000295	0.000191	0.000213	-6.943326E-5	T	29506	2017.09.19 16:20:32.353254721	0000678	
25	0.000320	0.000210	0.000228	-7.964987E-5	T	29492	2017.09.19 16:20:32.363298471	0000678	
25	0.000280	0.000177	0.000210	-5.530320E-5	T	29492	2017.09.19 16:20:32.373298471	0000678	
25	0.000286	0.000177	0.000219	-5.034076E-5	T	29492	2017.09.19 16:20:32.383298471	0000678	
25	0.000288	0.000172	0.000219	-7.429902E-5	T	29492	2017.09.19 16:20:32.393298471	0000678	
25	0.000311	0.000210	0.000213	-8.458741E-5	T	29492	2017.09.19 16:20:32.403298471	0000678	
25	0.000293	0.000205	0.000204	-4.151113E-5	T	29492	2017.09.19 16:20:32.413298471	0000678	
25	0.000299	0.000196	0.000213	-7.447378E-5	T	29492	2017.09.19 16:20:32.423298471	0000678	
25	0.000293	0.000219	0.000190	-4.156708E-5	T	29492	2017.09.19 16:20:32.433298471	0000678	
25	0.000295	0.000186	0.000219	-6.941328E-5	T	29492	2017.09.19 16:20:32.443298471	0000678	
25	0.000310	0.000215	0.000209	-7.961175E-5	T	29492	2017.09.19 16:20:32.453298471	0000678	
26	0.000312	0.000215	0.000218	-6.064990E-5	T	29504	2017.09.19 16:20:32.463342221	0000678	
26	0.000319	0.000210	0.000232	-6.066727E-5	T	29504	2017.09.19 16:20:32.473342221	0000678	
26	0.000295	0.000196	0.000213	-5.547458E-5	T	29504	2017.09.19 16:20:32.483342221	0000678	
26	0.000261	0.000158	0.000200	-5.510692E-5	T	29504	2017.09.19 16:20:32.493342221	0000678	
26	0.000268	0.000163	0.000210	-3.618994E-5	T	29504	2017.09.19 16:20:32.503342221	0000678	
26	0.000290	0.000191	0.000214	-4.143443E-5	T	29504	2017.09.19 16:20:32.513342221	0000678	
26	0.000285	0.000172	0.000214	-7.927806E-5	T	29504	2017.09.19 16:20:32.523342221	0000678	
26	0.000302	0.000196	0.000213	-8.447337E-5	T	29504	2017.09.19 16:20:32.533342221	0000678	
26	0.000287	0.000186	0.000210	-6.037631E-5	T	29504	2017.09.19 16:20:32.543342221	0000678	
26	0.000308	0.000205	0.000223	-5.058960E-5	T	29504	2017.09.19 16:20:32.553342221	0000678	
27	0.000282	0.000177	0.000214	-5.032001E-5	T	29498	2017.09.19 16:20:32.563385971	0000678	
27	0.000293	0.000200	0.000204	-6.546939E-5	T	29498	2017.09.19 16:20:32.573385971	0000678	
27	0.000282	0.000172	0.000210	-7.926146E-5	T	29498	2017.09.19 16:20:32.583385971	0000678	
27	0.000313	0.000200	0.000228	-7.456862E-5	T	29498	2017.09.19 16:20:32.593385971	0000678	
27	0.000294	0.000200	0.000209	-5.049077E-5	T	29498	2017.09.19 16:20:32.603385971	0000678	
27	0.000318	0.000219	0.000223	-5.570344E-5	T	29498	2017.09.19 16:20:32.613385971	0000678	
27	0.000294	0.000186	0.000219	-6.541345E-5	T	29498	2017.09.19 16:20:32.623385971	0000678	
27	0.000288	0.000172	0.000210	-9.826067E-5	T	29498	2017.09.19 16:20:32.633385971	0000678	
27	0.000299	0.000186	0.000229	-5.045557E-5	T	29498	2017.09.19 16:20:32.643385971	0000678	
27	0.000265	0.000177	0.000191	-5.022456E-5	T	29498	2017.09.19 16:20:32.653385971	0000678	
28	0.000287	0.000181	0.000205	-8.831365E-5	T	29499	2017.09.19 16:20:32.663429721	0000678	
28	0.000296	0.000191	0.000213	-7.443305E-5	T	29499	2017.09.19 16:20:32.673429721	0000678	
28	0.000302	0.000210	0.000213	-4.158921E-5	T	29499	2017.09.19 16:20:32.683429721	0000678	
28	0.000304	0.000196	0.000229	-3.653762E-5	T	29499	2017.09.19 16:20:32.693429721	0000678	
28	0.000258	0.000158	0.000191	-7.406877E-5	T	29499	2017.09.19 16:20:32.703429721	0000678	
28	0.000308	0.000200	0.000223	-6.954808E-5	T	29499	2017.09.19 16:20:32.713429721	0000678	
28	0.000292	0.000191	0.000214	-5.543385E-5	T	29499	2017.09.19 16:20:32.723429721	0000678	
28	0.000280	0.000186	0.000200	-6.533460E-5	T	29499	2017.09.19 16:20:32.733429721	0000678	
28	0.000289	0.000186	0.000210	-6.937593E-5	T	29499	2017.09.19 16:20:32.743429721	0000678	
28	0.000312	0.000219	0.000213	-6.066173E-5	T	29499	2017.09.19 16:20:32.753429721	0000678	
29	0.000291	0.000191	0.000209	-6.541683E-5	T	29503	2017.09.19 16:20:32.763473471	0000678	
29	0.000292	0.000191	0.000214	-5.543385E-5	T	29503	2017.09.19 16:20:32.773473471	0000678	
29	0.000322	0.000205	0.000237	-7.464670E-5	T	29503	2017.09.19 16:20:32.783473471	0000678	
29	0.000317	0.000229	0.000209	-6.572639E-5	T	29503	2017.09.19 16:20:32.793473471	0000678	
29	0.000308	0.000210	0.000199	-0.000108	T	29503	2017.09.19 16:20:32.803473471	0000678	
29	0.000317	0.000224	0.000218	-5.072363E-5	T	29503	2017.09.19 16:20:32.813473471	0000678	
29	0.000284	0.000181	0.000205	-7.931403E-5	T	29503	2017.09.19 16:20:32.823473471	0000678	
29	0.000314	0.000215	0.000218	-6.964952E-5	T	29503	2017.09.19 16:20:32.833473471	0000678	
29	0.000288	0.000186	0.000214	-5.039332E-5	T	29503	2017.09.19 16:20:32.843473471	0000678	
29	0.000257	0.000158	0.000196	-5.009053E-5	T	29503	2017.09.19 16:20:32.853473471	0000678	
30	0.000315	0.000215	0.000213	-8.862798E-5	T	29481	2017.09.19 16:20:32.863517221	0000678	
30	0.000308	0.000196	0.000228	-6.553641E-5	T	29481	2017.09.19 16:20:32.873517221	0000678	
30	0.000293	0.000191	0.000214	-6.043364E-5	T	29481	2017.09.19 16:20:32.883517221	0000678	
30	0.000291	0.000181	0.000214	-7.935138E-5	T	29481	2017.09.19 16:20:32.893517221	0000678	
30	0.000302	0.000191	0.000229	-5.049631E-5	T	29481	2017.09.19 16:20:32.903517221	0000678	
30	0.000311	0.000210	0.000223	-5.063034E-5	T	29481	2017.09.19 16:20:32.913517221	0000678	
30	0.000288	0.000181	0.000214	-6.935180E-5	T	29481	2017.09.19 16:20:32.923517221	0000678	
30	0.000267	0.000167	0.000200	-6.018003E-5	T	29481	2017.09.19 16:20:32.933517221	0000678	
30	0.000300	0.000205	0.000209	-6.553088E-5	T	29481	2017.09.19 16:20:32.943517221	0000678	
30	0.000291	0.000191	0.000209	-6.541683E-5	T	29481	2017.09.19 16:20:32.953517221	0000678	
31	0.000299	0.000200	0.000213	-6.050695E-5	T	29486	2017.09.19 16:20:32.963560971	0000678	
31	0.000286	0.000196	0.000195	-7.439908E-5	T	29486	2017.09.19 16:20:32.973560971	0000678	
31	0.000334	0.000229	0.000232	-6.982167E-5	T	29486	2017.09.19 16:20:32.983560971	0000678	
31	0.000285	0.000196	0.000205	-2.643844E-5	T	29486	2017.09.19 16:20:32.993560971	0000678	
31	0.000292	0.000196	0.000214	-3.647537E-5	T	29486	2017.09.19 16:20:33.003560971	0000678	
31	0.000296	0.000191	0.000219	-5.545460E-5	T	29486	2017.09.19 16:20:33.013560971	0000678	
31	0.000285	0.000191	0.000205	-5.539650E-5	T	29486	2017.09.19 16:20:33.023560971	0000678	
31	0.000294	0.000196	0.000219	-1.749692E-5	T	29486	2017.09.19 16:20:33.033560971	0000678	
31	0.000294	0.000186	0.000219	-6.541345E-5	T	29486	2017.09.19 16:20:33.043560971	0000678	
31	0.000291	0.000191	0.000214	-5.043406E-5	T	29486	2017.09.19 16:20:33.053560971	0000678	
32	0.000306	0.000210	0.000218	-4.160996E-5	T	29488	2017.09.19 16:20:33.063604721	0000678	
32	0.000303	0.000196	0.000213	-8.847320E-5	T	29488	2017.09.19 16:20:33.073604721	0000678	
32	0.000297	0.000196	0.000213	-6.547416E-5	T	29488	2017.09.19 16:20:33.083604721	0000678	
32	0.000264	0.000144	0.000214	-5.505097E-5	T	29488	2017.09.19 16:20:33.093604721	0000678	
32	0.000267	0.000158	0.000205	-6.512725E-5	T	29488	2017.09.19 16:20:33.103604721	0000678	
32	0.000291	0.000200	0.000204	-5.546981E-5	T	29488	2017.09.19 16:20:33.113604721	0000678	
32	0.000290	0.000167	0.000229	-6.030038E-5	T	29488	2017.09.19 16:20:33.123604721	0000678	
32	0.000276	0.000167	0.000214	-5.023854E-5	T	29488	2017.09.19 16:20:33.133604721	0000678	
32	0.000293	0.000181	0.000219	-7.437234E-5	T	29488	2017.09.19 16:20:33.143604721	0000678	
32	0.000292	0.000191	0.000214	-5.543385E-5	T	29488	2017.09.19 16:20:33.153604721	0000678	
33	0.000304	0.000200	0.000218	-6.952733E-5	T	29493	2017.09.19 16:20:33.163648471	0000678	
33	0.000287	0.000181	0.000205	-8.831365E-5	T	29493	2017.09.19 16:20:33.173648471	0000678	
33	0.000254	0.000153	0.000196	-5.004979E-5	T	29493	2017.09.19 16:20:33.183648471	0000678	
33	0.000270	0.000158	0.000210	-6.014821E-5	T	29493	2017.09.19 16:20:33.193648471	0000678	
33	0.000281	0.000172	0.000214	-6.027886E-5	T	29493	2017.09.19 16:20:33.203648471	0000678	
33	0.000289	0.000177	0.000219	-6.534013E-5	T	29493	2017.09.19 16:20:33.213648471	0000678	
33	0.000319	0.000219	0.000218	-7.968169E-5	T	29493	2017.09.19 16:20:33.223648471	0000678	
33	0.000278	0.000186	0.000200	-5.533501E-5	T	29493	2017.09.19 16:20:33.233648471	0000678	
33	0.000295	0.000186	0.000213	-8.439190E-5	T	29493	2017.09.19 16:20:33.243648471	0000678	
33	0.000314	0.000215	0.000218	-6.964952E-5	T	29493	2017.09.19 16:20:33.253648471	0000678	
34	0.000287	0.000196	0.000199	-6.541606E-5	T	29486	2017.09.19 16:20:33.263692221	0000678	
34	0.000299	0.000196	0.000213	-7.447378E-5	T	29486	2017.09.19 16:20:33.273692221	0000678	
34	0.000289	0.000181	0.000210	-8.433457E-5	T	29486	2017.09.19 16:20:33.283692221	0000678	
34	0.000283	0.000181	0.000214	-4.135297E-5	T	29486	2017.09.19 16:20:33.293692221	0000678	
34	0.000292	0.000177	0.000224	-6.036109E-5	T	29486	2017.09.19 16:20:33.303692221	0000678	
34	0.000293	0.000191	0.000204	-8.839512E-5	T	29486	2017.09.19 16:20:33.313692221	0000678	
34	0.000281	0.000172	0.000210	-7.426167E-5	T	29486	2017.09.19 16:20:33.323692221	0000678	
34	0.000302	0.000200	0.000218	-6.052770E-5	T	29486	2017.09.19 16:20:33.333692221	0000678	
34	0.000276	0.000181	0.000200	-6.029407E-5	T	29486	2017.09.19 16:20:33.343692221	0000678	
34	0.000287	0.000191	0.000210	-4.541766E-5	T	29486	2017.09.19 16:20:33.353692221	0000678	
35	0.000307	0.000205	0.000218	-6.956806E-5	T	29488	2017.09.19 16:20:33.363735971	0000678	
35	0.000302	0.000215	0.000209	-3.661355E-5	T	29488	2017.09.19 16:20:33.373735971	0000678	
35	0.000301	0.000172	0.000238	-6.537825E-5	T	29488	2017.09.19 16:20:33.383735971	0000678	
35	0.000297	0.000200	0.000204	-7.946881E-5	T	29488	2017.09.19 16:20:33.393735971	0000678	
35	0.000273	0.000172	0.000191	-9.318203E-5	T	29488	2017.09.19 16:20:33.403735971	0000678	
35	0.000321	0.000224	0.000223	-5.574417E-5	T	29488	2017.09.19 16:20:33.413735971	0000678	
35	0.000292	0.000186	0.000219	-5.541386E-5	T	29488	2017.09.19 16:20:33.423735971	0000678	
35	0.000304	0.000210	0.000209	-6.557161E-5	T	29488	2017.09.19 16:20:33.433735971	0000678	
35	0.000257	0.000163	0.000191	-5.511030E-5	T	29488	2017.09.19 16:20:33.443735971	0000678	
35	0.000300	0.000191	0.000223	-6.047514E-5	T	29488	2017.09.19 16:20:33.453735971	0000678	
36	0.000274	0.000153	0.000210	-8.810631E-5	T	29500	2017.09.19 16:20:33.463779721	0000678	
36	0.000304	0.000210	0.000209	-6.557161E-5	T	29500	2017.09.19 16:20:33.473779721	0000678	
36	0.000270	0.000163	0.000214	-2.220713E-5	T	29500	2017.09.19 16:20:33.483779721	0000678	
36	0.000306	0.000215	0.000213	-4.562978E-5	T	29500	2017.09.19 16:20:33.493779721	0000678	
36	0.000280	0.000181	0.000205	-6.031482E-5	T	29500	2017.09.19 16:20:33.503779721	0000678	
36	0.000275	0.000172	0.000205	-6.524130E-5	T	29500	2017.09.19 16:20:33.513779721	0000678	
36	0.000295	0.000191	0.000219	-5.045481E-5	T	29500	2017.09.19 16:20:33.523779721	0000678	
36	0.000315	0.000191	0.000237	-7.953244E-5	T	29500	2017.09.19 16:20:33.533779721	0000678	
36	0.000302	0.000200	0.000218	-6.052770E-5	T	29500	2017.09.19 16:20:33.543779721	0000678	
36	0.000276	0.000167	0.000210	-6.522132E-5	T	29500	2017.09.19 16:20:33.553779721	0000678	
37	0.000292	0.000200	0.000209	-3.649136E-5	T	29491	2017.09.19 16:20:33.563823471	0000678	
37	0.000281	0.000196	0.000196	-4.540029E-5	T	29491	2017.09.19 16:20:33.573823471	0000678	
37	0.000290	0.000181	0.000204	-9.831324E-5	T	29491	2017.09.19 16:20:33.583823471	0000678	
37	0.000301	0.000200	0.000209	-8.448935E-5	T	29491	2017.09.19 16:20:33.593823471	0000678	
37	0.000306	0.000205	0.000218	-6.056844E-5	T	29491	2017.09.19 16:20:33.603823471	0000678	
37	0.000286	0.000186	0.000205	-7.435497E-5	T	29491	2017.09.19 16:20:33.613823471	0000678	
37	0.000276	0.000153	0.000214	-8.412307E-5	T	29491	2017.09.19 16:20:33.623823471	0000678	
37	0.000301	0.000186	0.000233	-4.147255E-5	T	29491	2017.09.19 16:20:33.633823471	0000678	
37	0.000296	0.000200	0.000209	-6.049035E-5	T	29491	2017.09.19 16:20:33.643823471	0000678	
37	0.000271	0.000181	0.000196	-5.027789E-5	T	29491	2017.09.19 16:20:33.653823471	0000678	
38	0.000306	0.000191	0.000228	-6.949551E-5	T	29491	2017.09.19 16:20:33.663867221	0000678	
38	0.000301	0.000200	0.000218	-5.552791E-5	T	29491	2017.09.19 16:20:33.673867221	0000678	
38	0.000290	0.000181	0.000214	-7.435159E-5	T	29491	2017.09.19 16:20:33.683867221	0000678	
38	0.000300	0.000205	0.000204	-7.950954E-5	T	29491	2017.09.19 16:20:33.693867221	0000678	
38	0.000273	0.000181	0.000200	-4.129487E-5	T	29491	2017.09.19 16:20:33.703867221	0000678	
38	0.000291	0.000177	0.000210	-9.830140E-5	T	29491	2017.09.19 16:20:33.713867221	0000678	
38	0.000301	0.000191	0.000223	-6.547493E-5	T	29491	2017.09.19 16:20:33.723867221	0000678	
38	0.000325	0.000215	0.000232	-7.470741E-5	T	29491	2017.09.19 16:20:33.733867221	0000678	
38	0.000304	0.000205	0.000218	-5.056885E-5	T	29491	2017.09.19 16:20:33.743867221	0000678	
38	0.000300	0.000210	0.000204	-6.555086E-5	T	29491	2017.09.19 16:20:33.753867221	0000678	
39	0.000301	0.000200	0.000218	-5.552791E-5	T	29486	2017.09.19 16:20:33.763910971	0000678	
39	0.000279	0.000167	0.000219	-4.125967E-5	T	29486	2017.09.19 16:20:33.773910971	0000678	
39	0.000264	0.000153	0.000210	-4.510810E-5	T	29486	2017.09.19 16:20:33.783910971	0000678	
39	0.000286	0.000172	0.000224	-4.532098E-5	T	29486	2017.09.19 16:20:33.793910971	0000678	
39	0.000283	0.000177	0.000210	-6.930261E-5	T	29486	2017.09.19 16:20:33.803910971	0000678	
39	0.000306	0.000205	0.000209	-8.852992E-5	T	29486	2017.09.19 16:20:33.813910971	0000678	
39	0.000292	0.000186	0.000214	-6.939253E-5	T	29486	2017.09.19 16:20:33.823910971	0000678	
39	0.000291	0.000181	0.000219	-6.537272E-5	T	29486	2017.09.19 16:20:33.833910971	0000678	
39	0.000261	0.000167	0.000196	-4.516405E-5	T	29486	2017.09.19 16:20:33.843910971	0000678	
39	0.000265	0.000158	0.000205	-5.512767E-5	T	29486	2017.09.19 16:20:33.853910971	0000678	
40	0.000293	0.000191	0.000219	-3.645539E-5	T	29491	2017.09.19 16:20:33.863954721	0000678	
40	0.000290	0.000167	0.000219	-9.325750E-5	T	29491	2017.09.19 16:20:33.873954721	0000678	
40	0.000297	0.000181	0.000224	-7.439309E-5	T	29491	2017.09.19 16:20:33.883954721	0000678	
40	0.000302	0.000200	0.000213	-7.450637E-5	T	29491	2017.09.19 16:20:33.893954721	0000678	
40	0.000279	0.000196	0.000190	-5.537913E-5	T	29491	2017.09.19 16:20:33.903954721	0000678	
40	0.000294	0.000191	0.000213	-6.543343E-5	T	29491	2017.09.19 16:20:33.913954721	0000678	
40	0.000297	0.000191	0.000213	-7.943284E-5	T	29491	2017.09.19 16:20:33.923954721	0000678	
40	0.000284	0.000158	0.000229	-5.522727E-5	T	29491	2017.09.19 16:20:33.933954721	0000678	
40	0.000296	0.000196	0.000209	-7.445718E-5	T	29491	2017.09.19 16:20:33.943954721	0000678	
40	0.000320	0.000210	0.000228	-7.964987E-5	T	29491	2017.09.19 16:20:33.953954721	0000678	
41	0.000279	0.000153	0.000219	-7.914403E-5	T	29495	2017.09.19 16:20:33.963998471	0000678	
41	0.000310	0.000200	0.000218	-9.352633E-5	T	29495	2017.09.19 16:20:33.973998471	0000678	
41	0.000301	0.000196	0.000218	-6.549491E-5	T	29495	2017.09.19 16:20:33.983998471	0000678	
41	0.000293	0.000172	0.000224	-7.931956E-5	T	29495	2017.09.19 16:20:33.993998471	0000678	
41	0.000294	0.000181	0.000209	-9.833399E-5	T	29495	2017.09.19 16:20:34.003998471	0000678	
41	0.000280	0.000181	0.000205	-6.031482E-5	T	29495	2017.09.19 16:20:34.013998471	0000678	
41	0.000282	0.000158	0.000224	-6.520610E-5	T	29495	2017.09.19 16:20:34.023998471	0000678	
41	0.000272	0.000167	0.000210	-4.522215E-5	T	29495	2017.09.19 16:20:34.033998471	0000678	
41	0.000308	0.000206	0.000228	-2.261152E-5	T	29495	2017.09.19 16:20:34.043998471	0000678	
41	0.000297	0.000196	0.000213	-6.547416E-5	T	29495	2017.09.19 16:20:34.053998471	0000678	
42	0.000305	0.000186	0.000233	-6.547155E-5	T	29496	2017.09.19 16:20:34.064042221	0000678	
42	0.000306	0.000191	0.000223	-8.447413E-5	T	29496	2017.09.19 16:20:34.074042221	0000678	
42	0.000305	0.000186	0.000233	-6.547155E-5	T	29496	2017.09.19 16:20:34.084042221	0000678	
42	0.000298	0.000191	0.000218	-6.545418E-5	T	29496	2017.09.19 16:20:34.094042221	0000678	
42	0.000294	0.000172	0.000224	-8.431935E-5	T	29496	2017.09.19 16:20:34.104042221	0000678	
42	0.000275	0.000158	0.000219	-5.018598E-5	T	29496	2017.09.19 16:20:34.114042221	0000678	
42	0.000291	0.000163	0.000224	-8.824587E-5	T	29496	2017.09.19 16:20:34.124042221	0000678	
42	0.000318	0.000210	0.000218	-9.860758E-5	T	29496	2017.09.19 16:20:34.134042221	0000678	
42	0.000282	0.000163	0.000219	-6.922591E-5	T	29496	2017.09.19 16:20:34.144042221	0000678	
42	0.000292	0.000200	0.000204	-6.046960E-5	T	29496	2017.09.19 16:20:34.154042221	0000678	
43	0.000288	0.000172	0.000219	-7.429902E-5	T	29490	2017.09.19 16:20:34.164085971	0000678	
43	0.000284	0.000181	0.000214	-4.535280E-5	T	29490	2017.09.19 16:20:34.174085971	0000678	
43	0.000293	0.000172	0.000229	-6.034111E-5	T	29490	2017.09.19 16:20:34.184085971	0000678	
43	0.000278	0.000172	0.000210	-6.026226E-5	T	29490	2017.09.19 16:20:34.194085971	0000678	
43	0.000290	0.000195	0.000190	-9.837733E-5	T	29490	2017.09.19 16:20:34.204085971	0000678	
43	0.000298	0.000186	0.000218	-7.941286E-5	T	29490	2017.09.19 16:20:34.214085971	0000678	
43	0.000293	0.000181	0.000224	-5.539388E-5	T	29490	2017.09.19 16:20:34.224085971	0000678	
43	0.000292	0.000191	0.000219	-3.145560E-5	T	29490	2017.09.19 16:20:34.234085971	0000678	
43	0.000319	0.000215	0.000228	-5.569161E-5	T	29490	2017.09.19 16:20:34.244085971	0000678	
43	0.000270	0.000186	0.000191	-4.529808E-5	T	29490	2017.09.19 16:20:34.254085971	0000678	
44	0.000284	0.000177	0.000219	-3.634134E-5	T	29490	2017.09.19 16:20:34.264129721	0000678	
44	0.000302	0.000219	0.000204	-3.662539E-5	T	29490	2017.09.19 16:20:34.274129721	0000678	
44	0.000297	0.000191	0.000209	-8.841587E-5	T	29490	2017.09.19 16:20:34.284129721	0000678	
44	0.000315	0.000219	0.000218	-6.068248E-5	T	29490	2017.09.19 16:20:34.294129721	0000678	
44	0.000298	0.000200	0.000213	-5.550716E-5	T	29490	2017.09.19 16:20:34.304129721	0000678	
44	0.000313	0.000205	0.000223	-7.958839E-5	T	29490	2017.09.19 16:20:34.314129721	0000678	
44	0.000271	0.000167	0.000205	-6.020078E-5	T	29490	2017.09.19 16:20:34.324129721	0000678	
44	0.000274	0.000167	0.000205	-7.420019E-5	T	29490	2017.09.19 16:20:34.334129721	0000678	
44	0.000309	0.000200	0.000223	-7.454787E-5	T	29490	2017.09.19 16:20:34.344129721	0000678	
44	0.000296	0.000196	0.000209	-7.445718E-5	T	29490	2017.09.19 16:20:34.354129721	0000678	
45	0.000292	0.000200	0.000209	-3.649136E-5	T	29501	2017.09.19 16:20:34.364173471	0000678	
45	0.000285	0.000181	0.000214	-5.035259E-5	T	29501	2017.09.19 16:20:34.374173471	0000678	
45	0.000295	0.000167	0.000229	-8.429937E-5	T	29501	2017.09.19 16:20:34.384173471	0000678	
45	0.000300	0.000186	0.000233	-3.647276E-5	T	29501	2017.09.19 16:20:34.394173471	0000678	
45	0.000292	0.000191	0.000209	-6.941666E-5	T	29501	2017.09.19 16:20:34.404173471	0000678	
45	0.000313	0.000205	0.000228	-6.060994E-5	T	29501	2017.09.19 16:20:34.414173471	0000678	
45	0.000290	0.000200	0.000204	-4.547023E-5	T	29501	2017.09.19 16:20:34.424173471	0000678	
45	0.000261	0.000144	0.000210	-5.503437E-5	T	29501	2017.09.19 16:20:34.434173471	0000678	
45	0.000293	0.000196	0.000209	-6.045777E-5	T	29501	2017.09.19 16:20:34.444173471	0000678	
45	0.000284	0.000186	0.000205	-6.535535E-5	T	29501	2017.09.19 16:20:34.454173471	0000678	
46	0.000294	0.000186	0.000219	-6.541345E-5	T	29484	2017.09.19 16:20:34.464217221	0000678	
46	0.000308	0.000215	0.000209	-6.961217E-5	T	29484	2017.09.19 16:20:34.474217221	0000678	
46	0.000296	0.000177	0.000219	-9.333896E-5	T	29484	2017.09.19 16:20:34.484217221	0000678	
46	0.000276	0.000191	0.000191	-6.033819E-5	T	29484	2017.09.19 16:20:34.494217221	0000678	
46	0.000302	0.000205	0.000209	-7.453050E-5	T	29484	2017.09.19 16:20:34.504217221	0000678	
46	0.000302	0.000200	0.000213	-7.450637E-5	T	29484	2017.09.19 16:20:34.514217221	0000678	
46	0.000301	0.000200	0.000213	-6.950658E-5	T	29484	2017.09.19 16:20:34.524217221	0000678	
46	0.000295	0.000200	0.000209	-5.549056E-5	T	29484	2017.09.19 16:20:34.534217221	0000678	
46	0.000296	0.000215	0.000199	-4.157184E-5	T	29484	2017.09.19 16:20:34.544217221	0000678	
46	0.000304	0.000186	0.000229	-7.445457E-5	T	29484	2017.09.19 16:20:34.554217221	0000678	
47	0.000292	0.000191	0.000204	-8.439528E-5	T	29497	2017.09.19 16:20:34.564260971	0000678	
47	0.000278	0.000186	0.000196	-6.931783E-5	T	29497	2017.09.19 16:20:34.574260971	0000678	
47	0.000281	0.000186	0.000205	-5.035597E-5	T	29497	2017.09.19 16:20:34.584260971	0000678	
47	0.000307	0.000205	0.000223	-4.558981E-5	T	29497	2017.09.19 16:20:34.594260971	0000678	
47	0.000307	0.000204	0.000199	-0.000112	T	29497	2017.09.19 16:20:34.604260971	0000678	
47	0.000271	0.000167	0.000205	-6.020078E-5	T	29497	2017.09.19 16:20:34.614260971	0000678	
47	0.000296	0.000215	0.000199	-4.157184E-5	T	29497	2017.09.19 16:20:34.624260971	0000678	
47	0.000295	0.000200	0.000213	-3.650796E-5	T	29497	2017.09.19 16:20:34.634260971	0000678	
47	0.000298	0.000200	0.000213	-5.550716E-5	T	29497	2017.09.19 16:20:34.644260971	0000678	
47	0.000274	0.000163	0.000210	-6.518873E-5	T	29497	2017.09.19 16:20:34.654260971	0000678	
48	0.000303	0.000219	0.000204	-4.562501E-5	T	29499	2017.09.19 16:20:34.664304721	0000678	
48	0.000292	0.000191	0.000214	-5.543385E-5	T	29499	2017.09.19 16:20:34.674304721	0000678	
48	0.000295	0.000186	0.000224	-5.043482E-5	T	29499	2017.09.19 16:20:34.684304721	0000678	
48	0.000262	0.000167	0.000191	-6.514247E-5	T	29499	2017.09.19 16:20:34.694304721	0000678	
48	0.000284	0.000177	0.000214	-6.031959E-5	T	29499	2017.09.19 16:20:34.704304721	0000678	
48	0.000314	0.000210	0.000218	-8.460816E-5	T	29499	2017.09.19 16:20:34.714304721	0000678	
48	0.000281	0.000181	0.000200	-7.929328E-5	T	29499	2017.09.19 16:20:34.724304721	0000678	
48	0.000279	0.000172	0.000214	-5.027928E-5	T	29499	2017.09.19 16:20:34.734304721	0000678	
48	0.000267	0.000163	0.000196	-7.913005E-5	T	29499	2017.09.19 16:20:34.744304721	0000678	
48	0.000269	0.000177	0.000191	-6.922376E-5	T	29499	2017.09.19 16:20:34.754304721	0000678	
49	0.000278	0.000167	0.000210	-7.422094E-5	T	29472	2017.09.19 16:20:34.764348471	0000678	
49	0.000314	0.000215	0.000218	-6.964952E-5	T	29472	2017.09.19 16:20:34.774348471	0000678	
49	0.000265	0.000153	0.000210	-5.010790E-5	T	29472	2017.09.19 16:20:34.784348471	0000678	
49	0.000274	0.000172	0.000210	-3.626326E-5	T	29472	2017.09.19 16:20:34.794348471	0000678	
49	0.000299	0.000210	0.000199	-7.452973E-5	T	29472	2017.09.19 16:20:34.804348471	0000678	
49	0.000310	0.000205	0.000218	-7.956764E-5	T	29472	2017.09.19 16:20:34.814348471	0000678	
49	0.000296	0.000210	0.000195	-7.451313E-5	T	29472	2017.09.19 16:20:34.824348471	0000678	
49	0.000304	0.000196	0.000213	-9.347299E-5	T	29472	2017.09.19 16:20:34.834348471	0000678	
49	0.000282	0.000181	0.000210	-5.033599E-5	T	29472	2017.09.19 16:20:34.844348471	0000678	
49	0.000280	0.000191	0.000196	-6.035894E-5	T	29472	2017.09.19 16:20:34.854348471	0000678	
50	0.000299	0.000210	0.000199	-7.452973E-5	T	29497	2017.09.19 16:20:34.864392221	0000678	
50	0.000309	0.000200	0.000218	-8.852653E-5	T	29497	2017.09.19 16:20:34.874392221	0000678	
50	0.000287	0.000205	0.000195	-4.547361E-5	T	29497	2017.09.19 16:20:34.884392221	0000678	
50	0.000286	0.000181	0.000219	-3.637393E-5	T	29497	2017.09.19 16:20:34.894392221	0000678	
50	0.000276	0.000177	0.000205	-5.528245E-5	T	29497	2017.09.19 16:20:34.904392221	0000678	
50	0.000312	0.000219	0.000213	-6.066173E-5	T	29497	2017.09.19 16:20:34.914392221	0000678	
50	0.000305	0.000205	0.000223	-3.159040E-5	T	29497	2017.09.19 16:20:34.924392221	0000678	
50	0.000278	0.000177	0.000196	-8.824372E-5	T	29497	2017.09.19 16:20:34.934392221	0000678	
50	0.000300	0.000205	0.000209	-6.553088E-5	T	29497	2017.09.19 16:20:34.944392221	0000678	
50	0.000321	0.000205	0.000237	-6.964691E-5	T	29497	2017.09.19 16:20:34.954392221	0000678	
51	0.000297	0.000196	0.000219	-4.149591E-5	T	29496	2017.09.19 16:20:34.964435971	0000678	
51	0.000266	0.000153	0.000210	-5.510769E-5	T	29496	2017.09.19 16:20:34.974435971	0000678	
51	0.000278	0.000181	0.000210	-2.633699E-5	T	29496	2017.09.19 16:20:34.984435971	0000678	
51	0.000271	0.000172	0.000191	-8.818224E-5	T	29496	2017.09.19 16:20:34.994435971	0000678	
51	0.000298	0.000186	0.000209	-0.000103	T	29496	2017.09.19 16:20:35.004435971	0000678	
51	0.000274	0.000167	0.000205	-7.420019E-5	T	29496	2017.09.19 16:20:35.014435971	0000678	
51	0.000275	0.000167	0.000210	-6.022153E-5	T	29496	2017.09.19 16:20:35.024435971	0000678	
51	0.000288	0.000181	0.000214	-6.935180E-5	T	29496	2017.09.19 16:20:35.034435971	0000678	
51	0.000303	0.000200	0.000213	-7.950616E-5	T	29496	2017.09.19 16:20:35.044435971	0000678	
51	0.000317	0.000210	0.000223	-7.962912E-5	T	29496	2017.09.19 16:20:35.054435971	0000678	
52	0.000305	0.000215	0.000209	-5.561276E-5	T	29493	2017.09.19 16:20:35.064479721	0000678	
52	0.000308	0.000215	0.000213	-5.562936E-5	T	29493	2017.09.19 16:20:35.074479721	0000678	
52	0.000288	0.000191	0.000210	-5.041746E-5	T	29493	2017.09.19 16:20:35.084479721	0000678	
52	0.000292	0.000186	0.000209	-8.437530E-5	T	29493	2017.09.19 16:20:35.094479721	0000678	
52	0.000298	0.000200	0.000213	-5.550716E-5	T	29493	2017.09.19 16:20:35.104479721	0000678	
52	0.000295	0.000177	0.000219	-8.833917E-5	T	29493	2017.09.19 16:20:35.114479721	0000678	
52	0.000292	0.000200	0.000199	-7.444827E-5	T	29493	2017.09.19 16:20:35.124479721	0000678	
52	0.000303	0.000210	0.000204	-7.955027E-5	T	29493	2017.09.19 16:20:35.134479721	0000678	
52	0.000303	0.000172	0.000238	-7.437787E-5	T	29493	2017.09.19 16:20:35.144479721	0000678	
52	0.000308	0.000215	0.000213	-5.562936E-5	T	29493	2017.09.19 16:20:35.154479721	0000678	
53	0.000288	0.000191	0.000204	-6.939591E-5	T	29495	2017.09.19 16:20:35.164523471	0000678	
53	0.000287	0.000177	0.000210	-8.430199E-5	T	29495	2017.09.19 16:20:35.174523471	0000678	
53	0.000306	0.000210	0.000213	-6.558821E-5	T	29495	2017.09.19 16:20:35.184523471	0000678	
53	0.000260	0.000158	0.000205	-2.612888E-5	T	29495	2017.09.19 16:20:35.194523471	0000678	
53	0.000283	0.000167	0.000214	-7.923733E-5	T	29495	2017.09.19 16:20:35.204523471	0000678	
53	0.000301	0.000205	0.000209	-6.953071E-5	T	29495	2017.09.19 16:20:35.214523471	0000678	
53	0.000280	0.000186	0.000200	-6.533460E-5	T	29495	2017.09.19 16:20:35.224523471	0000678	
53	0.000301	0.000200	0.000213	-6.950658E-5	T	29495	2017.09.19 16:20:35.234523471	0000678	
53	0.000283	0.000181	0.000210	-6.033557E-5	T	29495	2017.09.19 16:20:35.244523471	0000678	
53	0.000318	0.000200	0.000228	-9.356783E-5	T	29495	2017.09.19 16:20:35.254523471	0000678	
54	0.000293	0.000181	0.000219	-7.437234E-5	T	29489	2017.09.19 16:20:35.264567221	0000678	
54	0.000310	0.000205	0.000223	-6.558898E-5	T	29489	2017.09.19 16:20:35.274567221	0000678	
54	0.000267	0.000163	0.000200	-6.914706E-5	T	29489	2017.09.19 16:20:35.284567221	0000678	
54	0.000271	0.000172	0.000200	-6.522055E-5	T	29489	2017.09.19 16:20:35.294567221	0000678	
54	0.000295	0.000205	0.000199	-7.448900E-5	T	29489	2017.09.19 16:20:35.304567221	0000678	
54	0.000270	0.000186	0.000191	-4.529808E-5	T	29489	2017.09.19 16:20:35.314567221	0000678	
54	0.000300	0.000200	0.000213	-6.550675E-5	T	29489	2017.09.19 16:20:35.324567221	0000678	
54	0.000283	0.000177	0.000214	-5.531980E-5	T	29489	2017.09.19 16:20:35.334567221	0000678	
54	0.000317	0.000196	0.000228	-9.853503E-5	T	29489	2017.09.19 16:20:35.344567221	0000678	
54	0.000297	0.000205	0.000209	-5.053150E-5	T	29489	2017.09.19 16:20:35.354567221	0000678	
55	0.000296	0.000191	0.000219	-5.545460E-5	T	29486	2017.09.19 16:20:35.364610971	0000678	
55	0.000262	0.000167	0.000191	-6.514247E-5	T	29486	2017.09.19 16:20:35.374610971	0000678	
55	0.000296	0.000210	0.000199	-6.053032E-5	T	29486	2017.09.19 16:20:35.384610971	0000678	
55	0.000297	0.000191	0.000213	-7.943284E-5	T	29486	2017.09.19 16:20:35.394610971	0000678	
55	0.000280	0.000191	0.000196	-6.035894E-5	T	29486	2017.09.19 16:20:35.404610971	0000678	
55	0.000293	0.000210	0.000195	-6.051372E-5	T	29486	2017.09.19 16:20:35.414610971	0000678	
55	0.000288	0.000191	0.000204	-6.939591E-5	T	29486	2017.09.19 16:20:35.424610971	0000678	
55	0.000291	0.000196	0.000210	-4.545840E-5	T	29486	2017.09.19 16:20:35.434610971	0000678	
55	0.000268	0.000177	0.000200	-2.626291E-5	T	29486	2017.09.19 16:20:35.444610971	0000678	
55	0.000300	0.000181	0.000218	-9.837134E-5	T	29486	2017.09.19 16:20:35.454610971	0000678	
56	0.000314	0.000229	0.000204	-6.570564E-5	T	29489	2017.09.19 16:20:35.464654721	0000678	
56	0.000304	0.000186	0.000223	-8.843324E-5	T	29489	2017.09.19 16:20:35.474654721	0000678	
56	0.000310	0.000219	0.000209	-6.564492E-5	T	29489	2017.09.19 16:20:35.484654721	0000678	
56	0.000282	0.000177	0.000214	-5.032001E-5	T	29489	2017.09.19 16:20:35.494654721	0000678	
56	0.000277	0.000177	0.000200	-7.426090E-5	T	29489	2017.09.19 16:20:35.504654721	0000678	
56	0.000309	0.000200	0.000223	-7.454787E-5	T	29489	2017.09.19 16:20:35.514654721	0000678	
56	0.000298	0.000196	0.000213	-6.947399E-5	T	29489	2017.09.19 16:20:35.524654721	0000678	
56	0.000329	0.000229	0.000223	-7.978390E-5	T	29489	2017.09.19 16:20:35.534654721	0000678	
56	0.000295	0.000191	0.000213	-6.943326E-5	T	29489	2017.09.19 16:20:35.544654721	0000678	
56	0.000271	0.000172	0.000196	-7.420357E-5	T	29489	2017.09.19 16:20:35.554654721	0000678	
57	0.000285	0.000196	0.000195	-6.939929E-5	T	29499	2017.09.19 16:20:35.564698471	0000678	
57	0.000298	0.000191	0.000213	-8.443263E-5	T	29499	2017.09.19 16:20:35.574698471	0000678	
57	0.000304	0.000196	0.000218	-7.949432E-5	T	29499	2017.09.19 16:20:35.584698471	0000678	
57	0.000310	0.000210	0.000213	-7.958762E-5	T	29499	2017.09.19 16:20:35.594698471	0000678	
57	0.000298	0.000196	0.000209	-7.945697E-5	T	29499	2017.09.19 16:20:35.604698471	0000678	
57	0.000312	0.000224	0.000204	-7.466453E-5	T	29499	2017.09.19 16:20:35.614698471	0000678	
57	0.000277	0.000167	0.000205	-8.419977E-5	T	29499	2017.09.19 16:20:35.624698471	0000678	
57	0.000290	0.000191	0.000210	-6.041704E-5	T	29499	2017.09.19 16:20:35.634698471	0000678	
57	0.000289	0.000186	0.000210	-6.937593E-5	T	29499	2017.09.19 16:20:35.644698471	0000678	
57	0.000293	0.000191	0.000219	-3.645539E-5	T	29499	2017.09.19 16:20:35.654698471	0000678	
58	0.000283	0.000181	0.000205	-7.431424E-5	T	29492	2017.09.19 16:20:35.664742221	0000678	
58	0.000289	0.000191	0.000204	-7.439570E-5	T	29492	2017.09.19 16:20:35.674742221	0000678	
58	0.000297	0.000200	0.000209	-6.549014E-5	T	29492	2017.09.19 16:20:35.684742221	0000678	
58	0.000309	0.000200	0.000223	-7.454787E-5	T	29492	2017.09.19 16:20:35.694742221	0000678	
58	0.000283	0.000177	0.000210	-6.930261E-5	T	29492	2017.09.19 16:20:35.704742221	0000678	
58	0.000292	0.000196	0.000209	-5.545798E-5	T	29492	2017.09.19 16:20:35.714742221	0000678	
58	0.000277	0.000177	0.000205	-6.028224E-5	T	29492	2017.09.19 16:20:35.724742221	0000678	
58	0.000274	0.000186	0.000191	-6.529725E-5	T	29492	2017.09.19 16:20:35.734742221	0000678	
58	0.000320	0.000210	0.000232	-6.566706E-5	T	29492	2017.09.19 16:20:35.744742221	0000678	
58	0.000310	0.000224	0.000213	-2.270405E-5	T	29492	2017.09.19 16:20:35.754742221	0000678	
59	0.000320	0.000215	0.000228	-6.069140E-5	T	29492	2017.09.19 16:20:35.764785971	0000678	
59	0.000322	0.000229	0.000209	-8.872543E-5	T	29492	2017.09.19 16:20:35.774785971	0000678	
59	0.000283	0.000186	0.000200	-7.433422E-5	T	29492	2017.09.19 16:20:35.784785971	0000678	
59	0.000282	0.000181	0.000200	-8.429307E-5	T	29492	2017.09.19 16:20:35.794785971	0000678	
59	0.000309	0.000215	0.000209	-7.461196E-5	T	29492	2017.09.19 16:20:35.804785971	0000678	
59	0.000283	0.000177	0.000214	-5.531980E-5	T	29492	2017.09.19 16:20:35.814785971	0000678	
59	0.000296	0.000177	0.000219	-9.333896E-5	T	29492	2017.09.19 16:20:35.824785971	0000678	
59	0.000300	0.000191	0.000229	-3.649689E-5	T	29492	2017.09.19 16:20:35.834785971	0000678	
59	0.000279	0.000186	0.000200	-6.033481E-5	T	29492	2017.09.19 16:20:35.844785971	0000678	
59	0.000307	0.000181	0.000238	-6.945140E-5	T	29492	2017.09.19 16:20:35.854785971	0000678	
60	0.000293	0.000196	0.000214	-4.547500E-5	T	29489	2017.09.19 16:20:35.864829721	0000678	
60	0.000292	0.000200	0.000210	-3.149157E-5	T	29489	2017.09.19 16:20:35.874829721	0000678	
60	0.000303	0.000186	0.000229	-6.945478E-5	T	29489	2017.09.19 16:20:35.884829721	0000678	
60	0.000319	0.000219	0.000223	-6.070323E-5	T	29489	2017.09.19 16:20:35.894829721	0000678	
60	0.000281	0.000177	0.000210	-6.030299E-5	T	29489	2017.09.19 16:20:35.904829721	0000678	
60	0.000328	0.000215	0.000237	-6.972837E-5	T	29489	2017.09.19 16:20:35.914829721	0000678	
60	0.000297	0.000196	0.000213	-6.547416E-5	T	29489	2017.09.19 16:20:35.924829721	0000678	
60	0.000291	0.000186	0.000209	-7.937551E-5	T	29489	2017.09.19 16:20:35.934829721	0000678	
60	0.000291	0.000196	0.000204	-6.543681E-5	T	29489	2017.09.19 16:20:35.944829721	0000678	
60	0.000295	0.000186	0.000224	-4.543503E-5	T	29489	2017.09.19 16:20:35.954829721	0000678	
61	0.000288	0.000196	0.000199	-6.941589E-5	T	29493	2017.09.19 16:20:35.964873471	0000678	
61	0.000315	0.000219	0.000218	-6.068248E-5	T	29493	2017.09.19 16:20:35.974873471	0000678	
61	0.000308	0.000210	0.000218	-5.560938E-5	T	29493	2017.09.19 16:20:35.984873471	0000678	
61	0.000308	0.000186	0.000228	-8.845399E-5	T	29493	2017.09.19 16:20:35.994873471	0000678	
61	0.000300	0.000196	0.000204	-9.843543E-5	T	29493	2017.09.19 16:20:36.004873471	0000678	
61	0.000319	0.000215	0.000223	-7.467006E-5	T	29493	2017.09.19 16:20:36.014873471	0000678	
61	0.000296	0.000186	0.000213	-8.839174E-5	T	29493	2017.09.19 16:20:36.024873471	0000678	
61	0.000282	0.000200	0.000190	-5.541171E-5	T	29493	2017.09.19 16:20:36.034873471	0000678	
61	0.000293	0.000181	0.000219	-7.437234E-5	T	29493	2017.09.19 16:20:36.044873471	0000678	
61	0.000283	0.000200	0.000190	-6.041150E-5	T	29493	2017.09.19 16:20:36.054873471	0000678	
62	0.000291	0.000181	0.000219	-6.537272E-5	T	29498	2017.09.19 16:20:36.064917221	0000678	
62	0.000292	0.000181	0.000214	-8.435117E-5	T	29498	2017.09.19 16:20:36.074917221	0000678	
62	0.000278	0.000177	0.000200	-7.926069E-5	T	29498	2017.09.19 16:20:36.084917221	0000678	
62	0.000296	0.000172	0.000233	-6.035771E-5	T	29498	2017.09.19 16:20:36.094917221	0000678	
62	0.000312	0.000210	0.000223	-5.563013E-5	T	29498	2017.09.19 16:20:36.104917221	0000678	
62	0.000306	0.000210	0.000213	-6.558821E-5	T	29498	2017.09.19 16:20:36.114917221	0000678	
62	0.000285	0.000163	0.000224	-6.924666E-5	T	29498	2017.09.19 16:20:36.124917221	0000678	
62	0.000262	0.000172	0.000191	-5.018382E-5	T	29498	2017.09.19 16:20:36.134917221	0000678	
62	0.000287	0.000186	0.000204	-7.935476E-5	T	29498	2017.09.19 16:20:36.144917221	0000678	
62	0.000295	0.000205	0.000209	-3.653209E-5	T	29498	2017.09.19 16:20:36.154917221	0000678	
63	0.000311	0.000191	0.000228	-8.849472E-5	T	29490	2017.09.19 16:20:36.164960971	0000678	
63	0.000310	0.000205	0.000218	-7.956764E-5	T	29490	2017.09.19 16:20:36.174960971	0000678	
63	0.000297	0.000210	0.000204	-5.055148E-5	T	29490	2017.09.19 16:20:36.184960971	0000678	
63	0.000297	0.000210	0.000204	-4.555169E-5	T	29490	2017.09.19 16:20:36.194960971	0000678	
63	0.000308	0.000219	0.000195	-9.358565E-5	T	29490	2017.09.19 16:20:36.204960971	0000678	
63	0.000294	0.000186	0.000219	-6.541345E-5	T	29490	2017.09.19 16:20:36.214960971	0000678	
63	0.000292	0.000200	0.000204	-6.046960E-5	T	29490	2017.09.19 16:20:36.224960971	0000678	
63	0.000282	0.000181	0.000210	-5.533578E-5	T	29490	2017.09.19 16:20:36.234960971	0000678	
63	0.000271	0.000200	0.000181	-3.137121E-5	T	29490	2017.09.19 16:20:36.244960971	0000678	
63	0.000306	0.000196	0.000223	-7.451528E-5	T	29490	2017.09.19 16:20:36.254960971	0000678	
64	0.000290	0.000177	0.000214	-8.431859E-5	T	29490	2017.09.19 16:20:36.265004721	0000678	
64	0.000287	0.000177	0.000210	-8.430199E-5	T	29490	2017.09.19 16:20:36.275004721	0000678	
64	0.000317	0.000205	0.000223	-9.358781E-5	T	29490	2017.09.19 16:20:36.285004721	0000678	
64	0.000290	0.000191	0.000214	-4.143443E-5	T	29490	2017.09.19 16:20:36.295004721	0000678	
64	0.000268	0.000167	0.000205	-4.120157E-5	T	29490	2017.09.19 16:20:36.305004721	0000678	
64	0.000298	0.000177	0.000224	-8.835992E-5	T	29490	2017.09.19 16:20:36.315004721	0000678	
64	0.000300	0.000210	0.000209	-4.157261E-5	T	29490	2017.09.19 16:20:36.325004721	0000678	
64	0.000276	0.000163	0.000219	-4.122708E-5	T	29490	2017.09.19 16:20:36.335004721	0000678	
64	0.000297	0.000210	0.000204	-5.055148E-5	T	29490	2017.09.19 16:20:36.345004721	0000678	
64	0.000267	0.000181	0.000196	-1.727927E-5	T	29490	2017.09.19 16:20:36.355004721	0000678	
65	0.000321	0.000205	0.000228	-9.360856E-5	T	29496	2017.09.19 16:20:36.365048471	0000678	
65	0.000291	0.000196	0.000204	-6.543681E-5	T	29496	2017.09.19 16:20:36.375048471	0000678	
65	0.000278	0.000163	0.000214	-6.920516E-5	T	29496	2017.09.19 16:20:36.385048471	0000678	
65	0.000297	0.000191	0.000213	-7.943284E-5	T	29496	2017.09.19 16:20:36.395048471	0000678	
65	0.000288	0.000191	0.000204	-6.939591E-5	T	29496	2017.09.19 16:20:36.405048471	0000678	
65	0.000293	0.000196	0.000209	-6.045777E-5	T	29496	2017.09.19 16:20:36.415048471	0000678	
65	0.000259	0.000158	0.000200	-4.510734E-5	T	29496	2017.09.19 16:20:36.425048471	0000678	
65	0.000309	0.000196	0.000228	-6.953624E-5	T	29496	2017.09.19 16:20:36.435048471	0000678	
65	0.000295	0.000181	0.000219	-7.937213E-5	T	29496	2017.09.19 16:20:36.445048471	0000678	
65	0.000296	0.000186	0.000224	-5.543462E-5	T	29496	2017.09.19 16:20:36.455048471	0000678	
66	0.000280	0.000172	0.000210	-6.926188E-5	T	29493	2017.09.19 16:20:36.465092221	0000678	
66	0.000303	0.000210	0.000209	-6.057182E-5	T	29493	2017.09.19 16:20:36.475092221	0000678	
66	0.000321	0.000210	0.000228	-8.464966E-5	T	29493	2017.09.19 16:20:36.485092221	0000678	
66	0.000306	0.000210	0.000213	-6.558821E-5	T	29493	2017.09.19 16:20:36.495092221	0000678	
66	0.000301	0.000196	0.000209	-9.345639E-5	T	29493	2017.09.19 16:20:36.505092221	0000678	
66	0.000312	0.000210	0.000218	-7.460858E-5	T	29493	2017.09.19 16:20:36.515092221	0000678	
66	0.000282	0.000181	0.000200	-8.429307E-5	T	29493	2017.09.19 16:20:36.525092221	0000678	
66	0.000300	0.000181	0.000224	-8.439267E-5	T	29493	2017.09.19 16:20:36.535092221	0000678	
66	0.000287	0.000191	0.000204	-6.539608E-5	T	29493	2017.09.19 16:20:36.545092221	0000678	
66	0.000286	0.000177	0.000199	-0.000103	T	29493	2017.09.19 16:20:36.555092221	0000678	
67	0.000265	0.000153	0.000200	-8.406497E-5	T	29495	2017.09.19 16:20:36.565135971	0000678	
67	0.000274	0.000172	0.000205	-6.024151E-5	T	29495	2017.09.19 16:20:36.575135971	0000678	
67	0.000276	0.000186	0.000200	-4.133560E-5	T	29495	2017.09.19 16:20:36.585135971	0000678	
67	0.000298	0.000205	0.000209	-5.553129E-5	T	29495	2017.09.19 16:20:36.595135971	0000678	
67	0.000300	0.000196	0.000218	-6.049512E-5	T	29495	2017.09.19 16:20:36.605135971	0000678	
67	0.000306	0.000215	0.000195	-9.855286E-5	T	29495	2017.09.19 16:20:36.615135971	0000678	
67	0.000299	0.000200	0.000209	-7.448977E-5	T	29495	2017.09.19 16:20:36.625135971	0000678	
67	0.000284	0.000191	0.000205	-4.539691E-5	T	29495	2017.09.19 16:20:36.635135971	0000678	
67	0.000291	0.000177	0.000210	-9.830140E-5	T	29495	2017.09.19 16:20:36.645135971	0000678	
67	0.000284	0.000186	0.000210	-4.537693E-5	T	29495	2017.09.19 16:20:36.655135971	0000678	
68	0.000283	0.000191	0.000200	-6.037554E-5	T	29494	2017.09.19 16:20:36.665179721	0000678	
68	0.000280	0.000200	0.000180	-7.936921E-5	T	29494	2017.09.19 16:20:36.675179721	0000678	
68	0.000309	0.000224	0.000209	-4.168666E-5	T	29494	2017.09.19 16:20:36.685179721	0000678	
68	0.000306	0.000210	0.000218	-4.160996E-5	T	29494	2017.09.19 16:20:36.695179721	0000678	
68	0.000308	0.000215	0.000204	-8.459080E-5	T	29494	2017.09.19 16:20:36.705179721	0000678	
68	0.000282	0.000186	0.000205	-5.535576E-5	T	29494	2017.09.19 16:20:36.715179721	0000678	
68	0.000273	0.000167	0.000200	-8.417902E-5	T	29494	2017.09.19 16:20:36.725179721	0000678	
68	0.000279	0.000181	0.000205	-5.531503E-5	T	29494	2017.09.19 16:20:36.735179721	0000678	
68	0.000313	0.000210	0.000213	-9.358704E-5	T	29494	2017.09.19 16:20:36.745179721	0000678	
68	0.000257	0.000163	0.000191	-5.511030E-5	T	29494	2017.09.19 16:20:36.755179721	0000678	
69	0.000280	0.000172	0.000205	-8.424050E-5	T	29502	2017.09.19 16:20:36.765223471	0000678	
69	0.000270	0.000172	0.000200	-6.022076E-5	T	29502	2017.09.19 16:20:36.775223471	0000678	
69	0.000288	0.000181	0.000214	-6.535197E-5	T	29502	2017.09.19 16:20:36.785223471	0000678	
69	0.000308	0.000192	0.000238	-4.153403E-5	T	29502	2017.09.19 16:20:36.795223471	0000678	
69	0.000302	0.000191	0.000218	-8.445338E-5	T	29502	2017.09.19 16:20:36.805223471	0000678	
69	0.000307	0.000215	0.000209	-6.561234E-5	T	29502	2017.09.19 16:20:36.815223471	0000678	
69	0.000285	0.000177	0.000210	-7.930219E-5	T	29502	2017.09.19 16:20:36.825223471	0000678	
69	0.000292	0.000200	0.000204	-6.046960E-5	T	29502	2017.09.19 16:20:36.835223471	0000678	
69	0.000280	0.000177	0.000210	-5.530320E-5	T	29502	2017.09.19 16:20:36.845223471	0000678	
69	0.000294	0.000177	0.000224	-6.936071E-5	T	29502	2017.09.19 16:20:36.855223471	0000678	
70	0.000297	0.000181	0.000224	-7.439309E-5	T	29502	2017.09.19 16:20:36.865267221	0000678	
70	0.000294	0.000196	0.000213	-5.047479E-5	T	29502	2017.09.19 16:20:36.875267221	0000678	
70	0.000307	0.000210	0.000209	-7.957102E-5	T	29502	2017.09.19 16:20:36.885267221	0000678	
70	0.000311	0.000210	0.000218	-6.960879E-5	T	29502	2017.09.19 16:20:36.895267221	0000678	
70	0.000295	0.000186	0.000219	-6.941328E-5	T	29502	2017.09.19 16:20:36.905267221	0000678	
70	0.000285	0.000181	0.000210	-6.533537E-5	T	29502	2017.09.19 16:20:36.915267221	0000678	
70	0.000294	0.000196	0.000204	-7.943622E-5	T	29502	2017.09.19 16:20:36.925267221	0000678	
70	0.000306	0.000210	0.000204	-8.854990E-5	T	29502	2017.09.19 16:20:36.935267221	0000678	
70	0.000285	0.000177	0.000210	-7.930219E-5	T	29502	2017.09.19 16:20:36.945267221	0000678	
70	0.000288	0.000181	0.000214	-6.535197E-5	T	29502	2017.09.19 16:20:36.955267221	0000678	
71	0.000291	0.000210	0.000190	-6.549276E-5	T	29496	2017.09.19 16:20:36.965310971	0000678	
71	0.000274	0.000177	0.000196	-7.424430E-5	T	29496	2017.09.19 16:20:36.975310971	0000678	
71	0.000309	0.000196	0.000218	-9.849353E-5	T	29496	2017.09.19 16:20:36.985310971	0000678	
71	0.000309	0.000200	0.000218	-8.852653E-5	T	29496	2017.09.19 16:20:36.995310971	0000678	
71	0.000278	0.000181	0.000205	-5.031524E-5	T	29496	2017.09.19 16:20:37.005310971	0000678	
71	0.000303	0.000196	0.000223	-6.051587E-5	T	29496	2017.09.19 16:20:37.015310971	0000678	
71	0.000275	0.000163	0.000214	-5.520575E-5	T	29496	2017.09.19 16:20:37.025310971	0000678	
71	0.000291	0.000196	0.000210	-4.545840E-5	T	29496	2017.09.19 16:20:37.035310971	0000678	
71	0.000269	0.000172	0.000205	-2.624293E-5	T	29496	2017.09.19 16:20:37.045310971	0000678	
71	0.000275	0.000153	0.000214	-7.912328E-5	T	29496	2017.09.19 16:20:37.055310971	0000678	
72	0.000298	0.000191	0.000209	-9.341566E-5	T	29500	2017.09.19 16:20:37.065354721	0000678	
72	0.000306	0.000205	0.000209	-8.852992E-5	T	29500	2017.09.19 16:20:37.075354721	0000678	
72	0.000310	0.000200	0.000228	-6.056920E-5	T	29500	2017.09.19 16:20:37.085354721	0000678	
72	0.000285	0.000196	0.000205	-3.143823E-5	T	29500	2017.09.19 16:20:37.095354721	0000678	
72	0.000281	0.000167	0.000219	-5.525909E-5	T	29500	2017.09.19 16:20:37.105354721	0000678	
72	0.000281	0.000167	0.000210	-8.422052E-5	T	29500	2017.09.19 16:20:37.115354721	0000678	
72	0.000303	0.000196	0.000223	-6.051587E-5	T	29500	2017.09.19 16:20:37.125354721	0000678	
72	0.000278	0.000172	0.000214	-4.127965E-5	T	29500	2017.09.19 16:20:37.135354721	0000678	
72	0.000305	0.000219	0.000204	-5.562459E-5	T	29500	2017.09.19 16:20:37.145354721	0000678	
72	0.000288	0.000163	0.000219	-9.322491E-5	T	29500	2017.09.19 16:20:37.155354721	0000678	
73	0.000296	0.000191	0.000213	-7.443305E-5	T	29489	2017.09.19 16:20:37.165398471	0000678	
73	0.000293	0.000186	0.000214	-7.439232E-5	T	29489	2017.09.19 16:20:37.175398471	0000678	
73	0.000307	0.000205	0.000218	-6.556823E-5	T	29489	2017.09.19 16:20:37.185398471	0000678	
73	0.000305	0.000196	0.000209	-0.000103	T	29489	2017.09.19 16:20:37.195398471	0000678	
73	0.000304	0.000205	0.000213	-6.954731E-5	T	29489	2017.09.19 16:20:37.205398471	0000678	
73	0.000295	0.000186	0.000224	-5.043482E-5	T	29489	2017.09.19 16:20:37.215398471	0000678	
73	0.000293	0.000191	0.000199	-9.837395E-5	T	29489	2017.09.19 16:20:37.225398471	0000678	
73	0.000274	0.000181	0.000196	-6.527726E-5	T	29489	2017.09.19 16:20:37.235398471	0000678	
73	0.000261	0.000158	0.000196	-6.908973E-5	T	29489	2017.09.19 16:20:37.245398471	0000678	
73	0.000323	0.000205	0.000242	-5.566825E-5	T	29489	2017.09.19 16:20:37.255398471	0000678	
74	0.000303	0.000205	0.000209	-7.953029E-5	T	29493	2017.09.19 16:20:37.265442221	0000678	
74	0.000305	0.000210	0.000218	-3.661017E-5	T	29493	2017.09.19 16:20:37.275442221	0000678	
74	0.000272	0.000181	0.000200	-3.629508E-5	T	29493	2017.09.19 16:20:37.285442221	0000678	
74	0.000303	0.000191	0.000223	-7.447455E-5	T	29493	2017.09.19 16:20:37.295442221	0000678	
74	0.000288	0.000177	0.000205	-9.828065E-5	T	29493	2017.09.19 16:20:37.305442221	0000678	
74	0.000306	0.000196	0.000213	-9.847278E-5	T	29493	2017.09.19 16:20:37.315442221	0000678	
74	0.000284	0.000186	0.000205	-6.535535E-5	T	29493	2017.09.19 16:20:37.325442221	0000678	
74	0.000281	0.000191	0.000200	-5.037595E-5	T	29493	2017.09.19 16:20:37.335442221	0000678	
74	0.000290	0.000205	0.000195	-6.547278E-5	T	29493	2017.09.19 16:20:37.345442221	0000678	
74	0.000295	0.000205	0.000199	-7.448900E-5	T	29493	2017.09.19 16:20:37.355442221	0000678	
75	0.000267	0.000144	0.000219	-5.007193E-5	T	29490	2017.09.19 16:20:37.365485971	0000678	
75	0.000285	0.000191	0.000205	-5.539650E-5	T	29490	2017.09.19 16:20:37.375485971	0000678	
75	0.000299	0.000186	0.000218	-8.441265E-5	T	29490	2017.09.19 16:20:37.385485971	0000678	
75	0.000298	0.000191	0.000224	-5.047556E-5	T	29490	2017.09.19 16:20:37.395485971	0000678	
75	0.000292	0.000181	0.000219	-6.937255E-5	T	29490	2017.09.19 16:20:37.405485971	0000678	
75	0.000285	0.000158	0.000224	-7.920552E-5	T	29490	2017.09.19 16:20:37.415485971	0000678	
75	0.000307	0.000181	0.000238	-6.945140E-5	T	29490	2017.09.19 16:20:37.425485971	0000678	
75	0.000278	0.000172	0.000214	-4.527948E-5	T	29490	2017.09.19 16:20:37.435485971	0000678	
75	0.000326	0.000234	0.000223	-4.182622E-5	T	29490	2017.09.19 16:20:37.445485971	0000678	
75	0.000286	0.000181	0.000214	-6.035217E-5	T	29490	2017.09.19 16:20:37.455485971	0000678	
76	0.000300	0.000205	0.000209	-6.553088E-5	T	29491	2017.09.19 16:20:37.465529721	0000678	
76	0.000307	0.000191	0.000213	-0.000112	T	29491	2017.09.19 16:20:37.475529721	0000678	
76	0.000307	0.000200	0.000213	-9.350557E-5	T	29491	2017.09.19 16:20:37.485529721	0000678	
76	0.000296	0.000196	0.000213	-6.047437E-5	T	29491	2017.09.19 16:20:37.495529721	0000678	
76	0.000257	0.000144	0.000200	-7.399208E-5	T	29491	2017.09.19 16:20:37.505529721	0000678	
76	0.000292	0.000191	0.000209	-6.941666E-5	T	29491	2017.09.19 16:20:37.515529721	0000678	
76	0.000308	0.000215	0.000209	-6.961217E-5	T	29491	2017.09.19 16:20:37.525529721	0000678	
76	0.000283	0.000200	0.000190	-6.041150E-5	T	29491	2017.09.19 16:20:37.535529721	0000678	
76	0.000306	0.000205	0.000218	-6.056844E-5	T	29491	2017.09.19 16:20:37.545529721	0000678	
76	0.000293	0.000210	0.000199	-4.553094E-5	T	29491	2017.09.19 16:20:37.555529721	0000678	
77	0.000285	0.000191	0.000199	-6.937516E-5	T	29494	2017.09.19 16:20:37.565573471	0000678	
77	0.000291	0.000205	0.000195	-6.947261E-5	T	29494	2017.09.19 16:20:37.575573471	0000678	
77	0.000287	0.000167	0.000205	-0.000112	T	29494	2017.09.19 16:20:37.585573471	0000678	
77	0.000300	0.000200	0.000209	-7.948956E-5	T	29494	2017.09.19 16:20:37.595573471	0000678	
77	0.000293	0.000200	0.000209	-4.549098E-5	T	29494	2017.09.19 16:20:37.605573471	0000678	
77	0.000281	0.000172	0.000214	-6.027886E-5	T	29494	2017.09.19 16:20:37.615573471	0000678	
77	0.000305	0.000205	0.000218	-5.556864E-5	T	29494	2017.09.19 16:20:37.625573471	0000678	
77	0.000292	0.000191	0.000204	-8.439528E-5	T	29494	2017.09.19 16:20:37.635573471	0000678	
77	0.000279	0.000172	0.000210	-6.526205E-5	T	29494	2017.09.19 16:20:37.645573471	0000678	
77	0.000338	0.000229	0.000237	-7.484221E-5	T	29494	2017.09.19 16:20:37.655573471	0000678	
78	0.000267	0.000153	0.000210	-6.010748E-5	T	29487	2017.09.19 16:20:37.665617221	0000678	
78	0.000302	0.000219	0.000204	-3.662539E-5	T	29487	2017.09.19 16:20:37.675617221	0000678	
78	0.000283	0.000186	0.000205	-6.035556E-5	T	29487	2017.09.19 16:20:37.685617221	0000678	
78	0.000292	0.000200	0.000210	-3.149157E-5	T	29487	2017.09.19 16:20:37.695617221	0000678	
78	0.000287	0.000191	0.000210	-4.541766E-5	T	29487	2017.09.19 16:20:37.705617221	0000678	
78	0.000283	0.000186	0.000210	-4.137710E-5	T	29487	2017.09.19 16:20:37.715617221	0000678	
78	0.000285	0.000186	0.000210	-5.037672E-5	T	29487	2017.09.19 16:20:37.725617221	0000678	
78	0.000287	0.000196	0.000199	-6.541606E-5	T	29487	2017.09.19 16:20:37.735617221	0000678	
78	0.000305	0.000210	0.000213	-5.558863E-5	T	29487	2017.09.19 16:20:37.745617221	0000678	
78	0.000285	0.000200	0.000195	-5.543246E-5	T	29487	2017.09.19 16:20:37.755617221	0000678	
79	0.000300	0.000191	0.000223	-6.047514E-5	T	29487	2017.09.19 16:20:37.765660971	0000678	
79	0.000294	0.000196	0.000209	-6.545756E-5	T	29487	2017.09.19 16:20:37.775660971	0000678	
79	0.000304	0.000200	0.000223	-4.554908E-5	T	29487	2017.09.19 16:20:37.785660971	0000678	
79	0.000295	0.000200	0.000213	-3.650796E-5	T	29487	2017.09.19 16:20:37.795660971	0000678	
79	0.000307	0.000210	0.000218	-4.560979E-5	T	29487	2017.09.19 16:20:37.805660971	0000678	
79	0.000283	0.000177	0.000210	-6.930261E-5	T	29487	2017.09.19 16:20:37.815660971	0000678	
79	0.000315	0.000215	0.000218	-7.464931E-5	T	29487	2017.09.19 16:20:37.825660971	0000678	
79	0.000274	0.000167	0.000205	-7.420019E-5	T	29487	2017.09.19 16:20:37.835660971	0000678	
79	0.000298	0.000200	0.000213	-5.550716E-5	T	29487	2017.09.19 16:20:37.845660971	0000678	
79	0.000338	0.000234	0.000228	-8.484518E-5	T	29487	2017.09.19 16:20:37.855660971	0000678	
80	0.000286	0.000172	0.000219	-6.529940E-5	T	29487	2017.09.19 16:20:37.865704721	0000678	
80	0.000286	0.000205	0.000190	-6.045223E-5	T	29487	2017.09.19 16:20:37.875704721	0000678	
80	0.000276	0.000172	0.000214	-3.128007E-5	T	29487	2017.09.19 16:20:37.885704721	0000678	
80	0.000306	0.000205	0.000209	-8.852992E-5	T	29487	2017.09.19 16:20:37.895704721	0000678	
80	0.000273	0.000181	0.000200	-4.129487E-5	T	29487	2017.09.19 16:20:37.905704721	0000678	
80	0.000293	0.000186	0.000219	-6.041366E-5	T	29487	2017.09.19 16:20:37.915704721	0000678	
80	0.000286	0.000167	0.000219	-7.925808E-5	T	29487	2017.09.19 16:20:37.925704721	0000678	
80	0.000299	0.000196	0.000213	-7.447378E-5	T	29487	2017.09.19 16:20:37.935704721	0000678	
80	0.000298	0.000181	0.000224	-7.939288E-5	T	29487	2017.09.19 16:20:37.945704721	0000678	
80	0.000296	0.000196	0.000204	-8.843585E-5	T	29487	2017.09.19 16:20:37.955704721	0000678	
81	0.000276	0.000186	0.000200	-4.133560E-5	T	29492	2017.09.19 16:20:37.965748471	0000678	
81	0.000275	0.000172	0.000210	-4.126305E-5	T	29492	2017.09.19 16:20:37.975748471	0000678	
81	0.000303	0.000186	0.000223	-8.443340E-5	T	29492	2017.09.19 16:20:37.985748471	0000678	
81	0.000273	0.000181	0.000200	-4.129487E-5	T	29492	2017.09.19 16:20:37.995748471	0000678	
81	0.000306	0.000210	0.000204	-8.854990E-5	T	29492	2017.09.19 16:20:38.005748471	0000678	
81	0.000304	0.000210	0.000213	-5.058884E-5	T	29492	2017.09.19 16:20:38.015748471	0000678	
81	0.000292	0.000186	0.000219	-5.541386E-5	T	29492	2017.09.19 16:20:38.025748471	0000678	
81	0.000314	0.000210	0.000228	-4.565129E-5	T	29492	2017.09.19 16:20:38.035748471	0000678	
81	0.000292	0.000200	0.000204	-6.046960E-5	T	29492	2017.09.19 16:20:38.045748471	0000678	
81	0.000267	0.000177	0.000191	-6.022414E-5	T	29492	2017.09.19 16:20:38.055748471	0000678	
82	0.000305	0.000210	0.000213	-6.058842E-5	T	29487	2017.09.19 16:20:38.065792221	0000678	
82	0.000311	0.000215	0.000204	-9.359042E-5	T	29487	2017.09.19 16:20:38.075792221	0000678	
82	0.000281	0.000172	0.000210	-7.426167E-5	T	29487	2017.09.19 16:20:38.085792221	0000678	
82	0.000312	0.000205	0.000223	-7.458860E-5	T	29487	2017.09.19 16:20:38.095792221	0000678	
82	0.000289	0.000186	0.000210	-6.937593E-5	T	29487	2017.09.19 16:20:38.105792221	0000678	
82	0.000310	0.000196	0.000213	-0.000112	T	29487	2017.09.19 16:20:38.115792221	0000678	
82	0.000304	0.000200	0.000209	-9.348897E-5	T	29487	2017.09.19 16:20:38.125792221	0000678	
82	0.000293	0.000186	0.000224	-3.643541E-5	T	29487	2017.09.19 16:20:38.135792221	0000678	
82	0.000306	0.000200	0.000223	-6.054845E-5	T	29487	2017.09.19 16:20:38.145792221	0000678	
82	0.000291	0.000186	0.000214	-6.539270E-5	T	29487	2017.09.19 16:20:38.155792221	0000678	
83	0.000296	0.000196	0.000213	-6.047437E-5	T	29490	2017.09.19 16:20:38.165835971	0000678	
83	0.000292	0.000186	0.000214	-6.939253E-5	T	29490	2017.09.19 16:20:38.175835971	0000678	
83	0.000290	0.000191	0.000210	-6.041704E-5	T	29490	2017.09.19 16:20:38.185835971	0000678	
83	0.000309	0.000219	0.000209	-6.064513E-5	T	29490	2017.09.19 16:20:38.195835971	0000678	
83	0.000283	0.000200	0.000195	-4.143305E-5	T	29490	2017.09.19 16:20:38.205835971	0000678	
83	0.000306	0.000196	0.000223	-7.451528E-5	T	29490	2017.09.19 16:20:38.215835971	0000678	
83	0.000272	0.000172	0.000196	-7.920336E-5	T	29490	2017.09.19 16:20:38.225835971	0000678	
83	0.000287	0.000181	0.000210	-7.433499E-5	T	29490	2017.09.19 16:20:38.235835971	0000678	
83	0.000305	0.000205	0.000209	-8.453008E-5	T	29490	2017.09.19 16:20:38.245835971	0000678	
83	0.000261	0.000163	0.000200	-3.614844E-5	T	29490	2017.09.19 16:20:38.255835971	0000678	
84	0.000284	0.000186	0.000214	-2.239449E-5	T	29493	2017.09.19 16:20:38.265879721	0000678	
84	0.000302	0.000210	0.000213	-3.658942E-5	T	29493	2017.09.19 16:20:38.275879721	0000678	
84	0.000298	0.000186	0.000218	-7.941286E-5	T	29493	2017.09.19 16:20:38.285879721	0000678	
84	0.000306	0.000205	0.000218	-6.056844E-5	T	29493	2017.09.19 16:20:38.295879721	0000678	
84	0.000304	0.000191	0.000213	-0.000103	T	29493	2017.09.19 16:20:38.305879721	0000678	
84	0.000288	0.000196	0.000199	-6.941589E-5	T	29493	2017.09.19 16:20:38.315879721	0000678	
84	0.000296	0.000191	0.000213	-7.443305E-5	T	29493	2017.09.19 16:20:38.325879721	0000678	
84	0.000289	0.000191	0.000204	-7.439570E-5	T	29493	2017.09.19 16:20:38.335879721	0000678	
84	0.000282	0.000177	0.000210	-6.530278E-5	T	29493	2017.09.19 16:20:38.345879721	0000678	
84	0.000281	0.000191	0.000200	-5.037595E-5	T	29493	2017.09.19 16:20:38.355879721	0000678	
85	0.000305	0.000205	0.000213	-7.454710E-5	T	29488	2017.09.19 16:20:38.365923471	0000678	
85	0.000263	0.000153	0.000205	-6.008673E-5	T	29488	2017.09.19 16:20:38.375923471	0000678	
85	0.000263	0.000163	0.000200	-5.014786E-5	T	29488	2017.09.19 16:20:38.385923471	0000678	
85	0.000280	0.000177	0.000205	-7.428165E-5	T	29488	2017.09.19 16:20:38.395923471	0000678	
85	0.000300	0.000205	0.000213	-5.054810E-5	T	29488	2017.09.19 16:20:38.405923471	0000678	
85	0.000295	0.000177	0.000229	-5.538205E-5	T	29488	2017.09.19 16:20:38.415923471	0000678	
85	0.000293	0.000196	0.000214	-4.547500E-5	T	29488	2017.09.19 16:20:38.425923471	0000678	
85	0.000313	0.000210	0.000223	-6.062992E-5	T	29488	2017.09.19 16:20:38.435923471	0000678	
85	0.000263	0.000163	0.000196	-6.513063E-5	T	29488	2017.09.19 16:20:38.445923471	0000678	
85	0.000300	0.000210	0.000209	-4.157261E-5	T	29488	2017.09.19 16:20:38.455923471	0000678	
86	0.000285	0.000167	0.000214	-8.823696E-5	T	29493	2017.09.19 16:20:38.465967221	0000678	
86	0.000284	0.000172	0.000219	-5.529982E-5	T	29493	2017.09.19 16:20:38.475967221	0000678	
86	0.000293	0.000191	0.000209	-7.441645E-5	T	29493	2017.09.19 16:20:38.485967221	0000678	
86	0.000296	0.000205	0.000204	-6.051034E-5	T	29493	2017.09.19 16:20:38.495967221	0000678	
86	0.000279	0.000172	0.000205	-7.924071E-5	T	29493	2017.09.19 16:20:38.505967221	0000678	
86	0.000306	0.000205	0.000218	-6.056844E-5	T	29493	2017.09.19 16:20:38.515967221	0000678	
86	0.000282	0.000186	0.000205	-5.535576E-5	T	29493	2017.09.19 16:20:38.525967221	0000678	
86	0.000294	0.000200	0.000204	-6.946923E-5	T	29493	2017.09.19 16:20:38.535967221	0000678	
86	0.000283	0.000177	0.000205	-8.428124E-5	T	29493	2017.09.19 16:20:38.545967221	0000678	
86	0.000282	0.000172	0.000214	-6.527865E-5	T	29493	2017.09.19 16:20:38.555967221	0000678	
87	0.000280	0.000196	0.000190	-6.037892E-5	T	29492	2017.09.19 16:20:38.566010971	0000678	
87	0.000300	0.000205	0.000209	-6.553088E-5	T	29492	2017.09.19 16:20:38.576010971	0000678	
87	0.000291	0.000191	0.000199	-9.337416E-5	T	29492	2017.09.19 16:20:38.586010971	0000678	
87	0.000301	0.000186	0.000223	-7.943361E-5	T	29492	2017.09.19 16:20:38.596010971	0000678	
87	0.000308	0.000215	0.000204	-8.459080E-5	T	29492	2017.09.19 16:20:38.606010971	0000678	
87	0.000278	0.000177	0.000210	-4.130378E-5	T	29492	2017.09.19 16:20:38.616010971	0000678	
87	0.000286	0.000167	0.000224	-6.027963E-5	T	29492	2017.09.19 16:20:38.626010971	0000678	
87	0.000298	0.000196	0.000209	-7.945697E-5	T	29492	2017.09.19 16:20:38.636010971	0000678	
87	0.000272	0.000172	0.000205	-5.024192E-5	T	29492	2017.09.19 16:20:38.646010971	0000678	
87	0.000306	0.000200	0.000223	-6.054845E-5	T	29492	2017.09.19 16:20:38.656010971	0000678	
88	0.000313	0.000210	0.000213	-9.358704E-5	T	29479	2017.09.19 16:20:38.666054721	0000678	
88	0.000301	0.000205	0.000213	-5.554789E-5	T	29479	2017.09.19 16:20:38.676054721	0000678	
88	0.000301	0.000191	0.000223	-6.547493E-5	T	29479	2017.09.19 16:20:38.686054721	0000678	
88	0.000286	0.000186	0.000210	-5.537651E-5	T	29479	2017.09.19 16:20:38.696054721	0000678	
88	0.000316	0.000219	0.000223	-4.170403E-5	T	29479	2017.09.19 16:20:38.706054721	0000678	
88	0.000281	0.000186	0.000200	-6.933443E-5	T	29479	2017.09.19 16:20:38.716054721	0000678	
88	0.000324	0.000219	0.000223	-8.470223E-5	T	29479	2017.09.19 16:20:38.726054721	0000678	
88	0.000280	0.000186	0.000205	-4.535618E-5	T	29479	2017.09.19 16:20:38.736054721	0000678	
88	0.000302	0.000210	0.000213	-3.658942E-5	T	29479	2017.09.19 16:20:38.746054721	0000678	
88	0.000306	0.000215	0.000213	-4.162994E-5	T	29479	2017.09.19 16:20:38.756054721	0000678	
89	0.000300	0.000186	0.000229	-5.545537E-5	T	29497	2017.09.19 16:20:38.766098471	0000678	
89	0.000284	0.000177	0.000210	-7.430240E-5	T	29497	2017.09.19 16:20:38.776098471	0000678	
89	0.000273	0.000167	0.000210	-5.022194E-5	T	29497	2017.09.19 16:20:38.786098471	0000678	
89	0.000299	0.000219	0.000195	-6.058703E-5	T	29497	2017.09.19 16:20:38.796098471	0000678	
89	0.000283	0.000186	0.000205	-6.035556E-5	T	29497	2017.09.19 16:20:38.806098471	0000678	
89	0.000285	0.000196	0.000199	-5.541648E-5	T	29497	2017.09.19 16:20:38.816098471	0000678	
89	0.000287	0.000177	0.000214	-7.431900E-5	T	29497	2017.09.19 16:20:38.826098471	0000678	
89	0.000284	0.000177	0.000205	-8.828107E-5	T	29497	2017.09.19 16:20:38.836098471	0000678	
89	0.000311	0.000205	0.000228	-4.561056E-5	T	29497	2017.09.19 16:20:38.846098471	0000678	
89	0.000296	0.000200	0.000209	-6.049035E-5	T	29497	2017.09.19 16:20:38.856098471	0000678	
90	0.000305	0.000195	0.000199	-0.000122	T	29507	2017.09.19 16:20:38.866142221	0000678	
90	0.000314	0.000210	0.000223	-6.562971E-5	T	29507	2017.09.19 16:20:38.876142221	0000678	
90	0.000314	0.000219	0.000218	-5.568269E-5	T	29507	2017.09.19 16:20:38.886142221	0000678	
90	0.000278	0.000172	0.000214	-4.527948E-5	T	29507	2017.09.19 16:20:38.896142221	0000678	
90	0.000301	0.000200	0.000213	-6.950658E-5	T	29507	2017.09.19 16:20:38.906142221	0000678	
90	0.000286	0.000186	0.000205	-7.435497E-5	T	29507	2017.09.19 16:20:38.916142221	0000678	
90	0.000295	0.000200	0.000213	-3.650796E-5	T	29507	2017.09.19 16:20:38.926142221	0000678	
90	0.000308	0.000215	0.000209	-6.961217E-5	T	29507	2017.09.19 16:20:38.936142221	0000678	
90	0.000292	0.000181	0.000219	-6.937255E-5	T	29507	2017.09.19 16:20:38.946142221	0000678	
90	0.000299	0.000200	0.000209	-7.448977E-5	T	29507	2017.09.19 16:20:38.956142221	0000678	
91	0.000291	0.000186	0.000214	-6.539270E-5	T	29500	2017.09.19 16:20:38.966185971	0000678	
91	0.000302	0.000191	0.000229	-5.049631E-5	T	29500	2017.09.19 16:20:38.976185971	0000678	
91	0.000288	0.000177	0.000224	-4.136188E-5	T	29500	2017.09.19 16:20:38.986185971	0000678	
91	0.000290	0.000196	0.000204	-6.043702E-5	T	29500	2017.09.19 16:20:38.996185971	0000678	
91	0.000316	0.000215	0.000223	-6.067065E-5	T	29500	2017.09.19 16:20:39.006185971	0000678	
91	0.000279	0.000172	0.000210	-6.526205E-5	T	29500	2017.09.19 16:20:39.016185971	0000678	
91	0.000295	0.000196	0.000209	-6.945739E-5	T	29500	2017.09.19 16:20:39.026185971	0000678	
91	0.000285	0.000186	0.000214	-3.139412E-5	T	29500	2017.09.19 16:20:39.036185971	0000678	
91	0.000280	0.000167	0.000214	-6.923775E-5	T	29500	2017.09.19 16:20:39.046185971	0000678	
91	0.000299	0.000200	0.000218	-3.652871E-5	T	29500	2017.09.19 16:20:39.056185971	0000678	
92	0.000281	0.000172	0.000205	-8.824034E-5	T	29497	2017.09.19 16:20:39.066229721	0000678	
92	0.000265	0.000177	0.000191	-5.022456E-5	T	29497	2017.09.19 16:20:39.076229721	0000678	
92	0.000293	0.000191	0.000209	-7.441645E-5	T	29497	2017.09.19 16:20:39.086229721	0000678	
92	0.000287	0.000186	0.000210	-6.037631E-5	T	29497	2017.09.19 16:20:39.096229721	0000678	
92	0.000299	0.000210	0.000204	-6.055107E-5	T	29497	2017.09.19 16:20:39.106229721	0000678	
92	0.000283	0.000181	0.000210	-6.033557E-5	T	29497	2017.09.19 16:20:39.116229721	0000678	
92	0.000302	0.000191	0.000229	-5.049631E-5	T	29497	2017.09.19 16:20:39.126229721	0000678	
92	0.000261	0.000163	0.000200	-4.114823E-5	T	29497	2017.09.19 16:20:39.136229721	0000678	
92	0.000294	0.000200	0.000204	-6.946923E-5	T	29497	2017.09.19 16:20:39.146229721	0000678	
92	0.000300	0.000210	0.000209	-4.157261E-5	T	29497	2017.09.19 16:20:39.156229721	0000678	
93	0.000297	0.000181	0.000224	-7.439309E-5	T	29487	2017.09.19 16:20:39.166273471	0000678	
93	0.000313	0.000219	0.000209	-7.964434E-5	T	29487	2017.09.19 16:20:39.176273471	0000678	
93	0.000288	0.000196	0.000210	-1.245977E-5	T	29487	2017.09.19 16:20:39.186273471	0000678	
93	0.000281	0.000186	0.000205	-5.035597E-5	T	29487	2017.09.19 16:20:39.196273471	0000678	
93	0.000291	0.000177	0.000224	-5.536130E-5	T	29487	2017.09.19 16:20:39.206273471	0000678	
93	0.000299	0.000181	0.000229	-6.541422E-5	T	29487	2017.09.19 16:20:39.216273471	0000678	
93	0.000256	0.000148	0.000205	-4.104679E-5	T	29487	2017.09.19 16:20:39.226273471	0000678	
93	0.000292	0.000186	0.000214	-6.939253E-5	T	29487	2017.09.19 16:20:39.236273471	0000678	
93	0.000287	0.000191	0.000204	-6.539608E-5	T	29487	2017.09.19 16:20:39.246273471	0000678	
93	0.000298	0.000186	0.000224	-6.543420E-5	T	29487	2017.09.19 16:20:39.256273471	0000678	
94	0.000301	0.000205	0.000213	-5.554789E-5	T	29486	2017.09.19 16:20:39.266317221	0000678	
94	0.000275	0.000172	0.000210	-4.126305E-5	T	29486	2017.09.19 16:20:39.276317221	0000678	
94	0.000290	0.000177	0.000219	-6.933996E-5	T	29486	2017.09.19 16:20:39.286317221	0000678	
94	0.000288	0.000200	0.000204	-3.647061E-5	T	29486	2017.09.19 16:20:39.296317221	0000678	
94	0.000293	0.000191	0.000209	-7.441645E-5	T	29486	2017.09.19 16:20:39.306317221	0000678	
94	0.000318	0.000219	0.000223	-5.570344E-5	T	29486	2017.09.19 16:20:39.316317221	0000678	
94	0.000303	0.000200	0.000218	-6.552750E-5	T	29486	2017.09.19 16:20:39.326317221	0000678	
94	0.000320	0.000215	0.000228	-6.069140E-5	T	29486	2017.09.19 16:20:39.336317221	0000678	
94	0.000269	0.000167	0.000200	-6.917965E-5	T	29486	2017.09.19 16:20:39.346317221	0000678	
94	0.000310	0.000200	0.000228	-6.056920E-5	T	29486	2017.09.19 16:20:39.356317221	0000678	
95	0.000303	0.000205	0.000213	-6.554748E-5	T	29485	2017.09.19 16:20:39.366360971	0000678	
95	0.000324	0.000234	0.000213	-6.978355E-5	T	29485	2017.09.19 16:20:39.376360971	0000678	
95	0.000308	0.000196	0.000228	-6.553641E-5	T	29485	2017.09.19 16:20:39.386360971	0000678	
95	0.000299	0.000205	0.000209	-6.053109E-5	T	29485	2017.09.19 16:20:39.396360971	0000678	
95	0.000288	0.000177	0.000214	-7.931879E-5	T	29485	2017.09.19 16:20:39.406360971	0000678	
95	0.000275	0.000177	0.000200	-6.526128E-5	T	29485	2017.09.19 16:20:39.416360971	0000678	
95	0.000290	0.000181	0.000219	-6.037292E-5	T	29485	2017.09.19 16:20:39.426360971	0000678	
95	0.000275	0.000181	0.000205	-3.131604E-5	T	29485	2017.09.19 16:20:39.436360971	0000678	
95	0.000298	0.000196	0.000213	-6.947399E-5	T	29485	2017.09.19 16:20:39.446360971	0000678	
95	0.000312	0.000215	0.000213	-7.462856E-5	T	29485	2017.09.19 16:20:39.456360971	0000678	
96	0.000307	0.000215	0.000204	-7.959100E-5	T	29496	2017.09.19 16:20:39.466404721	0000678	
96	0.000291	0.000191	0.000209	-6.541683E-5	T	29496	2017.09.19 16:20:39.476404721	0000678	
96	0.000279	0.000177	0.000210	-5.030341E-5	T	29496	2017.09.19 16:20:39.486404721	0000678	
96	0.000287	0.000186	0.000210	-6.037631E-5	T	29496	2017.09.19 16:20:39.496404721	0000678	
96	0.000288	0.000196	0.000204	-5.043744E-5	T	29496	2017.09.19 16:20:39.506404721	0000678	
96	0.000304	0.000210	0.000209	-6.557161E-5	T	29496	2017.09.19 16:20:39.516404721	0000678	
96	0.000310	0.000196	0.000223	-8.851470E-5	T	29496	2017.09.19 16:20:39.526404721	0000678	
96	0.000268	0.000153	0.000205	-7.908593E-5	T	29496	2017.09.19 16:20:39.536404721	0000678	
96	0.000313	0.000224	0.000209	-6.568566E-5	T	29496	2017.09.19 16:20:39.546404721	0000678	
96	0.000310	0.000219	0.000218	-1.768428E-5	T	29496	2017.09.19 16:20:39.556404721	0000678	
97	0.000293	0.000200	0.000204	-6.546939E-5	T	29485	2017.09.19 16:20:39.566448471	0000678	
97	0.000295	0.000172	0.000233	-5.535792E-5	T	29485	2017.09.19 16:20:39.576448471	0000678	
97	0.000286	0.000196	0.000205	-3.643802E-5	T	29485	2017.09.19 16:20:39.586448471	0000678	
97	0.000280	0.000153	0.000219	-8.414382E-5	T	29485	2017.09.19 16:20:39.596448471	0000678	
97	0.000312	0.000210	0.000213	-8.858725E-5	T	29485	2017.09.19 16:20:39.606448471	0000678	
97	0.000283	0.000153	0.000229	-6.518612E-5	T	29485	2017.09.19 16:20:39.616448471	0000678	
97	0.000282	0.000191	0.000200	-5.537575E-5	T	29485	2017.09.19 16:20:39.626448471	0000678	
97	0.000306	0.000215	0.000209	-6.061255E-5	T	29485	2017.09.19 16:20:39.636448471	0000678	
97	0.000291	0.000205	0.000199	-5.548979E-5	T	29485	2017.09.19 16:20:39.646448471	0000678	
97	0.000286	0.000200	0.000199	-4.544948E-5	T	29485	2017.09.19 16:20:39.656448471	0000678	
98	0.000284	0.000205	0.000185	-6.543128E-5	T	29492	2017.09.19 16:20:39.666492221	0000678	
98	0.000283	0.000177	0.000205	-8.428124E-5	T	29492	2017.09.19 16:20:39.676492221	0000678	
98	0.000272	0.000158	0.000210	-6.914783E-5	T	29492	2017.09.19 16:20:39.686492221	0000678	
98	0.000299	0.000200	0.000209	-7.448977E-5	T	29492	2017.09.19 16:20:39.696492221	0000678	
98	0.000306	0.000219	0.000204	-6.562417E-5	T	29492	2017.09.19 16:20:39.706492221	0000678	
98	0.000266	0.000148	0.000219	-3.110531E-5	T	29492	2017.09.19 16:20:39.716492221	0000678	
98	0.000288	0.000191	0.000210	-5.041746E-5	T	29492	2017.09.19 16:20:39.726492221	0000678	
98	0.000302	0.000210	0.000209	-5.557203E-5	T	29492	2017.09.19 16:20:39.736492221	0000678	
98	0.000298	0.000196	0.000209	-7.945697E-5	T	29492	2017.09.19 16:20:39.746492221	0000678	
98	0.000298	0.000200	0.000209	-6.948998E-5	T	29492	2017.09.19 16:20:39.756492221	0000678	
99	0.000306	0.000177	0.000238	-7.441860E-5	T	29498	2017.09.19 16:20:39.766535971	0000678	
99	0.000260	0.000163	0.000196	-5.013126E-5	T	29498	2017.09.19 16:20:39.776535971	0000678	
99	0.000308	0.000210	0.000213	-7.458783E-5	T	29498	2017.09.19 16:20:39.786535971	0000678	
99	0.000296	0.000205	0.000204	-6.051034E-5	T	29498	2017.09.19 16:20:39.796535971	0000678	
99	0.000292	0.000191	0.000214	-5.543385E-5	T	29498	2017.09.19 16:20:39.806535971	0000678	
99	0.000290	0.000186	0.000210	-7.437572E-5	T	29498	2017.09.19 16:20:39.816535971	0000678	
99	0.000299	0.000205	0.000199	-8.848841E-5	T	29498	2017.09.19 16:20:39.826535971	0000678	
99	0.000281	0.000172	0.000210	-7.426167E-5	T	29498	2017.09.19 16:20:39.836535971	0000678	
99	0.000271	0.000163	0.000214	-3.120675E-5	T	29498	2017.09.19 16:20:39.846535971	0000678	
99	0.000304	0.000187	0.000238	-3.649351E-5	T	29498	2017.09.19 16:20:39.856535971	0000678	
100	0.000300	0.000205	0.000209	-6.553088E-5	T	29489	2017.09.19 16:20:39.866579721	0000678	
100	0.000292	0.000167	0.000224	-8.427862E-5	T	29489	2017.09.19 16:20:39.876579721	0000678	
100	0.000296	0.000205	0.000204	-6.051034E-5	T	29489	2017.09.19 16:20:39.886579721	0000678	
100	0.000308	0.000234	0.000195	-4.570985E-5	T	29489	2017.09.19 16:20:39.896579721	0000678	
100	0.000285	0.000191	0.000199	-6.937516E-5	T	29489	2017.09.19 16:20:39.906579721	0000678	
100	0.000281	0.000181	0.000205	-6.531461E-5	T	29489	2017.09.19 16:20:39.916579721	0000678	
100	0.000301	0.000196	0.000209	-9.345639E-5	T	29489	2017.09.19 16:20:39.926579721	0000678	
100	0.000289	0.000196	0.000204	-5.543723E-5	T	29489	2017.09.19 16:20:39.936579721	0000678	
100	0.000283	0.000191	0.000200	-6.037554E-5	T	29489	2017.09.19 16:20:39.946579721	0000678	
100	0.000292	0.000181	0.000209	-9.333419E-5	T	29489	2017.09.19 16:20:39.956579721	0000678	
101	0.000282	0.000191	0.000205	-3.139750E-5	T	29485	2017.09.19 16:20:39.966623471	0000678	
101	0.000319	0.000205	0.000228	-8.860877E-5	T	29485	2017.09.19 16:20:39.976623471	0000678	
101	0.000282	0.000172	0.000214	-6.527865E-5	T	29485	2017.09.19 16:20:39.986623471	0000678	
101	0.000307	0.000200	0.000223	-6.554825E-5	T	29485	2017.09.19 16:20:39.996623471	0000678	
101	0.000266	0.000153	0.000214	-3.612508E-5	T	29485	2017.09.19 16:20:40.006623471	0000678	
101	0.000283	0.000186	0.000205	-6.035556E-5	T	29485	2017.09.19 16:20:40.016623471	0000678	
101	0.000298	0.000196	0.000213	-6.947399E-5	T	29485	2017.09.19 16:20:40.026623471	0000678	
101	0.000285	0.000177	0.000219	-4.534097E-5	T	29485	2017.09.19 16:20:40.036623471	0000678	
101	0.000262	0.000153	0.000200	-7.406539E-5	T	29485	2017.09.19 16:20:40.046623471	0000678	
101	0.000326	0.000215	0.000228	-8.869023E-5	T	29485	2017.09.19 16:20:40.056623471	0000678	
102	0.000299	0.000181	0.000218	-9.337155E-5	T	29501	2017.09.19 16:20:40.066667221	0000678	
102	0.000283	0.000181	0.000205	-7.431424E-5	T	29501	2017.09.19 16:20:40.076667221	0000678	
102	0.000290	0.000191	0.000214	-4.543426E-5	T	29501	2017.09.19 16:20:40.086667221	0000678	
102	0.000320	0.000205	0.000237	-6.064729E-5	T	29501	2017.09.19 16:20:40.096667221	0000678	
102	0.000287	0.000158	0.000229	-6.922668E-5	T	29501	2017.09.19 16:20:40.106667221	0000678	
102	0.000293	0.000186	0.000219	-6.041366E-5	T	29501	2017.09.19 16:20:40.116667221	0000678	
102	0.000306	0.000205	0.000213	-7.954689E-5	T	29501	2017.09.19 16:20:40.126667221	0000678	
102	0.000291	0.000196	0.000204	-6.543681E-5	T	29501	2017.09.19 16:20:40.136667221	0000678	
102	0.000298	0.000200	0.000213	-5.550716E-5	T	29501	2017.09.19 16:20:40.146667221	0000678	
102	0.000302	0.000186	0.000233	-4.547238E-5	T	29501	2017.09.19 16:20:40.156667221	0000678	
103	0.000278	0.000181	0.000205	-5.031524E-5	T	29487	2017.09.19 16:20:40.166710971	0000678	
103	0.000269	0.000167	0.000205	-5.020119E-5	T	29487	2017.09.19 16:20:40.176710971	0000678	
103	0.000289	0.000205	0.000195	-6.047298E-5	T	29487	2017.09.19 16:20:40.186710971	0000678	
103	0.000297	0.000181	0.000224	-7.439309E-5	T	29487	2017.09.19 16:20:40.196710971	0000678	
103	0.000303	0.000191	0.000223	-7.447455E-5	T	29487	2017.09.19 16:20:40.206710971	0000678	
103	0.000300	0.000191	0.000229	-3.149710E-5	T	29487	2017.09.19 16:20:40.216710971	0000678	
103	0.000283	0.000191	0.000190	-8.833702E-5	T	29487	2017.09.19 16:20:40.226710971	0000678	
103	0.000285	0.000177	0.000210	-7.930219E-5	T	29487	2017.09.19 16:20:40.236710971	0000678	
103	0.000307	0.000191	0.000223	-8.847397E-5	T	29487	2017.09.19 16:20:40.246710971	0000678	
103	0.000313	0.000215	0.000218	-6.564969E-5	T	29487	2017.09.19 16:20:40.256710971	0000678	
104	0.000269	0.000172	0.000200	-5.522097E-5	T	29482	2017.09.19 16:20:40.266754721	0000678	
104	0.000274	0.000196	0.000185	-5.035859E-5	T	29482	2017.09.19 16:20:40.276754721	0000678	
104	0.000297	0.000163	0.000229	-9.826620E-5	T	29482	2017.09.19 16:20:40.286754721	0000678	
104	0.000284	0.000153	0.000224	-8.416457E-5	T	29482	2017.09.19 16:20:40.296754721	0000678	
104	0.000269	0.000158	0.000214	-3.616581E-5	T	29482	2017.09.19 16:20:40.306754721	0000678	
104	0.000295	0.000177	0.000219	-8.833917E-5	T	29482	2017.09.19 16:20:40.316754721	0000678	
104	0.000283	0.000196	0.000190	-7.437833E-5	T	29482	2017.09.19 16:20:40.326754721	0000678	
104	0.000282	0.000191	0.000205	-3.139750E-5	T	29482	2017.09.19 16:20:40.336754721	0000678	
104	0.000292	0.000191	0.000209	-6.941666E-5	T	29482	2017.09.19 16:20:40.346754721	0000678	
104	0.000277	0.000167	0.000219	-2.226046E-5	T	29482	2017.09.19 16:20:40.356754721	0000678	
105	0.000293	0.000177	0.000224	-6.536088E-5	T	29480	2017.09.19 16:20:40.366798471	0000678	
105	0.000308	0.000210	0.000213	-7.458783E-5	T	29480	2017.09.19 16:20:40.376798471	0000678	
105	0.000266	0.000196	0.000177	-3.132203E-5	T	29480	2017.09.19 16:20:40.386798471	0000678	
105	0.000293	0.000191	0.000219	-4.145518E-5	T	29480	2017.09.19 16:20:40.396798471	0000678	
105	0.000275	0.000172	0.000210	-4.526288E-5	T	29480	2017.09.19 16:20:40.406798471	0000678	
105	0.000271	0.000158	0.000214	-5.016523E-5	T	29480	2017.09.19 16:20:40.416798471	0000678	
105	0.000297	0.000191	0.000219	-6.045439E-5	T	29480	2017.09.19 16:20:40.426798471	0000678	
105	0.000289	0.000186	0.000204	-8.435455E-5	T	29480	2017.09.19 16:20:40.436798471	0000678	
105	0.000311	0.000186	0.000232	-8.847059E-5	T	29480	2017.09.19 16:20:40.446798471	0000678	
105	0.000312	0.000224	0.000213	-3.670347E-5	T	29480	2017.09.19 16:20:40.456798471	0000678	
106	0.000305	0.000205	0.000218	-5.556864E-5	T	29490	2017.09.19 16:20:40.466842221	0000678	
106	0.000294	0.000191	0.000219	-4.545501E-5	T	29490	2017.09.19 16:20:40.476842221	0000678	
106	0.000321	0.000219	0.000228	-5.572419E-5	T	29490	2017.09.19 16:20:40.486842221	0000678	
106	0.000302	0.000196	0.000223	-5.051629E-5	T	29490	2017.09.19 16:20:40.496842221	0000678	
106	0.000299	0.000200	0.000218	-4.152850E-5	T	29490	2017.09.19 16:20:40.506842221	0000678	
106	0.000296	0.000210	0.000199	-6.053032E-5	T	29490	2017.09.19 16:20:40.516842221	0000678	
106	0.000283	0.000167	0.000219	-6.525867E-5	T	29490	2017.09.19 16:20:40.526842221	0000678	
106	0.000290	0.000196	0.000210	-4.145856E-5	T	29490	2017.09.19 16:20:40.536842221	0000678	
106	0.000309	0.000205	0.000218	-7.456785E-5	T	29490	2017.09.19 16:20:40.546842221	0000678	
106	0.000273	0.000167	0.000214	-3.123934E-5	T	29490	2017.09.19 16:20:40.556842221	0000678	
107	0.000282	0.000177	0.000210	-6.530278E-5	T	29483	2017.09.19 16:20:40.566885971	0000678	
107	0.000297	0.000200	0.000209	-6.549014E-5	T	29483	2017.09.19 16:20:40.576885971	0000678	
107	0.000303	0.000196	0.000218	-7.449453E-5	T	29483	2017.09.19 16:20:40.586885971	0000678	
107	0.000285	0.000167	0.000219	-7.425829E-5	T	29483	2017.09.19 16:20:40.596885971	0000678	
107	0.000311	0.000205	0.000218	-8.456743E-5	T	29483	2017.09.19 16:20:40.606885971	0000678	
107	0.000302	0.000196	0.000213	-8.447337E-5	T	29483	2017.09.19 16:20:40.616885971	0000678	
107	0.000298	0.000191	0.000218	-6.945401E-5	T	29483	2017.09.19 16:20:40.626885971	0000678	
107	0.000266	0.000172	0.000196	-5.520437E-5	T	29483	2017.09.19 16:20:40.636885971	0000678	
107	0.000311	0.000210	0.000218	-6.960879E-5	T	29483	2017.09.19 16:20:40.646885971	0000678	
107	0.000306	0.000200	0.000223	-6.054845E-5	T	29483	2017.09.19 16:20:40.656885971	0000678	
108	0.000285	0.000181	0.000210	-6.933520E-5	T	29497	2017.09.19 16:20:40.666929721	0000678	
108	0.000287	0.000200	0.000199	-5.044927E-5	T	29497	2017.09.19 16:20:40.676929721	0000678	
108	0.000320	0.000224	0.000223	-5.074438E-5	T	29497	2017.09.19 16:20:40.686929721	0000678	
108	0.000306	0.000191	0.000223	-8.447413E-5	T	29497	2017.09.19 16:20:40.696929721	0000678	
108	0.000304	0.000200	0.000223	-4.554908E-5	T	29497	2017.09.19 16:20:40.706929721	0000678	
108	0.000302	0.000186	0.000229	-6.545495E-5	T	29497	2017.09.19 16:20:40.716929721	0000678	
108	0.000297	0.000200	0.000204	-7.946881E-5	T	29497	2017.09.19 16:20:40.726929721	0000678	
108	0.000290	0.000186	0.000210	-7.437572E-5	T	29497	2017.09.19 16:20:40.736929721	0000678	
108	0.000290	0.000181	0.000219	-6.037292E-5	T	29497	2017.09.19 16:20:40.746929721	0000678	
108	0.000308	0.000215	0.000218	-3.165111E-5	T	29497	2017.09.19 16:20:40.756929721	0000678	
