Block	B	Bx	By	Bz	Units	Temperature	Timestamp	Serial No.	Comment
0	0.000188	0.000102	-0.000157	-5.199601E-6	T	29335	2017.09.19 13:57:42.538146382	0000678	
0	0.000206	0.000106	-0.000171	-4.317250E-5	T	29335	2017.09.19 13:57:42.548146382	0000678	
0	0.000200	7.748246E-5	-0.000176	-5.292323E-5	T	29335	2017.09.19 13:57:42.558146382	0000678	
0	0.000205	8.644055E-5	-0.000176	-5.799634E-5	T	29335	2017.09.19 13:57:42.568146382	0000678	
0	0.000222	0.000121	-0.000182	-4.325319E-5	T	29335	2017.09.19 13:57:42.578146382	0000678	
0	0.000205	9.649879E-5	-0.000171	-5.809855E-5	T	29335	2017.09.19 13:57:42.588146382	0000678	
0	0.000211	0.000105	-0.000172	-6.317166E-5	T	29335	2017.09.19 13:57:42.598146382	0000678	
0	0.000185	9.701717E-5	-0.000157	-1.515845E-5	T	29335	2017.09.19 13:57:42.608146382	0000678	
0	0.000233	0.000140	-0.000182	-3.940814E-5	T	29335	2017.09.19 13:57:42.618146382	0000678	
0	0.000229	0.000129	-0.000163	-9.640314E-5	T	29335	2017.09.19 13:57:42.628146382	0000678	
1	0.000198	0.000102	-0.000162	-4.817705E-5	T	29331	2017.09.19 13:57:42.738233882	0000678	
1	0.000205	9.659521E-5	-0.000176	-3.907860E-5	T	29331	2017.09.19 13:57:42.748233882	0000678	
1	0.000199	9.162223E-5	-0.000171	-4.305845E-5	T	29331	2017.09.19 13:57:42.758233882	0000678	
1	0.000209	0.000111	-0.000172	-4.321323E-5	T	29331	2017.09.19 13:57:42.768233882	0000678	
1	0.000227	0.000105	-0.000191	-6.309281E-5	T	29331	2017.09.19 13:57:42.778233882	0000678	
1	0.000221	0.000121	-0.000182	-3.925336E-5	T	29331	2017.09.19 13:57:42.788233882	0000678	
1	0.000212	0.000130	-0.000158	-5.842548E-5	T	29331	2017.09.19 13:57:42.798233882	0000678	
1	0.000213	0.000121	-0.000168	-5.331087E-5	T	29331	2017.09.19 13:57:42.808233882	0000678	
1	0.000205	0.000121	-0.000144	-8.240926E-5	T	29331	2017.09.19 13:57:42.818233882	0000678	
1	0.000215	9.633925E-5	-0.000181	-6.305684E-5	T	29331	2017.09.19 13:57:42.828233882	0000678	
2	0.000218	0.000115	-0.000172	-6.725296E-5	T	29304	2017.09.19 13:57:42.938321382	0000678	
2	0.000212	9.642120E-5	-0.000181	-5.305726E-5	T	29304	2017.09.19 13:57:42.948321382	0000678	
2	0.000217	0.000101	-0.000181	-6.309758E-5	T	29304	2017.09.19 13:57:42.958321382	0000678	
2	0.000198	9.666914E-5	-0.000167	-4.311578E-5	T	29304	2017.09.19 13:57:42.968321382	0000678	
2	0.000215	0.000121	-0.000168	-5.831067E-5	T	29304	2017.09.19 13:57:42.978321382	0000678	
2	0.000205	8.650419E-5	-0.000181	-4.297622E-5	T	29304	2017.09.19 13:57:42.988321382	0000678	
2	0.000212	8.630751E-5	-0.000181	-6.697521E-5	T	29304	2017.09.19 13:57:42.998321382	0000678	
2	0.000213	0.000106	-0.000181	-3.413137E-5	T	29304	2017.09.19 13:57:43.008321382	0000678	
2	0.000208	9.150367E-5	-0.000181	-4.301695E-5	T	29304	2017.09.19 13:57:43.018321382	0000678	
2	0.000225	9.621423E-5	-0.000195	-5.799895E-5	T	29304	2017.09.19 13:57:43.028321382	0000678	
3	0.000211	0.000116	-0.000172	-4.325396E-5	T	29333	2017.09.19 13:57:43.138408882	0000678	
3	0.000217	0.000130	-0.000172	-2.436880E-5	T	29333	2017.09.19 13:57:43.148408882	0000678	
3	0.000225	0.000110	-0.000186	-6.315429E-5	T	29333	2017.09.19 13:57:43.158408882	0000678	
3	0.000204	9.663619E-5	-0.000176	-3.407881E-5	T	29333	2017.09.19 13:57:43.168408882	0000678	
3	0.000224	0.000125	-0.000182	-4.328578E-5	T	29333	2017.09.19 13:57:43.178408882	0000678	
3	0.000214	0.000105	-0.000177	-5.815112E-5	T	29333	2017.09.19 13:57:43.188408882	0000678	
3	0.000213	0.000125	-0.000168	-4.334388E-5	T	29333	2017.09.19 13:57:43.198408882	0000678	
3	0.000206	9.656243E-5	-0.000176	-4.307843E-5	T	29333	2017.09.19 13:57:43.208408882	0000678	
3	0.000202	0.000121	-0.000158	-3.935296E-5	T	29333	2017.09.19 13:57:43.218408882	0000678	
3	0.000205	0.000111	-0.000168	-4.322983E-5	T	29333	2017.09.19 13:57:43.228408882	0000678	
4	0.000211	9.639853E-5	-0.000176	-6.307759E-5	T	29319	2017.09.19 13:57:43.338496382	0000678	
4	0.000229	0.000110	-0.000196	-4.311363E-5	T	29319	2017.09.19 13:57:43.348496382	0000678	
4	0.000223	0.000115	-0.000177	-7.223200E-5	T	29319	2017.09.19 13:57:43.358496382	0000678	
4	0.000224	0.000144	-0.000163	-5.351899E-5	T	29319	2017.09.19 13:57:43.368496382	0000678	
4	0.000219	0.000110	-0.000182	-5.317131E-5	T	29319	2017.09.19 13:57:43.378496382	0000678	
4	0.000194	0.000111	-0.000157	-2.027229E-5	T	29319	2017.09.19 13:57:43.388496382	0000678	
4	0.000206	0.000102	-0.000176	-2.911975E-5	T	29319	2017.09.19 13:57:43.398496382	0000678	
4	0.000180	8.714113E-5	-0.000157	-7.761526E-8	T	29319	2017.09.19 13:57:43.408496382	0000678	
4	0.000227	0.000105	-0.000200	-2.005311E-5	T	29319	2017.09.19 13:57:43.418496382	0000678	
4	0.000199	0.000111	-0.000153	-6.329124E-5	T	29319	2017.09.19 13:57:43.428496382	0000678	
5	0.000227	0.000120	-0.000182	-6.325236E-5	T	29325	2017.09.19 13:57:43.538583882	0000678	
5	0.000201	0.000116	-0.000162	-2.429211E-5	T	29325	2017.09.19 13:57:43.548583882	0000678	
5	0.000212	0.000116	-0.000172	-4.825375E-5	T	29325	2017.09.19 13:57:43.558583882	0000678	
5	0.000205	0.000111	-0.000168	-4.322983E-5	T	29325	2017.09.19 13:57:43.568583882	0000678	
5	0.000226	0.000120	-0.000177	-7.227273E-5	T	29325	2017.09.19 13:57:43.578583882	0000678	
5	0.000211	0.000106	-0.000176	-4.815154E-5	T	29325	2017.09.19 13:57:43.588583882	0000678	
5	0.000225	0.000135	-0.000172	-5.340832E-5	T	29325	2017.09.19 13:57:43.598583882	0000678	
5	0.000227	0.000130	-0.000182	-3.932668E-5	T	29325	2017.09.19 13:57:43.608583882	0000678	
5	0.000211	0.000121	-0.000168	-4.331129E-5	T	29325	2017.09.19 13:57:43.618583882	0000678	
5	0.000203	0.000102	-0.000167	-5.315609E-5	T	29325	2017.09.19 13:57:43.628583882	0000678	
6	0.000207	0.000102	-0.000176	-3.911933E-5	T	29324	2017.09.19 13:57:43.738671382	0000678	
6	0.000190	8.274435E-5	-0.000167	-3.400211E-5	T	29324	2017.09.19 13:57:43.748671382	0000678	
6	0.000215	9.124335E-5	-0.000176	-8.203607E-5	T	29324	2017.09.19 13:57:43.758671382	0000678	
6	0.000205	0.000111	-0.000168	-4.322983E-5	T	29324	2017.09.19 13:57:43.768671382	0000678	
6	0.000236	0.000124	-0.000196	-4.322768E-5	T	29324	2017.09.19 13:57:43.778671382	0000678	
6	0.000200	0.000106	-0.000167	-2.918968E-5	T	29324	2017.09.19 13:57:43.788671382	0000678	
6	0.000221	0.000102	-0.000195	-2.004127E-5	T	29324	2017.09.19 13:57:43.798671382	0000678	
6	0.000202	0.000116	-0.000163	-2.929190E-5	T	29324	2017.09.19 13:57:43.808671382	0000678	
6	0.000202	9.658074E-5	-0.000171	-4.809897E-5	T	29324	2017.09.19 13:57:43.818671382	0000678	
6	0.000208	0.000130	-0.000158	-3.942628E-5	T	29324	2017.09.19 13:57:43.828671382	0000678	
7	0.000210	0.000125	-0.000163	-4.336463E-5	T	29323	2017.09.19 13:57:43.938758882	0000678	
7	0.000211	0.000111	-0.000172	-5.321281E-5	T	29323	2017.09.19 13:57:43.948758882	0000678	
7	0.000178	7.272656E-5	-0.000152	-5.798189E-5	T	29323	2017.09.19 13:57:43.958758882	0000678	
7	0.000197	0.000106	-0.000157	-5.323018E-5	T	29323	2017.09.19 13:57:43.968758882	0000678	
7	0.000216	9.630647E-5	-0.000181	-6.705668E-5	T	29323	2017.09.19 13:57:43.978758882	0000678	
7	0.000198	9.153226E-5	-0.000162	-6.709480E-5	T	29323	2017.09.19 13:57:43.988758882	0000678	
7	0.000225	0.000115	-0.000186	-5.319544E-5	T	29323	2017.09.19 13:57:43.998758882	0000678	
7	0.000214	0.000105	-0.000177	-5.815112E-5	T	29323	2017.09.19 13:57:44.008758882	0000678	
7	0.000205	0.000111	-0.000171	-1.521440E-5	T	29323	2017.09.19 13:57:44.018758882	0000678	
7	0.000219	0.000149	-0.000153	-4.860143E-5	T	29323	2017.09.19 13:57:44.028758882	0000678	
8	0.000214	0.000125	-0.000168	-4.834367E-5	T	29320	2017.09.19 13:57:44.138846382	0000678	
8	0.000216	0.000121	-0.000177	-2.927453E-5	T	29320	2017.09.19 13:57:44.148846382	0000678	
8	0.000224	0.000101	-0.000195	-4.304031E-5	T	29320	2017.09.19 13:57:44.158846382	0000678	
8	0.000210	8.627037E-5	-0.000171	-8.601592E-5	T	29320	2017.09.19 13:57:44.168846382	0000678	
8	0.000215	8.237139E-5	-0.000195	-3.888570E-5	T	29320	2017.09.19 13:57:44.178846382	0000678	
8	0.000217	0.000102	-0.000190	-2.406186E-5	T	29320	2017.09.19 13:57:44.188846382	0000678	
8	0.000194	6.856534E-5	-0.000176	-4.285033E-5	T	29320	2017.09.19 13:57:44.198846382	0000678	
8	0.000219	9.635547E-5	-0.000190	-4.802012E-5	T	29320	2017.09.19 13:57:44.208846382	0000678	
8	0.000213	9.674883E-5	-0.000190	-2.212702E-8	T	29320	2017.09.19 13:57:44.218846382	0000678	
8	0.000217	0.000116	-0.000181	-2.421325E-5	T	29320	2017.09.19 13:57:44.228846382	0000678	
9	0.000197	7.750076E-5	-0.000171	-5.794377E-5	T	29319	2017.09.19 13:57:44.338933882	0000678	
9	0.000212	8.226695E-5	-0.000181	-7.194242E-5	T	29319	2017.09.19 13:57:44.348933882	0000678	
9	0.000203	8.642607E-5	-0.000171	-6.701671E-5	T	29319	2017.09.19 13:57:44.358933882	0000678	
9	0.000204	8.261288E-5	-0.000185	-2.392783E-5	T	29319	2017.09.19 13:57:44.368933882	0000678	
9	0.000193	7.779387E-5	-0.000176	-1.492482E-5	T	29319	2017.09.19 13:57:44.378933882	0000678	
9	0.000204	7.742317E-5	-0.000181	-5.290248E-5	T	29319	2017.09.19 13:57:44.388933882	0000678	
9	0.000187	4.950367E-5	-0.000171	-5.771568E-5	T	29319	2017.09.19 13:57:44.398933882	0000678	
9	0.000183	7.286012E-5	-0.000167	-1.992123E-5	T	29319	2017.09.19 13:57:44.408933882	0000678	
9	0.000218	0.000125	-0.000177	-2.430732E-5	T	29319	2017.09.19 13:57:44.418933882	0000678	
9	0.000197	0.000116	-0.000149	-5.834878E-5	T	29319	2017.09.19 13:57:44.428933882	0000678	
10	0.000210	0.000125	-0.000168	-2.434467E-5	T	29324	2017.09.19 13:57:44.539021382	0000678	
10	0.000222	0.000135	-0.000172	-3.940891E-5	T	29324	2017.09.19 13:57:44.549021382	0000678	
10	0.000206	0.000106	-0.000168	-5.818847E-5	T	29324	2017.09.19 13:57:44.559021382	0000678	
10	0.000197	0.000102	-0.000167	-2.015747E-5	T	29324	2017.09.19 13:57:44.569021382	0000678	
10	0.000216	0.000110	-0.000177	-5.819185E-5	T	29324	2017.09.19 13:57:44.579021382	0000678	
10	0.000201	5.847414E-5	-0.000190	-3.371115E-5	T	29324	2017.09.19 13:57:44.589021382	0000678	
10	0.000207	0.000106	-0.000176	-2.415254E-5	T	29324	2017.09.19 13:57:44.599021382	0000678	
10	0.000192	0.000106	-0.000152	-4.825114E-5	T	29324	2017.09.19 13:57:44.609021382	0000678	
10	0.000212	9.636575E-5	-0.000176	-6.707743E-5	T	29324	2017.09.19 13:57:44.619021382	0000678	
10	0.000193	7.783484E-5	-0.000176	-9.925030E-6	T	29324	2017.09.19 13:57:44.629021382	0000678	
11	0.000218	0.000120	-0.000172	-5.829407E-5	T	29320	2017.09.19 13:57:44.739108882	0000678	
11	0.000203	8.238551E-5	-0.000171	-7.198392E-5	T	29320	2017.09.19 13:57:44.749108882	0000678	
11	0.000208	9.150367E-5	-0.000181	-4.301695E-5	T	29320	2017.09.19 13:57:44.759108882	0000678	
11	0.000199	9.662817E-5	-0.000167	-4.811557E-5	T	29320	2017.09.19 13:57:44.769108882	0000678	
11	0.000216	0.000105	-0.000172	-7.717108E-5	T	29320	2017.09.19 13:57:44.779108882	0000678	
11	0.000200	0.000102	-0.000171	-1.514108E-5	T	29320	2017.09.19 13:57:44.789108882	0000678	
11	0.000199	0.000125	-0.000153	-2.940671E-5	T	29320	2017.09.19 13:57:44.799108882	0000678	
11	0.000214	0.000110	-0.000172	-6.321239E-5	T	29320	2017.09.19 13:57:44.809108882	0000678	
11	0.000229	0.000120	-0.000191	-3.921601E-5	T	29320	2017.09.19 13:57:44.819108882	0000678	
11	0.000227	0.000124	-0.000186	-3.926934E-5	T	29320	2017.09.19 13:57:44.829108882	0000678	
12	0.000194	7.259771E-5	-0.000176	-3.888309E-5	T	29311	2017.09.19 13:57:44.939196382	0000678	
12	0.000186	8.276266E-5	-0.000162	-3.902265E-5	T	29311	2017.09.19 13:57:44.949196382	0000678	
12	0.000206	0.000102	-0.000176	-3.411954E-5	T	29311	2017.09.19 13:57:44.959196382	0000678	
12	0.000188	0.000102	-0.000152	-4.321876E-5	T	29311	2017.09.19 13:57:44.969196382	0000678	
12	0.000215	9.633925E-5	-0.000181	-6.305684E-5	T	29311	2017.09.19 13:57:44.979196382	0000678	
12	0.000218	0.000116	-0.000182	-3.421284E-5	T	29311	2017.09.19 13:57:44.989196382	0000678	
12	0.000217	8.627455E-5	-0.000190	-5.793824E-5	T	29311	2017.09.19 13:57:44.999196382	0000678	
12	0.000204	8.250460E-5	-0.000181	-4.294363E-5	T	29311	2017.09.19 13:57:45.009196382	0000678	
12	0.000220	0.000125	-0.000177	-4.330653E-5	T	29311	2017.09.19 13:57:45.019196382	0000678	
12	0.000210	0.000116	-0.000172	-3.425434E-5	T	29311	2017.09.19 13:57:45.029196382	0000678	
13	0.000202	8.652250E-5	-0.000176	-4.799676E-5	T	29321	2017.09.19 13:57:45.139283882	0000678	
13	0.000219	9.118406E-5	-0.000181	-8.201532E-5	T	29321	2017.09.19 13:57:45.149283882	0000678	
13	0.000199	8.654080E-5	-0.000171	-5.301730E-5	T	29321	2017.09.19 13:57:45.159283882	0000678	
13	0.000212	0.000125	-0.000163	-5.336421E-5	T	29321	2017.09.19 13:57:45.169283882	0000678	
13	0.000220	0.000105	-0.000190	-3.409402E-5	T	29321	2017.09.19 13:57:45.179283882	0000678	
13	0.000227	0.000105	-0.000191	-6.309281E-5	T	29321	2017.09.19 13:57:45.189283882	0000678	
13	0.000225	0.000105	-0.000195	-3.907306E-5	T	29321	2017.09.19 13:57:45.199283882	0000678	
13	0.000214	9.641475E-5	-0.000185	-4.804087E-5	T	29321	2017.09.19 13:57:45.209283882	0000678	
13	0.000217	0.000102	-0.000190	-2.006202E-5	T	29321	2017.09.19 13:57:45.219283882	0000678	
13	0.000202	0.000106	-0.000163	-5.820922E-5	T	29321	2017.09.19 13:57:45.229283882	0000678	
14	0.000201	7.231925E-5	-0.000167	-8.591847E-5	T	29306	2017.09.19 13:57:45.339371382	0000678	
14	0.000216	0.000130	-0.000172	-2.036897E-5	T	29306	2017.09.19 13:57:45.349371382	0000678	
14	0.000214	0.000130	-0.000168	-2.938519E-5	T	29306	2017.09.19 13:57:45.359371382	0000678	
14	0.000192	7.258323E-5	-0.000171	-4.790346E-5	T	29306	2017.09.19 13:57:45.369371382	0000678	
14	0.000219	0.000110	-0.000177	-6.719148E-5	T	29306	2017.09.19 13:57:45.379371382	0000678	
14	0.000224	0.000101	-0.000195	-4.304031E-5	T	29306	2017.09.19 13:57:45.389371382	0000678	
14	0.000198	6.346560E-5	-0.000181	-4.778864E-5	T	29306	2017.09.19 13:57:45.399371382	0000678	
14	0.000237	0.000134	-0.000191	-3.933006E-5	T	29306	2017.09.19 13:57:45.409371382	0000678	
14	0.000223	9.629618E-5	-0.000195	-4.799937E-5	T	29306	2017.09.19 13:57:45.419371382	0000678	
14	0.000175	4.990348E-5	-0.000167	-1.473407E-5	T	29306	2017.09.19 13:57:45.429371382	0000678	
15	0.000198	9.158771E-5	-0.000167	-5.307463E-5	T	29314	2017.09.19 13:57:45.539458882	0000678	
15	0.000231	0.000139	-0.000172	-6.744847E-5	T	29314	2017.09.19 13:57:45.549458882	0000678	
15	0.000208	9.642504E-5	-0.000171	-6.709818E-5	T	29314	2017.09.19 13:57:45.559458882	0000678	
15	0.000210	0.000116	-0.000168	-5.327014E-5	T	29314	2017.09.19 13:57:45.569458882	0000678	
15	0.000239	0.000120	-0.000186	-9.123459E-5	T	29314	2017.09.19 13:57:45.579458882	0000678	
15	0.000216	0.000101	-0.000185	-4.308181E-5	T	29314	2017.09.19 13:57:45.589458882	0000678	
15	0.000207	9.645782E-5	-0.000171	-6.309834E-5	T	29314	2017.09.19 13:57:45.599458882	0000678	
15	0.000219	0.000101	-0.000185	-5.808118E-5	T	29314	2017.09.19 13:57:45.609458882	0000678	
15	0.000221	0.000116	-0.000186	-3.419624E-5	T	29314	2017.09.19 13:57:45.619458882	0000678	
15	0.000217	9.633280E-5	-0.000185	-5.804045E-5	T	29314	2017.09.19 13:57:45.629458882	0000678	
16	0.000232	0.000124	-0.000186	-6.326834E-5	T	29321	2017.09.19 13:57:45.739546382	0000678	
16	0.000236	0.000110	-0.000191	-8.613258E-5	T	29321	2017.09.19 13:57:45.749546382	0000678	
16	0.000201	9.662172E-5	-0.000171	-4.309918E-5	T	29321	2017.09.19 13:57:45.759546382	0000678	
16	0.000214	0.000130	-0.000168	-2.938519E-5	T	29321	2017.09.19 13:57:45.769546382	0000678	
16	0.000211	0.000111	-0.000176	-3.419285E-5	T	29321	2017.09.19 13:57:45.779546382	0000678	
16	0.000213	0.000125	-0.000168	-4.334388E-5	T	29321	2017.09.19 13:57:45.789546382	0000678	
16	0.000247	0.000148	-0.000186	-6.746369E-5	T	29321	2017.09.19 13:57:45.799546382	0000678	
16	0.000200	9.658719E-5	-0.000167	-5.311536E-5	T	29321	2017.09.19 13:57:45.809546382	0000678	
16	0.000215	0.000116	-0.000177	-3.923338E-5	T	29321	2017.09.19 13:57:45.819546382	0000678	
16	0.000215	0.000121	-0.000168	-5.831067E-5	T	29321	2017.09.19 13:57:45.829546382	0000678	
17	0.000200	8.649983E-5	-0.000171	-5.801709E-5	T	29328	2017.09.19 13:57:45.939633882	0000678	
17	0.000243	0.000139	-0.000196	-3.435025E-5	T	29328	2017.09.19 13:57:45.949633882	0000678	
17	0.000224	0.000105	-0.000186	-6.711339E-5	T	29328	2017.09.19 13:57:45.959633882	0000678	
17	0.000211	9.639853E-5	-0.000176	-6.307759E-5	T	29328	2017.09.19 13:57:45.969633882	0000678	
17	0.000222	0.000115	-0.000182	-5.321204E-5	T	29328	2017.09.19 13:57:45.979633882	0000678	
17	0.000217	0.000111	-0.000182	-4.317173E-5	T	29328	2017.09.19 13:57:45.989633882	0000678	
17	0.000187	7.778585E-5	-0.000167	-2.896159E-5	T	29328	2017.09.19 13:57:45.999633882	0000678	
17	0.000242	0.000149	-0.000191	-4.457351E-7	T	29328	2017.09.19 13:57:46.009633882	0000678	
17	0.000200	8.659625E-5	-0.000176	-3.899713E-5	T	29328	2017.09.19 13:57:46.019633882	0000678	
17	0.000212	9.642120E-5	-0.000181	-5.305726E-5	T	29328	2017.09.19 13:57:46.029633882	0000678	
18	0.000215	0.000110	-0.000177	-5.319206E-5	T	29324	2017.09.19 13:57:46.139721382	0000678	
18	0.000196	0.000102	-0.000162	-4.317726E-5	T	29324	2017.09.19 13:57:46.149721382	0000678	
18	0.000216	0.000101	-0.000181	-5.809778E-5	T	29324	2017.09.19 13:57:46.159721382	0000678	
18	0.000221	8.211926E-5	-0.000190	-7.690486E-5	T	29324	2017.09.19 13:57:46.169721382	0000678	
18	0.000203	9.667716E-5	-0.000176	-2.907902E-5	T	29324	2017.09.19 13:57:46.179721382	0000678	
18	0.000188	9.686146E-5	-0.000157	-3.415766E-5	T	29324	2017.09.19 13:57:46.189721382	0000678	
18	0.000221	0.000115	-0.000177	-6.723221E-5	T	29324	2017.09.19 13:57:46.199721382	0000678	
18	0.000222	8.627891E-5	-0.000200	-4.289737E-5	T	29324	2017.09.19 13:57:46.209721382	0000678	
18	0.000222	9.623254E-5	-0.000190	-6.301949E-5	T	29324	2017.09.19 13:57:46.219721382	0000678	
18	0.000203	9.156295E-5	-0.000176	-4.303770E-5	T	29324	2017.09.19 13:57:46.229721382	0000678	
19	0.000235	0.000129	-0.000177	-8.634546E-5	T	29318	2017.09.19 13:57:46.339808882	0000678	
19	0.000226	0.000140	-0.000172	-4.344947E-5	T	29318	2017.09.19 13:57:46.349808882	0000678	
19	0.000203	9.149931E-5	-0.000171	-5.805782E-5	T	29318	2017.09.19 13:57:46.359808882	0000678	
19	0.000226	0.000110	-0.000191	-5.313396E-5	T	29318	2017.09.19 13:57:46.369808882	0000678	
19	0.000208	0.000106	-0.000176	-2.915233E-5	T	29318	2017.09.19 13:57:46.379808882	0000678	
19	0.000193	0.000102	-0.000162	-2.417806E-5	T	29318	2017.09.19 13:57:46.389808882	0000678	
19	0.000233	0.000140	-0.000182	-3.940814E-5	T	29318	2017.09.19 13:57:46.399808882	0000678	
19	0.000213	0.000144	-0.000149	-4.857730E-5	T	29318	2017.09.19 13:57:46.409808882	0000678	
19	0.000193	0.000111	-0.000157	-1.527250E-5	T	29318	2017.09.19 13:57:46.419808882	0000678	
19	0.000219	0.000125	-0.000177	-3.430690E-5	T	29318	2017.09.19 13:57:46.429808882	0000678	
20	0.000218	0.000115	-0.000177	-5.323279E-5	T	29322	2017.09.19 13:57:46.539896382	0000678	
20	0.000207	0.000101	-0.000167	-6.715551E-5	T	29322	2017.09.19 13:57:46.549896382	0000678	
20	0.000199	7.244200E-5	-0.000176	-5.788229E-5	T	29322	2017.09.19 13:57:46.559896382	0000678	
20	0.000222	0.000121	-0.000182	-4.325319E-5	T	29322	2017.09.19 13:57:46.569896382	0000678	
20	0.000214	7.733913E-5	-0.000195	-4.284480E-5	T	29322	2017.09.19 13:57:46.579896382	0000678	
20	0.000214	0.000116	-0.000172	-5.325354E-5	T	29322	2017.09.19 13:57:46.589896382	0000678	
20	0.000208	0.000116	-0.000171	-2.025492E-5	T	29322	2017.09.19 13:57:46.599896382	0000678	
20	0.000224	0.000124	-0.000163	-9.136262E-5	T	29322	2017.09.19 13:57:46.609896382	0000678	
20	0.000218	0.000105	-0.000177	-7.215054E-5	T	29322	2017.09.19 13:57:46.619896382	0000678	
20	0.000200	0.000106	-0.000158	-6.322976E-5	T	29322	2017.09.19 13:57:46.629896382	0000678	
21	0.000212	9.636575E-5	-0.000176	-6.707743E-5	T	29311	2017.09.19 13:57:46.739983882	0000678	
21	0.000205	0.000125	-0.000158	-3.938555E-5	T	29311	2017.09.19 13:57:46.749983882	0000678	
21	0.000204	0.000102	-0.000171	-4.313991E-5	T	29311	2017.09.19 13:57:46.759983882	0000678	
21	0.000207	9.144003E-5	-0.000176	-5.803707E-5	T	29311	2017.09.19 13:57:46.769983882	0000678	
21	0.000208	9.642504E-5	-0.000171	-6.709818E-5	T	29311	2017.09.19 13:57:46.779983882	0000678	
21	0.000207	7.751314E-5	-0.000190	-2.886614E-5	T	29311	2017.09.19 13:57:46.789983882	0000678	
21	0.000225	0.000111	-0.000195	-1.011501E-5	T	29311	2017.09.19 13:57:46.799983882	0000678	
21	0.000208	8.648954E-5	-0.000185	-3.895978E-5	T	29311	2017.09.19 13:57:46.809983882	0000678	
21	0.000199	9.656452E-5	-0.000162	-6.313570E-5	T	29311	2017.09.19 13:57:46.819983882	0000678	
21	0.000207	8.238168E-5	-0.000181	-5.794301E-5	T	29311	2017.09.19 13:57:46.829983882	0000678	
22	0.000191	9.684315E-5	-0.000162	-2.913712E-5	T	29322	2017.09.19 13:57:46.940071382	0000678	
22	0.000212	0.000101	-0.000172	-7.213870E-5	T	29322	2017.09.19 13:57:46.950071382	0000678	
22	0.000219	0.000115	-0.000177	-5.823258E-5	T	29322	2017.09.19 13:57:46.960071382	0000678	
22	0.000182	7.294207E-5	-0.000167	-9.921649E-6	T	29322	2017.09.19 13:57:46.970071382	0000678	
22	0.000204	9.663619E-5	-0.000176	-3.407881E-5	T	29322	2017.09.19 13:57:46.980071382	0000678	
22	0.000221	0.000124	-0.000168	-7.234267E-5	T	29322	2017.09.19 13:57:46.990071382	0000678	
22	0.000232	0.000154	-0.000168	-4.358012E-5	T	29322	2017.09.19 13:57:47.000071382	0000678	
22	0.000224	0.000135	-0.000172	-4.840853E-5	T	29322	2017.09.19 13:57:47.010071382	0000678	
22	0.000191	7.262421E-5	-0.000171	-4.290367E-5	T	29322	2017.09.19 13:57:47.020071382	0000678	
22	0.000205	0.000116	-0.000167	-2.027152E-5	T	29322	2017.09.19 13:57:47.030071382	0000678	
23	0.000220	0.000105	-0.000185	-5.311398E-5	T	29325	2017.09.19 13:57:47.140158882	0000678	
23	0.000217	0.000116	-0.000182	-2.921305E-5	T	29325	2017.09.19 13:57:47.150158882	0000678	
23	0.000215	0.000125	-0.000163	-6.336379E-5	T	29325	2017.09.19 13:57:47.160158882	0000678	
23	0.000213	9.648850E-5	-0.000185	-3.904125E-5	T	29325	2017.09.19 13:57:47.170158882	0000678	
23	0.000205	0.000102	-0.000171	-4.813970E-5	T	29325	2017.09.19 13:57:47.180158882	0000678	
23	0.000235	0.000139	-0.000182	-5.340755E-5	T	29325	2017.09.19 13:57:47.190158882	0000678	
23	0.000209	0.000101	-0.000171	-6.313908E-5	T	29325	2017.09.19 13:57:47.200158882	0000678	
23	0.000208	0.000102	-0.000181	-1.509958E-5	T	29325	2017.09.19 13:57:47.210158882	0000678	
23	0.000216	0.000121	-0.000168	-6.331046E-5	T	29325	2017.09.19 13:57:47.220158882	0000678	
23	0.000218	0.000121	-0.000177	-4.327394E-5	T	29325	2017.09.19 13:57:47.230158882	0000678	
24	0.000197	8.654726E-5	-0.000167	-5.803369E-5	T	29329	2017.09.19 13:57:47.340246382	0000678	
24	0.000202	9.654622E-5	-0.000167	-5.811515E-5	T	29329	2017.09.19 13:57:47.350246382	0000678	
24	0.000204	0.000102	-0.000167	-5.815589E-5	T	29329	2017.09.19 13:57:47.360246382	0000678	
24	0.000221	0.000130	-0.000172	-4.836780E-5	T	29329	2017.09.19 13:57:47.370246382	0000678	
24	0.000200	0.000106	-0.000162	-4.820964E-5	T	29329	2017.09.19 13:57:47.380246382	0000678	
24	0.000203	0.000121	-0.000153	-5.837292E-5	T	29329	2017.09.19 13:57:47.390246382	0000678	
24	0.000205	9.647246E-5	-0.000167	-6.711478E-5	T	29329	2017.09.19 13:57:47.400246382	0000678	
24	0.000200	9.158126E-5	-0.000171	-4.805824E-5	T	29329	2017.09.19 13:57:47.410246382	0000678	
24	0.000201	0.000111	-0.000158	-5.827070E-5	T	29329	2017.09.19 13:57:47.420246382	0000678	
24	0.000192	7.272063E-5	-0.000176	-2.388371E-5	T	29329	2017.09.19 13:57:47.430246382	0000678	
25	0.000190	8.274435E-5	-0.000167	-3.400211E-5	T	29322	2017.09.19 13:57:47.540333882	0000678	
25	0.000218	0.000125	-0.000168	-6.334304E-5	T	29322	2017.09.19 13:57:47.550333882	0000678	
25	0.000211	0.000111	-0.000176	-3.419285E-5	T	29322	2017.09.19 13:57:47.560333882	0000678	
25	0.000190	9.170628E-5	-0.000157	-5.311613E-5	T	29322	2017.09.19 13:57:47.570333882	0000678	
25	0.000194	8.673748E-5	-0.000171	-2.901830E-5	T	29322	2017.09.19 13:57:47.580333882	0000678	
25	0.000212	0.000105	-0.000176	-5.315133E-5	T	29322	2017.09.19 13:57:47.590333882	0000678	
25	0.000181	5.885512E-5	-0.000171	-1.479079E-5	T	29322	2017.09.19 13:57:47.600333882	0000678	
25	0.000204	8.250460E-5	-0.000181	-4.294363E-5	T	29322	2017.09.19 13:57:47.610333882	0000678	
25	0.000208	0.000102	-0.000181	-1.509958E-5	T	29322	2017.09.19 13:57:47.620333882	0000678	
25	0.000192	0.000106	-0.000157	-2.923118E-5	T	29322	2017.09.19 13:57:47.630333882	0000678	
26	0.000197	7.756441E-5	-0.000176	-4.292365E-5	T	29336	2017.09.19 13:57:47.740421382	0000678	
26	0.000216	0.000116	-0.000177	-4.823300E-5	T	29336	2017.09.19 13:57:47.750421382	0000678	
26	0.000210	7.231698E-5	-0.000190	-5.282440E-5	T	29336	2017.09.19 13:57:47.760421382	0000678	
26	0.000218	0.000102	-0.000190	-2.906165E-5	T	29336	2017.09.19 13:57:47.770421382	0000678	
26	0.000199	8.256389E-5	-0.000176	-4.296438E-5	T	29336	2017.09.19 13:57:47.780421382	0000678	
26	0.000211	8.243068E-5	-0.000190	-3.890645E-5	T	29336	2017.09.19 13:57:47.790421382	0000678	
26	0.000208	0.000116	-0.000163	-5.829068E-5	T	29336	2017.09.19 13:57:47.800421382	0000678	
26	0.000209	0.000116	-0.000168	-4.827035E-5	T	29336	2017.09.19 13:57:47.810421382	0000678	
26	0.000201	0.000102	-0.000171	-2.914050E-5	T	29336	2017.09.19 13:57:47.820421382	0000678	
26	0.000179	8.284844E-5	-0.000152	-4.306398E-5	T	29336	2017.09.19 13:57:47.830421382	0000678	
27	0.000219	0.000121	-0.000177	-4.827373E-5	T	29315	2017.09.19 13:57:47.940508882	0000678	
27	0.000220	0.000105	-0.000182	-6.712999E-5	T	29315	2017.09.19 13:57:47.950508882	0000678	
27	0.000211	0.000105	-0.000172	-6.317166E-5	T	29315	2017.09.19 13:57:47.960508882	0000678	
27	0.000219	0.000116	-0.000182	-4.321246E-5	T	29315	2017.09.19 13:57:47.970508882	0000678	
27	0.000214	0.000111	-0.000181	-2.417252E-5	T	29315	2017.09.19 13:57:47.980508882	0000678	
27	0.000215	9.651117E-5	-0.000190	-2.902092E-5	T	29315	2017.09.19 13:57:47.990508882	0000678	
27	0.000215	0.000101	-0.000181	-5.309799E-5	T	29315	2017.09.19 13:57:48.000508882	0000678	
27	0.000204	0.000102	-0.000171	-4.313991E-5	T	29315	2017.09.19 13:57:48.010508882	0000678	
27	0.000197	8.662275E-5	-0.000171	-4.301772E-5	T	29315	2017.09.19 13:57:48.020508882	0000678	
27	0.000199	9.179241E-5	-0.000176	-1.503887E-5	T	29315	2017.09.19 13:57:48.030508882	0000678	
28	0.000216	9.135599E-5	-0.000190	-4.797939E-5	T	29326	2017.09.19 13:57:48.140596382	0000678	
28	0.000195	8.669651E-5	-0.000171	-3.401809E-5	T	29326	2017.09.19 13:57:48.150596382	0000678	
28	0.000208	0.000116	-0.000168	-4.327056E-5	T	29326	2017.09.19 13:57:48.160596382	0000678	
28	0.000211	0.000106	-0.000181	-2.413179E-5	T	29326	2017.09.19 13:57:48.170596382	0000678	
28	0.000210	0.000105	-0.000172	-5.817187E-5	T	29326	2017.09.19 13:57:48.180596382	0000678	
28	0.000198	0.000102	-0.000157	-6.319718E-5	T	29326	2017.09.19 13:57:48.190596382	0000678	
28	0.000218	0.000111	-0.000185	-2.915571E-5	T	29326	2017.09.19 13:57:48.200596382	0000678	
28	0.000187	7.267163E-5	-0.000167	-4.292027E-5	T	29326	2017.09.19 13:57:48.210596382	0000678	
28	0.000202	0.000102	-0.000167	-4.815630E-5	T	29326	2017.09.19 13:57:48.220596382	0000678	
28	0.000193	7.762369E-5	-0.000171	-4.294440E-5	T	29326	2017.09.19 13:57:48.230596382	0000678	
29	0.000222	0.000110	-0.000172	-8.621143E-5	T	29332	2017.09.19 13:57:48.340683882	0000678	
29	0.000218	0.000120	-0.000172	-5.829407E-5	T	29332	2017.09.19 13:57:48.350683882	0000678	
29	0.000211	0.000106	-0.000181	-2.413179E-5	T	29332	2017.09.19 13:57:48.360683882	0000678	
29	0.000202	8.643253E-5	-0.000167	-7.203311E-5	T	29332	2017.09.19 13:57:48.370683882	0000678	
29	0.000204	9.152198E-5	-0.000176	-4.803749E-5	T	29332	2017.09.19 13:57:48.380683882	0000678	
29	0.000219	0.000120	-0.000163	-8.233041E-5	T	29332	2017.09.19 13:57:48.390683882	0000678	
29	0.000210	0.000105	-0.000172	-5.817187E-5	T	29332	2017.09.19 13:57:48.400683882	0000678	
29	0.000195	8.254767E-5	-0.000167	-5.800111E-5	T	29332	2017.09.19 13:57:48.410683882	0000678	
29	0.000214	0.000116	-0.000172	-5.325354E-5	T	29332	2017.09.19 13:57:48.420683882	0000678	
29	0.000187	5.858469E-5	-0.000171	-4.778941E-5	T	29332	2017.09.19 13:57:48.430683882	0000678	
30	0.000174	6.890535E-5	-0.000157	-2.892977E-5	T	29305	2017.09.19 13:57:48.540771382	0000678	
30	0.000197	9.162869E-5	-0.000167	-4.807484E-5	T	29305	2017.09.19 13:57:48.550771382	0000678	
30	0.000214	0.000110	-0.000172	-6.321239E-5	T	29305	2017.09.19 13:57:48.560771382	0000678	
30	0.000230	0.000115	-0.000196	-3.415474E-5	T	29305	2017.09.19 13:57:48.570771382	0000678	
30	0.000201	9.167768E-5	-0.000176	-2.903828E-5	T	29305	2017.09.19 13:57:48.580771382	0000678	
30	0.000219	8.620080E-5	-0.000190	-6.693786E-5	T	29305	2017.09.19 13:57:48.590771382	0000678	
30	0.000195	8.669651E-5	-0.000171	-3.401809E-5	T	29305	2017.09.19 13:57:48.600771382	0000678	
30	0.000186	6.369890E-5	-0.000171	-3.383073E-5	T	29305	2017.09.19 13:57:48.610771382	0000678	
30	0.000219	0.000110	-0.000182	-5.317131E-5	T	29305	2017.09.19 13:57:48.620771382	0000678	
30	0.000221	9.636994E-5	-0.000195	-3.899975E-5	T	29305	2017.09.19 13:57:48.630771382	0000678	
31	0.000195	7.754174E-5	-0.000171	-5.294398E-5	T	29314	2017.09.19 13:57:48.740858882	0000678	
31	0.000212	0.000110	-0.000168	-6.722883E-5	T	29314	2017.09.19 13:57:48.750858882	0000678	
31	0.000199	8.654080E-5	-0.000171	-5.301730E-5	T	29314	2017.09.19 13:57:48.760858882	0000678	
31	0.000225	0.000105	-0.000182	-8.212937E-5	T	29314	2017.09.19 13:57:48.770858882	0000678	
31	0.000211	0.000125	-0.000158	-6.338454E-5	T	29314	2017.09.19 13:57:48.780858882	0000678	
31	0.000220	0.000105	-0.000177	-7.715033E-5	T	29314	2017.09.19 13:57:48.790858882	0000678	
31	0.000224	0.000105	-0.000190	-5.309323E-5	T	29314	2017.09.19 13:57:48.800858882	0000678	
31	0.000223	9.617709E-5	-0.000185	-7.703966E-5	T	29314	2017.09.19 13:57:48.810858882	0000678	
31	0.000211	0.000106	-0.000176	-4.815154E-5	T	29314	2017.09.19 13:57:48.820858882	0000678	
31	0.000195	9.682485E-5	-0.000167	-2.411657E-5	T	29314	2017.09.19 13:57:48.830858882	0000678	
32	0.000222	0.000110	-0.000186	-5.315471E-5	T	29312	2017.09.19 13:57:48.940946382	0000678	
32	0.000209	0.000101	-0.000168	-7.215530E-5	T	29312	2017.09.19 13:57:48.950946382	0000678	
32	0.000241	0.000134	-0.000196	-4.330914E-5	T	29312	2017.09.19 13:57:48.960946382	0000678	
32	0.000204	7.241724E-5	-0.000185	-4.784536E-5	T	29312	2017.09.19 13:57:48.970946382	0000678	
32	0.000202	0.000106	-0.000163	-5.820922E-5	T	29312	2017.09.19 13:57:48.980946382	0000678	
32	0.000209	9.653593E-5	-0.000181	-3.905785E-5	T	29312	2017.09.19 13:57:48.990946382	0000678	
32	0.000215	0.000106	-0.000185	-2.411519E-5	T	29312	2017.09.19 13:57:49.000946382	0000678	
32	0.000213	0.000111	-0.000181	-6.173275E-6	T	29312	2017.09.19 13:57:49.010946382	0000678	
32	0.000226	0.000105	-0.000195	-4.307290E-5	T	29312	2017.09.19 13:57:49.020946382	0000678	
32	0.000195	0.000102	-0.000162	-3.417764E-5	T	29312	2017.09.19 13:57:49.030946382	0000678	
33	0.000214	0.000115	-0.000168	-6.726956E-5	T	29330	2017.09.19 13:57:49.141033882	0000678	
33	0.000196	8.258219E-5	-0.000171	-4.798492E-5	T	29330	2017.09.19 13:57:49.151033882	0000678	
33	0.000210	0.000125	-0.000163	-4.336463E-5	T	29330	2017.09.19 13:57:49.161033882	0000678	
33	0.000209	0.000116	-0.000163	-6.329048E-5	T	29330	2017.09.19 13:57:49.171033882	0000678	
33	0.000199	0.000102	-0.000162	-5.317684E-5	T	29330	2017.09.19 13:57:49.181033882	0000678	
33	0.000229	0.000115	-0.000182	-7.721104E-5	T	29330	2017.09.19 13:57:49.191033882	0000678	
33	0.000215	0.000121	-0.000168	-5.831067E-5	T	29330	2017.09.19 13:57:49.201033882	0000678	
33	0.000207	0.000116	-0.000163	-5.329089E-5	T	29330	2017.09.19 13:57:49.211033882	0000678	
33	0.000207	0.000101	-0.000167	-6.715551E-5	T	29330	2017.09.19 13:57:49.221033882	0000678	
33	0.000195	0.000116	-0.000144	-6.336933E-5	T	29330	2017.09.19 13:57:49.231033882	0000678	
34	0.000218	0.000105	-0.000185	-4.311440E-5	T	29311	2017.09.19 13:57:49.341121382	0000678	
34	0.000242	0.000115	-0.000186	-0.000105	T	29311	2017.09.19 13:57:49.351121382	0000678	
34	0.000199	9.162223E-5	-0.000171	-4.305845E-5	T	29311	2017.09.19 13:57:49.361121382	0000678	
34	0.000222	0.000110	-0.000186	-5.315471E-5	T	29311	2017.09.19 13:57:49.371121382	0000678	
34	0.000207	9.138458E-5	-0.000171	-7.205724E-5	T	29311	2017.09.19 13:57:49.381121382	0000678	
34	0.000189	7.767112E-5	-0.000167	-4.296100E-5	T	29311	2017.09.19 13:57:49.391121382	0000678	
34	0.000206	9.677359E-5	-0.000181	-1.005906E-5	T	29311	2017.09.19 13:57:49.401121382	0000678	
34	0.000210	8.247165E-5	-0.000190	-3.390666E-5	T	29311	2017.09.19 13:57:49.411121382	0000678	
34	0.000209	9.653593E-5	-0.000181	-3.905785E-5	T	29311	2017.09.19 13:57:49.421121382	0000678	
34	0.000210	7.756859E-5	-0.000195	-1.484597E-5	T	29311	2017.09.19 13:57:49.431121382	0000678	
35	0.000207	0.000111	-0.000171	-3.421361E-5	T	29329	2017.09.19 13:57:49.541208882	0000678	
35	0.000213	0.000121	-0.000168	-5.331087E-5	T	29329	2017.09.19 13:57:49.551208882	0000678	
35	0.000210	0.000106	-0.000176	-4.315175E-5	T	29329	2017.09.19 13:57:49.561208882	0000678	
35	0.000201	0.000106	-0.000162	-5.320943E-5	T	29329	2017.09.19 13:57:49.571208882	0000678	
35	0.000204	0.000125	-0.000158	-3.438575E-5	T	29329	2017.09.19 13:57:49.581208882	0000678	
35	0.000199	0.000121	-0.000153	-3.937371E-5	T	29329	2017.09.19 13:57:49.591208882	0000678	
35	0.000202	0.000106	-0.000171	-2.017346E-5	T	29329	2017.09.19 13:57:49.601208882	0000678	
35	0.000215	0.000115	-0.000172	-5.825333E-5	T	29329	2017.09.19 13:57:49.611208882	0000678	
35	0.000198	0.000102	-0.000162	-4.817705E-5	T	29329	2017.09.19 13:57:49.621208882	0000678	
35	0.000197	0.000116	-0.000157	-2.431286E-5	T	29329	2017.09.19 13:57:49.631208882	0000678	
36	0.000212	0.000135	-0.000163	-1.544726E-5	T	29325	2017.09.19 13:57:49.741296382	0000678	
36	0.000201	0.000106	-0.000158	-6.722960E-5	T	29325	2017.09.19 13:57:49.751296382	0000678	
36	0.000214	0.000130	-0.000168	-2.938519E-5	T	29325	2017.09.19 13:57:49.761296382	0000678	
36	0.000216	0.000135	-0.000163	-4.344609E-5	T	29325	2017.09.19 13:57:49.771296382	0000678	
36	0.000210	0.000135	-0.000158	-3.446722E-5	T	29325	2017.09.19 13:57:49.781296382	0000678	
36	0.000208	0.000116	-0.000171	-2.425475E-5	T	29325	2017.09.19 13:57:49.791296382	0000678	
36	0.000224	0.000120	-0.000177	-6.727294E-5	T	29325	2017.09.19 13:57:49.801296382	0000678	
36	0.000229	0.000115	-0.000191	-5.317469E-5	T	29325	2017.09.19 13:57:49.811296382	0000678	
36	0.000197	9.169599E-5	-0.000171	-3.405883E-5	T	29325	2017.09.19 13:57:49.821296382	0000678	
36	0.000201	9.167768E-5	-0.000176	-2.903828E-5	T	29325	2017.09.19 13:57:49.831296382	0000678	
37	0.000206	7.230896E-5	-0.000181	-6.686117E-5	T	29318	2017.09.19 13:57:49.941383882	0000678	
37	0.000203	8.642607E-5	-0.000171	-6.701671E-5	T	29318	2017.09.19 13:57:49.951383882	0000678	
37	0.000206	0.000102	-0.000171	-5.313949E-5	T	29318	2017.09.19 13:57:49.961383882	0000678	
37	0.000177	5.369192E-5	-0.000162	-4.778603E-5	T	29318	2017.09.19 13:57:49.971383882	0000678	
37	0.000206	0.000102	-0.000167	-6.315568E-5	T	29318	2017.09.19 13:57:49.981383882	0000678	
37	0.000218	0.000121	-0.000181	-1.025457E-5	T	29318	2017.09.19 13:57:49.991383882	0000678	
37	0.000212	0.000102	-0.000185	-1.008319E-5	T	29318	2017.09.19 13:57:50.001383882	0000678	
37	0.000225	0.000111	-0.000195	-2.011459E-5	T	29318	2017.09.19 13:57:50.011383882	0000678	
37	0.000213	0.000111	-0.000177	-4.319248E-5	T	29318	2017.09.19 13:57:50.021383882	0000678	
37	0.000214	0.000116	-0.000172	-5.325354E-5	T	29318	2017.09.19 13:57:50.031383882	0000678	
38	0.000220	0.000105	-0.000177	-7.715033E-5	T	29344	2017.09.19 13:57:50.141471382	0000678	
38	0.000212	0.000116	-0.000168	-5.826993E-5	T	29344	2017.09.19 13:57:50.151471382	0000678	
38	0.000224	0.000124	-0.000177	-5.830590E-5	T	29344	2017.09.19 13:57:50.161471382	0000678	
38	0.000188	8.285908E-5	-0.000167	-2.000269E-5	T	29344	2017.09.19 13:57:50.171471382	0000678	
38	0.000202	9.147298E-5	-0.000167	-6.707405E-5	T	29344	2017.09.19 13:57:50.181471382	0000678	
38	0.000205	0.000102	-0.000176	-2.411996E-5	T	29344	2017.09.19 13:57:50.191471382	0000678	
38	0.000182	9.703548E-5	-0.000152	-2.017899E-5	T	29344	2017.09.19 13:57:50.201471382	0000678	
38	0.000203	0.000111	-0.000158	-6.327049E-5	T	29344	2017.09.19 13:57:50.211471382	0000678	
38	0.000225	0.000120	-0.000186	-4.323659E-5	T	29344	2017.09.19 13:57:50.221471382	0000678	
38	0.000188	8.282630E-5	-0.000167	-2.400253E-5	T	29344	2017.09.19 13:57:50.231471382	0000678	
39	0.000210	0.000101	-0.000176	-5.311874E-5	T	29323	2017.09.19 13:57:50.341558882	0000678	
39	0.000208	0.000111	-0.000171	-3.921340E-5	T	29323	2017.09.19 13:57:50.351558882	0000678	
39	0.000219	9.625904E-5	-0.000185	-6.704008E-5	T	29323	2017.09.19 13:57:50.361558882	0000678	
39	0.000221	0.000115	-0.000182	-4.821225E-5	T	29323	2017.09.19 13:57:50.371558882	0000678	
39	0.000198	0.000106	-0.000162	-3.921002E-5	T	29323	2017.09.19 13:57:50.381558882	0000678	
39	0.000226	9.627788E-5	-0.000200	-4.297883E-5	T	29323	2017.09.19 13:57:50.391558882	0000678	
39	0.000204	9.165937E-5	-0.000181	-2.401774E-5	T	29323	2017.09.19 13:57:50.401558882	0000678	
39	0.000196	7.759719E-5	-0.000176	-3.892382E-5	T	29323	2017.09.19 13:57:50.411558882	0000678	
39	0.000238	0.000149	-0.000182	-3.948146E-5	T	29323	2017.09.19 13:57:50.421558882	0000678	
39	0.000212	0.000125	-0.000163	-5.336421E-5	T	29323	2017.09.19 13:57:50.431558882	0000678	
40	0.000252	0.000143	-0.000196	-6.738145E-5	T	29345	2017.09.19 13:57:50.541646382	0000678	
40	0.000230	0.000115	-0.000191	-5.817448E-5	T	29345	2017.09.19 13:57:50.551646382	0000678	
40	0.000217	9.642922E-5	-0.000190	-3.902050E-5	T	29345	2017.09.19 13:57:50.561646382	0000678	
40	0.000193	6.352489E-5	-0.000176	-4.780939E-5	T	29345	2017.09.19 13:57:50.571646382	0000678	
40	0.000187	6.869838E-5	-0.000171	-3.387146E-5	T	29345	2017.09.19 13:57:50.581646382	0000678	
40	0.000214	0.000105	-0.000177	-5.815112E-5	T	29345	2017.09.19 13:57:50.591646382	0000678	
40	0.000212	0.000116	-0.000168	-5.826993E-5	T	29345	2017.09.19 13:57:50.601646382	0000678	
40	0.000224	0.000135	-0.000168	-6.342450E-5	T	29345	2017.09.19 13:57:50.611646382	0000678	
40	0.000215	0.000101	-0.000172	-8.213828E-5	T	29345	2017.09.19 13:57:50.621646382	0000678	
40	0.000206	0.000111	-0.000168	-4.822962E-5	T	29345	2017.09.19 13:57:50.631646382	0000678	
41	0.000213	0.000121	-0.000163	-6.733104E-5	T	29316	2017.09.19 13:57:50.741733882	0000678	
41	0.000204	0.000102	-0.000167	-5.815589E-5	T	29316	2017.09.19 13:57:50.751733882	0000678	
41	0.000217	0.000101	-0.000185	-4.808160E-5	T	29316	2017.09.19 13:57:50.761733882	0000678	
41	0.000205	0.000111	-0.000163	-5.824995E-5	T	29316	2017.09.19 13:57:50.771733882	0000678	
41	0.000214	0.000110	-0.000172	-6.321239E-5	T	29316	2017.09.19 13:57:50.781733882	0000678	
41	0.000219	0.000111	-0.000185	-3.415550E-5	T	29316	2017.09.19 13:57:50.791733882	0000678	
41	0.000208	0.000116	-0.000171	-2.425475E-5	T	29316	2017.09.19 13:57:50.801733882	0000678	
41	0.000225	0.000124	-0.000177	-6.330569E-5	T	29316	2017.09.19 13:57:50.811733882	0000678	
41	0.000221	0.000111	-0.000190	-2.013534E-5	T	29316	2017.09.19 13:57:50.821733882	0000678	
41	0.000217	0.000111	-0.000182	-4.317173E-5	T	29316	2017.09.19 13:57:50.831733882	0000678	
42	0.000211	9.145624E-5	-0.000185	-4.300035E-5	T	29322	2017.09.19 13:57:50.941821382	0000678	
42	0.000212	9.141527E-5	-0.000185	-4.800014E-5	T	29322	2017.09.19 13:57:50.951821382	0000678	
42	0.000206	0.000111	-0.000168	-4.822962E-5	T	29322	2017.09.19 13:57:50.961821382	0000678	
42	0.000224	0.000135	-0.000172	-4.840853E-5	T	29322	2017.09.19 13:57:50.971821382	0000678	
42	0.000214	0.000105	-0.000177	-5.815112E-5	T	29322	2017.09.19 13:57:50.981821382	0000678	
42	0.000214	0.000111	-0.000181	-2.917231E-5	T	29322	2017.09.19 13:57:50.991821382	0000678	
42	0.000220	0.000110	-0.000186	-4.315513E-5	T	29322	2017.09.19 13:57:51.001821382	0000678	
42	0.000210	0.000111	-0.000172	-4.821302E-5	T	29322	2017.09.19 13:57:51.011821382	0000678	
42	0.000229	0.000124	-0.000182	-6.328494E-5	T	29322	2017.09.19 13:57:51.021821382	0000678	
42	0.000191	9.172894E-5	-0.000162	-4.309580E-5	T	29322	2017.09.19 13:57:51.031821382	0000678	
43	0.000211	0.000106	-0.000176	-4.815154E-5	T	29306	2017.09.19 13:57:51.141908882	0000678	
43	0.000203	0.000102	-0.000167	-5.315609E-5	T	29306	2017.09.19 13:57:51.151908882	0000678	
43	0.000218	0.000135	-0.000163	-5.344567E-5	T	29306	2017.09.19 13:57:51.161908882	0000678	
43	0.000200	0.000111	-0.000158	-5.327091E-5	T	29306	2017.09.19 13:57:51.171908882	0000678	
43	0.000215	0.000105	-0.000177	-6.315091E-5	T	29306	2017.09.19 13:57:51.181908882	0000678	
43	0.000190	9.678771E-5	-0.000157	-4.315728E-5	T	29306	2017.09.19 13:57:51.191908882	0000678	
43	0.000209	9.146269E-5	-0.000181	-4.801674E-5	T	29306	2017.09.19 13:57:51.201908882	0000678	
43	0.000179	7.786344E-5	-0.000157	-3.400288E-5	T	29306	2017.09.19 13:57:51.211908882	0000678	
43	0.000200	0.000106	-0.000162	-4.820964E-5	T	29306	2017.09.19 13:57:51.221908882	0000678	
43	0.000214	0.000121	-0.000172	-4.329469E-5	T	29306	2017.09.19 13:57:51.231908882	0000678	
44	0.000199	0.000106	-0.000162	-4.320985E-5	T	29344	2017.09.19 13:57:51.341996382	0000678	
44	0.000207	8.636679E-5	-0.000176	-6.699596E-5	T	29344	2017.09.19 13:57:51.351996382	0000678	
44	0.000209	0.000105	-0.000168	-6.718809E-5	T	29344	2017.09.19 13:57:51.361996382	0000678	
44	0.000227	0.000124	-0.000182	-5.328536E-5	T	29344	2017.09.19 13:57:51.371996382	0000678	
44	0.000226	0.000129	-0.000177	-5.334684E-5	T	29344	2017.09.19 13:57:51.381996382	0000678	
44	0.000203	0.000102	-0.000158	-7.719659E-5	T	29344	2017.09.19 13:57:51.391996382	0000678	
44	0.000196	7.759719E-5	-0.000176	-3.892382E-5	T	29344	2017.09.19 13:57:51.401996382	0000678	
44	0.000202	8.242649E-5	-0.000171	-6.698413E-5	T	29344	2017.09.19 13:57:51.411996382	0000678	
44	0.000191	0.000102	-0.000157	-3.419839E-5	T	29344	2017.09.19 13:57:51.421996382	0000678	
44	0.000195	7.750722E-5	-0.000167	-6.296017E-5	T	29344	2017.09.19 13:57:51.431996382	0000678	
45	0.000211	0.000111	-0.000172	-5.321281E-5	T	29321	2017.09.19 13:57:51.542083882	0000678	
45	0.000211	0.000105	-0.000172	-6.317166E-5	T	29321	2017.09.19 13:57:51.552083882	0000678	
45	0.000227	0.000101	-0.000191	-7.205985E-5	T	29321	2017.09.19 13:57:51.562083882	0000678	
45	0.000210	0.000111	-0.000176	-2.419327E-5	T	29321	2017.09.19 13:57:51.572083882	0000678	
45	0.000218	0.000130	-0.000172	-3.436839E-5	T	29321	2017.09.19 13:57:51.582083882	0000678	
45	0.000214	8.629286E-5	-0.000185	-6.295878E-5	T	29321	2017.09.19 13:57:51.592083882	0000678	
45	0.000207	9.138458E-5	-0.000171	-7.205724E-5	T	29321	2017.09.19 13:57:51.602083882	0000678	
45	0.000215	9.139696E-5	-0.000190	-4.297960E-5	T	29321	2017.09.19 13:57:51.612083882	0000678	
45	0.000202	7.236825E-5	-0.000176	-6.688192E-5	T	29321	2017.09.19 13:57:51.622083882	0000678	
45	0.000224	0.000105	-0.000190	-5.309323E-5	T	29321	2017.09.19 13:57:51.632083882	0000678	
46	0.000214	0.000111	-0.000177	-4.819227E-5	T	29319	2017.09.19 13:57:51.742171382	0000678	
46	0.000201	0.000106	-0.000158	-6.722960E-5	T	29319	2017.09.19 13:57:51.752171382	0000678	
46	0.000209	9.653593E-5	-0.000181	-3.905785E-5	T	29319	2017.09.19 13:57:51.762171382	0000678	
46	0.000224	0.000125	-0.000182	-4.328578E-5	T	29319	2017.09.19 13:57:51.772171382	0000678	
46	0.000208	9.150367E-5	-0.000181	-4.301695E-5	T	29319	2017.09.19 13:57:51.782171382	0000678	
46	0.000199	0.000116	-0.000158	-3.431244E-5	T	29319	2017.09.19 13:57:51.792171382	0000678	
46	0.000215	0.000120	-0.000163	-7.233083E-5	T	29319	2017.09.19 13:57:51.802171382	0000678	
46	0.000228	0.000124	-0.000182	-5.828515E-5	T	29319	2017.09.19 13:57:51.812171382	0000678	
46	0.000225	0.000120	-0.000186	-3.923676E-5	T	29319	2017.09.19 13:57:51.822171382	0000678	
46	0.000208	9.657690E-5	-0.000181	-3.405806E-5	T	29319	2017.09.19 13:57:51.832171382	0000678	
47	0.000205	7.234174E-5	-0.000181	-6.286133E-5	T	29307	2017.09.19 13:57:51.942258882	0000678	
47	0.000208	8.648954E-5	-0.000185	-3.895978E-5	T	29307	2017.09.19 13:57:51.952258882	0000678	
47	0.000212	0.000121	-0.000168	-4.831108E-5	T	29307	2017.09.19 13:57:51.962258882	0000678	
47	0.000207	0.000116	-0.000168	-3.927073E-5	T	29307	2017.09.19 13:57:51.972258882	0000678	
47	0.000215	0.000111	-0.000181	-3.417210E-5	T	29307	2017.09.19 13:57:51.982258882	0000678	
47	0.000227	0.000140	-0.000168	-6.346524E-5	T	29307	2017.09.19 13:57:51.992258882	0000678	
47	0.000205	9.649879E-5	-0.000171	-5.809855E-5	T	29307	2017.09.19 13:57:52.002258882	0000678	
47	0.000195	5.850710E-5	-0.000181	-4.274812E-5	T	29307	2017.09.19 13:57:52.012258882	0000678	
47	0.000204	0.000102	-0.000171	-4.313991E-5	T	29307	2017.09.19 13:57:52.022258882	0000678	
47	0.000236	0.000129	-0.000196	-2.926899E-5	T	29307	2017.09.19 13:57:52.032258882	0000678	
48	0.000215	0.000106	-0.000185	-2.911498E-5	T	29336	2017.09.19 13:57:52.142346382	0000678	
48	0.000205	0.000121	-0.000163	-3.433242E-5	T	29336	2017.09.19 13:57:52.152346382	0000678	
48	0.000226	0.000130	-0.000182	-3.432688E-5	T	29336	2017.09.19 13:57:52.162346382	0000678	
48	0.000211	0.000116	-0.000172	-3.925413E-5	T	29336	2017.09.19 13:57:52.172346382	0000678	
48	0.000212	0.000140	-0.000158	-2.450837E-5	T	29336	2017.09.19 13:57:52.182346382	0000678	
48	0.000225	0.000144	-0.000172	-2.448285E-5	T	29336	2017.09.19 13:57:52.192346382	0000678	
48	0.000198	9.158771E-5	-0.000167	-5.307463E-5	T	29336	2017.09.19 13:57:52.202346382	0000678	
48	0.000217	0.000135	-0.000163	-4.844588E-5	T	29336	2017.09.19 13:57:52.212346382	0000678	
48	0.000202	8.652250E-5	-0.000176	-4.799676E-5	T	29336	2017.09.19 13:57:52.222346382	0000678	
48	0.000206	0.000116	-0.000168	-2.927115E-5	T	29336	2017.09.19 13:57:52.232346382	0000678	
49	0.000194	7.758271E-5	-0.000171	-4.794419E-5	T	29345	2017.09.19 13:57:52.342433882	0000678	
49	0.000227	0.000120	-0.000182	-6.325236E-5	T	29345	2017.09.19 13:57:52.352433882	0000678	
49	0.000192	9.680218E-5	-0.000162	-3.413691E-5	T	29345	2017.09.19 13:57:52.362433882	0000678	
49	0.000190	7.773842E-5	-0.000171	-2.894499E-5	T	29345	2017.09.19 13:57:52.372433882	0000678	
49	0.000208	0.000111	-0.000171	-3.921340E-5	T	29345	2017.09.19 13:57:52.382433882	0000678	
49	0.000213	8.626653E-5	-0.000181	-7.197501E-5	T	29345	2017.09.19 13:57:52.392433882	0000678	
49	0.000194	0.000106	-0.000153	-5.825072E-5	T	29345	2017.09.19 13:57:52.402433882	0000678	
49	0.000198	9.153226E-5	-0.000162	-6.709480E-5	T	29345	2017.09.19 13:57:52.412433882	0000678	
49	0.000207	0.000116	-0.000158	-6.731106E-5	T	29345	2017.09.19 13:57:52.422433882	0000678	
49	0.000183	0.000106	-0.000143	-3.928887E-5	T	29345	2017.09.19 13:57:52.432433882	0000678	
50	0.000202	0.000111	-0.000163	-4.825037E-5	T	29333	2017.09.19 13:57:52.542521382	0000678	
50	0.000197	0.000111	-0.000162	-1.525175E-5	T	29333	2017.09.19 13:57:52.552521382	0000678	
50	0.000211	0.000106	-0.000181	-2.013196E-5	T	29333	2017.09.19 13:57:52.562521382	0000678	
50	0.000213	0.000121	-0.000172	-3.929486E-5	T	29333	2017.09.19 13:57:52.572521382	0000678	
50	0.000191	7.769744E-5	-0.000171	-3.394478E-5	T	29333	2017.09.19 13:57:52.582521382	0000678	
50	0.000213	0.000121	-0.000172	-3.429507E-5	T	29333	2017.09.19 13:57:52.592521382	0000678	
50	0.000234	0.000139	-0.000177	-6.342789E-5	T	29333	2017.09.19 13:57:52.602521382	0000678	
50	0.000195	9.662381E-5	-0.000157	-6.315645E-5	T	29333	2017.09.19 13:57:52.612521382	0000678	
50	0.000207	0.000125	-0.000158	-4.838517E-5	T	29333	2017.09.19 13:57:52.622521382	0000678	
50	0.000198	8.671918E-5	-0.000176	-2.399776E-5	T	29333	2017.09.19 13:57:52.632521382	0000678	
51	0.000203	8.661892E-5	-0.000181	-2.897680E-5	T	29332	2017.09.19 13:57:52.742608882	0000678	
51	0.000213	0.000101	-0.000176	-6.311833E-5	T	29332	2017.09.19 13:57:52.752608882	0000678	
51	0.000227	0.000115	-0.000186	-6.319502E-5	T	29332	2017.09.19 13:57:52.762608882	0000678	
51	0.000200	0.000111	-0.000162	-3.425096E-5	T	29332	2017.09.19 13:57:52.772608882	0000678	
51	0.000226	0.000135	-0.000177	-3.938816E-5	T	29332	2017.09.19 13:57:52.782608882	0000678	
51	0.000205	0.000111	-0.000167	-3.923000E-5	T	29332	2017.09.19 13:57:52.792608882	0000678	
51	0.000201	0.000102	-0.000167	-4.315651E-5	T	29332	2017.09.19 13:57:52.802608882	0000678	
51	0.000195	9.160602E-5	-0.000162	-5.809517E-5	T	29332	2017.09.19 13:57:52.812608882	0000678	
51	0.000210	0.000116	-0.000172	-3.425434E-5	T	29332	2017.09.19 13:57:52.822608882	0000678	
51	0.000224	0.000135	-0.000177	-2.938858E-5	T	29332	2017.09.19 13:57:52.832608882	0000678	
52	0.000206	9.669164E-5	-0.000181	-2.005864E-5	T	29341	2017.09.19 13:57:52.942696382	0000678	
52	0.000207	7.734122E-5	-0.000181	-6.290206E-5	T	29341	2017.09.19 13:57:52.952696382	0000678	
52	0.000180	7.782246E-5	-0.000157	-3.900267E-5	T	29341	2017.09.19 13:57:52.962696382	0000678	
52	0.000206	0.000121	-0.000163	-3.933221E-5	T	29341	2017.09.19 13:57:52.972696382	0000678	
52	0.000207	0.000101	-0.000167	-6.715551E-5	T	29341	2017.09.19 13:57:52.982696382	0000678	
52	0.000194	7.247495E-5	-0.000167	-6.691927E-5	T	29341	2017.09.19 13:57:52.992696382	0000678	
52	0.000207	0.000106	-0.000176	-2.415254E-5	T	29341	2017.09.19 13:57:53.002696382	0000678	
52	0.000206	0.000121	-0.000158	-5.335237E-5	T	29341	2017.09.19 13:57:53.012696382	0000678	
52	0.000200	9.658719E-5	-0.000167	-5.311536E-5	T	29341	2017.09.19 13:57:53.022696382	0000678	
52	0.000211	0.000116	-0.000163	-6.729031E-5	T	29341	2017.09.19 13:57:53.032696382	0000678	
53	0.000214	0.000106	-0.000181	-4.313100E-5	T	29340	2017.09.19 13:57:53.142783882	0000678	
53	0.000233	0.000143	-0.000172	-6.348122E-5	T	29340	2017.09.19 13:57:53.152783882	0000678	
53	0.000217	0.000101	-0.000185	-4.808160E-5	T	29340	2017.09.19 13:57:53.162783882	0000678	
53	0.000211	9.145624E-5	-0.000185	-4.300035E-5	T	29340	2017.09.19 13:57:53.172783882	0000678	
53	0.000216	0.000115	-0.000172	-6.325312E-5	T	29340	2017.09.19 13:57:53.182783882	0000678	
53	0.000210	0.000130	-0.000163	-2.940594E-5	T	29340	2017.09.19 13:57:53.192783882	0000678	
53	0.000229	0.000129	-0.000172	-7.736659E-5	T	29340	2017.09.19 13:57:53.202783882	0000678	
53	0.000208	0.000106	-0.000176	-3.415212E-5	T	29340	2017.09.19 13:57:53.212783882	0000678	
53	0.000211	0.000135	-0.000153	-5.348717E-5	T	29340	2017.09.19 13:57:53.222783882	0000678	
53	0.000209	0.000102	-0.000176	-4.811895E-5	T	29340	2017.09.19 13:57:53.232783882	0000678	
54	0.000204	0.000111	-0.000167	-3.423021E-5	T	29311	2017.09.19 13:57:53.342871382	0000678	
54	0.000214	0.000116	-0.000172	-5.325354E-5	T	29311	2017.09.19 13:57:53.352871382	0000678	
54	0.000208	0.000102	-0.000176	-4.311916E-5	T	29311	2017.09.19 13:57:53.362871382	0000678	
54	0.000210	0.000101	-0.000176	-5.311874E-5	T	29311	2017.09.19 13:57:53.372871382	0000678	
54	0.000204	9.143201E-5	-0.000167	-7.207384E-5	T	29311	2017.09.19 13:57:53.382871382	0000678	
54	0.000210	9.650315E-5	-0.000181	-4.305768E-5	T	29311	2017.09.19 13:57:53.392871382	0000678	
54	0.000209	0.000102	-0.000176	-4.811895E-5	T	29311	2017.09.19 13:57:53.402871382	0000678	
54	0.000208	6.826195E-5	-0.000185	-6.681198E-5	T	29311	2017.09.19 13:57:53.412871382	0000678	
54	0.000194	6.881747E-5	-0.000181	-4.831172E-6	T	29311	2017.09.19 13:57:53.422871382	0000678	
54	0.000212	9.652948E-5	-0.000185	-3.404146E-5	T	29311	2017.09.19 13:57:53.432871382	0000678	
55	0.000207	0.000106	-0.000171	-4.817229E-5	T	29318	2017.09.19 13:57:53.542958882	0000678	
55	0.000195	0.000111	-0.000157	-2.927191E-5	T	29318	2017.09.19 13:57:53.552958882	0000678	
55	0.000239	0.000129	-0.000191	-6.328832E-5	T	29318	2017.09.19 13:57:53.562958882	0000678	
55	0.000196	7.252395E-5	-0.000176	-4.788271E-5	T	29318	2017.09.19 13:57:53.572958882	0000678	
55	0.000204	9.145833E-5	-0.000171	-6.305761E-5	T	29318	2017.09.19 13:57:53.582958882	0000678	
55	0.000204	7.749048E-5	-0.000185	-3.888647E-5	T	29318	2017.09.19 13:57:53.592958882	0000678	
55	0.000205	6.339987E-5	-0.000190	-4.275150E-5	T	29318	2017.09.19 13:57:53.602958882	0000678	
55	0.000230	0.000101	-0.000200	-4.801935E-5	T	29318	2017.09.19 13:57:53.612958882	0000678	
55	0.000220	0.000110	-0.000182	-5.817110E-5	T	29318	2017.09.19 13:57:53.622958882	0000678	
55	0.000194	0.000111	-0.000157	-2.427212E-5	T	29318	2017.09.19 13:57:53.632958882	0000678	
56	0.000197	9.162869E-5	-0.000167	-4.807484E-5	T	29316	2017.09.19 13:57:53.743046382	0000678	
56	0.000215	0.000101	-0.000185	-3.908198E-5	T	29316	2017.09.19 13:57:53.753046382	0000678	
56	0.000202	0.000125	-0.000153	-4.340613E-5	T	29316	2017.09.19 13:57:53.763046382	0000678	
56	0.000218	0.000101	-0.000177	-7.711774E-5	T	29316	2017.09.19 13:57:53.773046382	0000678	
56	0.000185	7.274539E-5	-0.000167	-3.392065E-5	T	29316	2017.09.19 13:57:53.783046382	0000678	
56	0.000208	0.000106	-0.000176	-3.415212E-5	T	29316	2017.09.19 13:57:53.793046382	0000678	
56	0.000215	0.000115	-0.000172	-5.825333E-5	T	29316	2017.09.19 13:57:53.803046382	0000678	
56	0.000214	0.000101	-0.000176	-6.711816E-5	T	29316	2017.09.19 13:57:53.813046382	0000678	
56	0.000206	0.000111	-0.000168	-4.822962E-5	T	29316	2017.09.19 13:57:53.823046382	0000678	
56	0.000209	0.000121	-0.000168	-2.931188E-5	T	29316	2017.09.19 13:57:53.833046382	0000678	
57	0.000196	9.664647E-5	-0.000162	-5.313611E-5	T	29330	2017.09.19 13:57:53.943133882	0000678	
57	0.000226	0.000120	-0.000182	-5.825256E-5	T	29330	2017.09.19 13:57:53.953133882	0000678	
57	0.000205	0.000106	-0.000171	-3.917266E-5	T	29330	2017.09.19 13:57:53.963133882	0000678	
57	0.000210	7.756859E-5	-0.000195	-1.484597E-5	T	29330	2017.09.19 13:57:53.973133882	0000678	
57	0.000209	0.000130	-0.000158	-4.342611E-5	T	29330	2017.09.19 13:57:53.983133882	0000678	
57	0.000203	0.000121	-0.000158	-4.335279E-5	T	29330	2017.09.19 13:57:53.993133882	0000678	
57	0.000192	9.182537E-5	-0.000167	-2.407584E-5	T	29330	2017.09.19 13:57:54.003133882	0000678	
57	0.000222	0.000105	-0.000190	-4.309365E-5	T	29330	2017.09.19 13:57:54.013133882	0000678	
57	0.000220	0.000110	-0.000182	-5.817110E-5	T	29330	2017.09.19 13:57:54.023133882	0000678	
57	0.000199	0.000102	-0.000162	-5.317684E-5	T	29330	2017.09.19 13:57:54.033133882	0000678	
58	0.000223	0.000115	-0.000182	-5.821183E-5	T	29313	2017.09.19 13:57:54.143221382	0000678	
58	0.000189	0.000102	-0.000157	-2.419881E-5	T	29313	2017.09.19 13:57:54.153221382	0000678	
58	0.000212	0.000105	-0.000176	-5.315133E-5	T	29313	2017.09.19 13:57:54.163221382	0000678	
58	0.000214	0.000111	-0.000177	-4.819227E-5	T	29313	2017.09.19 13:57:54.173221382	0000678	
58	0.000210	0.000116	-0.000172	-3.425434E-5	T	29313	2017.09.19 13:57:54.183221382	0000678	
58	0.000209	0.000105	-0.000168	-6.718809E-5	T	29313	2017.09.19 13:57:54.193221382	0000678	
58	0.000219	0.000110	-0.000177	-6.719148E-5	T	29313	2017.09.19 13:57:54.203221382	0000678	
58	0.000203	9.650524E-5	-0.000167	-6.311494E-5	T	29313	2017.09.19 13:57:54.213221382	0000678	
58	0.000216	9.152616E-5	-0.000195	-1.995981E-5	T	29313	2017.09.19 13:57:54.223221382	0000678	
58	0.000199	7.272865E-5	-0.000185	-9.846948E-6	T	29313	2017.09.19 13:57:54.233221382	0000678	
59	0.000204	9.152198E-5	-0.000176	-4.803749E-5	T	29311	2017.09.19 13:57:54.343308882	0000678	
59	0.000222	0.000120	-0.000177	-5.827332E-5	T	29311	2017.09.19 13:57:54.353308882	0000678	
59	0.000213	9.638022E-5	-0.000181	-5.805705E-5	T	29311	2017.09.19 13:57:54.363308882	0000678	
59	0.000216	0.000110	-0.000172	-7.221202E-5	T	29311	2017.09.19 13:57:54.373308882	0000678	
59	0.000214	0.000105	-0.000177	-5.815112E-5	T	29311	2017.09.19 13:57:54.383308882	0000678	
59	0.000216	0.000130	-0.000172	-1.536918E-5	T	29311	2017.09.19 13:57:54.393308882	0000678	
59	0.000211	0.000121	-0.000158	-7.235158E-5	T	29311	2017.09.19 13:57:54.403308882	0000678	
59	0.000199	9.154674E-5	-0.000167	-5.807442E-5	T	29311	2017.09.19 13:57:54.413308882	0000678	
59	0.000199	6.861434E-5	-0.000185	-2.381378E-5	T	29311	2017.09.19 13:57:54.423308882	0000678	
59	0.000215	8.241237E-5	-0.000195	-3.388591E-5	T	29311	2017.09.19 13:57:54.433308882	0000678	
60	0.000221	0.000130	-0.000168	-6.338377E-5	T	29323	2017.09.19 13:57:54.543396382	0000678	
60	0.000229	0.000115	-0.000191	-5.317469E-5	T	29323	2017.09.19 13:57:54.553396382	0000678	
60	0.000220	8.611083E-5	-0.000181	-9.097421E-5	T	29323	2017.09.19 13:57:54.563396382	0000678	
60	0.000192	7.272063E-5	-0.000176	-2.388371E-5	T	29323	2017.09.19 13:57:54.573396382	0000678	
60	0.000226	0.000124	-0.000177	-6.730552E-5	T	29323	2017.09.19 13:57:54.583396382	0000678	
60	0.000189	8.672946E-5	-0.000162	-4.305507E-5	T	29323	2017.09.19 13:57:54.593396382	0000678	
60	0.000184	6.355348E-5	-0.000157	-7.188724E-5	T	29323	2017.09.19 13:57:54.603396382	0000678	
60	0.000216	0.000116	-0.000177	-4.823300E-5	T	29323	2017.09.19 13:57:54.613396382	0000678	
60	0.000213	0.000102	-0.000185	-2.408261E-5	T	29323	2017.09.19 13:57:54.623396382	0000678	
60	0.000207	0.000116	-0.000171	-1.525513E-5	T	29323	2017.09.19 13:57:54.633396382	0000678	
61	0.000220	0.000121	-0.000182	-2.925378E-5	T	29323	2017.09.19 13:57:54.743483882	0000678	
61	0.000236	0.000129	-0.000186	-6.730891E-5	T	29323	2017.09.19 13:57:54.753483882	0000678	
61	0.000232	0.000124	-0.000182	-7.228456E-5	T	29323	2017.09.19 13:57:54.763483882	0000678	
61	0.000222	0.000120	-0.000168	-8.230966E-5	T	29323	2017.09.19 13:57:54.773483882	0000678	
61	0.000209	7.724480E-5	-0.000176	-8.192202E-5	T	29323	2017.09.19 13:57:54.783483882	0000678	
61	0.000206	9.677359E-5	-0.000181	-1.005906E-5	T	29323	2017.09.19 13:57:54.793483882	0000678	
61	0.000207	0.000106	-0.000171	-4.817229E-5	T	29323	2017.09.19 13:57:54.803483882	0000678	
61	0.000213	0.000116	-0.000168	-6.326972E-5	T	29323	2017.09.19 13:57:54.813483882	0000678	
61	0.000198	9.677742E-5	-0.000171	-2.409997E-5	T	29323	2017.09.19 13:57:54.823483882	0000678	
61	0.000209	0.000125	-0.000163	-3.936479E-5	T	29323	2017.09.19 13:57:54.833483882	0000678	
62	0.000204	9.653977E-5	-0.000171	-5.309876E-5	T	29313	2017.09.19 13:57:54.943571382	0000678	
62	0.000214	0.000105	-0.000177	-5.815112E-5	T	29313	2017.09.19 13:57:54.953571382	0000678	
62	0.000199	7.244200E-5	-0.000176	-5.788229E-5	T	29313	2017.09.19 13:57:54.963571382	0000678	
62	0.000198	0.000116	-0.000158	-2.931265E-5	T	29313	2017.09.19 13:57:54.973571382	0000678	
62	0.000201	0.000102	-0.000167	-4.315651E-5	T	29313	2017.09.19 13:57:54.983571382	0000678	
62	0.000187	8.272988E-5	-0.000162	-4.302248E-5	T	29313	2017.09.19 13:57:54.993571382	0000678	
62	0.000204	9.145833E-5	-0.000171	-6.305761E-5	T	29313	2017.09.19 13:57:55.003571382	0000678	
62	0.000241	0.000120	-0.000177	-0.000110	T	29313	2017.09.19 13:57:55.013571382	0000678	
62	0.000204	8.239999E-5	-0.000176	-6.296355E-5	T	29313	2017.09.19 13:57:55.023571382	0000678	
62	0.000206	0.000102	-0.000176	-2.911975E-5	T	29313	2017.09.19 13:57:55.033571382	0000678	
63	0.000210	0.000111	-0.000168	-6.322899E-5	T	29322	2017.09.19 13:57:55.143658882	0000678	
63	0.000205	0.000106	-0.000171	-3.917266E-5	T	29322	2017.09.19 13:57:55.153658882	0000678	
63	0.000218	0.000121	-0.000177	-4.327394E-5	T	29322	2017.09.19 13:57:55.163658882	0000678	
63	0.000215	0.000144	-0.000158	-2.054112E-5	T	29322	2017.09.19 13:57:55.173658882	0000678	
63	0.000202	8.645885E-5	-0.000171	-6.301688E-5	T	29322	2017.09.19 13:57:55.183658882	0000678	
63	0.000212	0.000121	-0.000172	-2.929528E-5	T	29322	2017.09.19 13:57:55.193658882	0000678	
63	0.000201	0.000102	-0.000167	-4.315651E-5	T	29322	2017.09.19 13:57:55.203658882	0000678	
63	0.000191	6.850815E-5	-0.000167	-6.288685E-5	T	29322	2017.09.19 13:57:55.213658882	0000678	
63	0.000223	0.000105	-0.000190	-4.809344E-5	T	29322	2017.09.19 13:57:55.223658882	0000678	
63	0.000209	0.000101	-0.000171	-6.313908E-5	T	29322	2017.09.19 13:57:55.233658882	0000678	
64	0.000215	9.651117E-5	-0.000190	-2.902092E-5	T	29336	2017.09.19 13:57:55.343746382	0000678	
64	0.000187	5.354423E-5	-0.000171	-5.274847E-5	T	29336	2017.09.19 13:57:55.353746382	0000678	
64	0.000188	5.854371E-5	-0.000171	-5.278920E-5	T	29336	2017.09.19 13:57:55.363746382	0000678	
64	0.000211	0.000111	-0.000172	-5.321281E-5	T	29336	2017.09.19 13:57:55.373746382	0000678	
64	0.000199	0.000121	-0.000153	-3.937371E-5	T	29336	2017.09.19 13:57:55.383746382	0000678	
64	0.000200	0.000102	-0.000167	-3.915668E-5	T	29336	2017.09.19 13:57:55.393746382	0000678	
64	0.000186	9.684699E-5	-0.000152	-4.317803E-5	T	29336	2017.09.19 13:57:55.403746382	0000678	
64	0.000194	0.000102	-0.000157	-4.819780E-5	T	29336	2017.09.19 13:57:55.413746382	0000678	
64	0.000199	0.000102	-0.000167	-3.415689E-5	T	29336	2017.09.19 13:57:55.423746382	0000678	
64	0.000200	0.000111	-0.000158	-5.327091E-5	T	29336	2017.09.19 13:57:55.433746382	0000678	
65	0.000213	0.000101	-0.000181	-4.809820E-5	T	29314	2017.09.19 13:57:55.543833882	0000678	
65	0.000192	8.685221E-5	-0.000171	-1.501889E-5	T	29314	2017.09.19 13:57:55.553833882	0000678	
65	0.000206	0.000102	-0.000167	-6.315568E-5	T	29314	2017.09.19 13:57:55.563833882	0000678	
65	0.000188	8.285908E-5	-0.000167	-2.000269E-5	T	29314	2017.09.19 13:57:55.573833882	0000678	
65	0.000228	0.000129	-0.000177	-6.334642E-5	T	29314	2017.09.19 13:57:55.583833882	0000678	
65	0.000213	0.000102	-0.000185	-2.408261E-5	T	29314	2017.09.19 13:57:55.593833882	0000678	
65	0.000197	8.254122E-5	-0.000171	-5.298471E-5	T	29314	2017.09.19 13:57:55.603833882	0000678	
65	0.000217	0.000101	-0.000185	-4.808160E-5	T	29314	2017.09.19 13:57:55.613833882	0000678	
65	0.000215	9.142974E-5	-0.000190	-3.897977E-5	T	29314	2017.09.19 13:57:55.623833882	0000678	
65	0.000184	8.682153E-5	-0.000157	-3.907599E-5	T	29314	2017.09.19 13:57:55.633833882	0000678	
66	0.000219	0.000101	-0.000185	-5.808118E-5	T	29347	2017.09.19 13:57:55.743921382	0000678	
66	0.000222	0.000130	-0.000177	-3.434763E-5	T	29347	2017.09.19 13:57:55.753921382	0000678	
66	0.000219	0.000121	-0.000177	-4.827373E-5	T	29347	2017.09.19 13:57:55.763921382	0000678	
66	0.000227	0.000129	-0.000177	-5.834663E-5	T	29347	2017.09.19 13:57:55.773921382	0000678	
66	0.000218	0.000121	-0.000181	-1.025457E-5	T	29347	2017.09.19 13:57:55.783921382	0000678	
66	0.000214	0.000110	-0.000172	-6.321239E-5	T	29347	2017.09.19 13:57:55.793921382	0000678	
66	0.000193	9.676120E-5	-0.000162	-3.913670E-5	T	29347	2017.09.19 13:57:55.803921382	0000678	
66	0.000200	0.000116	-0.000158	-4.331206E-5	T	29347	2017.09.19 13:57:55.813921382	0000678	
66	0.000216	0.000125	-0.000168	-5.334346E-5	T	29347	2017.09.19 13:57:55.823921382	0000678	
66	0.000209	0.000111	-0.000176	-1.519365E-5	T	29347	2017.09.19 13:57:55.833921382	0000678	
67	0.000200	7.250564E-5	-0.000181	-4.286217E-5	T	29311	2017.09.19 13:57:55.944008882	0000678	
67	0.000221	9.117761E-5	-0.000185	-7.699893E-5	T	29311	2017.09.19 13:57:55.954008882	0000678	
67	0.000214	0.000101	-0.000176	-6.711816E-5	T	29311	2017.09.19 13:57:55.964008882	0000678	
67	0.000209	0.000111	-0.000172	-4.321323E-5	T	29311	2017.09.19 13:57:55.974008882	0000678	
67	0.000205	0.000101	-0.000158	-8.219638E-5	T	29311	2017.09.19 13:57:55.984008882	0000678	
67	0.000188	5.868111E-5	-0.000176	-2.876946E-5	T	29311	2017.09.19 13:57:55.994008882	0000678	
67	0.000210	0.000101	-0.000176	-5.311874E-5	T	29311	2017.09.19 13:57:56.004008882	0000678	
67	0.000215	9.651117E-5	-0.000190	-2.902092E-5	T	29311	2017.09.19 13:57:56.014008882	0000678	
67	0.000204	0.000102	-0.000176	-6.120708E-6	T	29311	2017.09.19 13:57:56.024008882	0000678	
67	0.000205	7.251366E-5	-0.000190	-2.882540E-5	T	29311	2017.09.19 13:57:56.034008882	0000678	
68	0.000209	0.000111	-0.000176	-2.019344E-5	T	29325	2017.09.19 13:57:56.144096382	0000678	
68	0.000221	0.000115	-0.000177	-6.723221E-5	T	29325	2017.09.19 13:57:56.154096382	0000678	
68	0.000207	0.000105	-0.000163	-7.220864E-5	T	29325	2017.09.19 13:57:56.164096382	0000678	
68	0.000213	9.648850E-5	-0.000185	-3.904125E-5	T	29325	2017.09.19 13:57:56.174096382	0000678	
68	0.000205	0.000116	-0.000158	-6.331123E-5	T	29325	2017.09.19 13:57:56.184096382	0000678	
68	0.000236	0.000110	-0.000205	-4.307628E-5	T	29325	2017.09.19 13:57:56.194096382	0000678	
68	0.000214	0.000105	-0.000177	-5.815112E-5	T	29325	2017.09.19 13:57:56.204096382	0000678	
68	0.000226	0.000140	-0.000172	-4.344947E-5	T	29325	2017.09.19 13:57:56.214096382	0000678	
68	0.000225	0.000101	-0.000182	-8.609661E-5	T	29325	2017.09.19 13:57:56.224096382	0000678	
68	0.000199	9.154674E-5	-0.000167	-5.807442E-5	T	29325	2017.09.19 13:57:56.234096382	0000678	
69	0.000213	0.000121	-0.000172	-3.429507E-5	T	29317	2017.09.19 13:57:56.344183882	0000678	
69	0.000218	0.000110	-0.000182	-4.817152E-5	T	29317	2017.09.19 13:57:56.354183882	0000678	
69	0.000215	9.633925E-5	-0.000181	-6.305684E-5	T	29317	2017.09.19 13:57:56.364183882	0000678	
69	0.000199	8.663723E-5	-0.000176	-3.399734E-5	T	29317	2017.09.19 13:57:56.374183882	0000678	
69	0.000228	9.606236E-5	-0.000186	-9.103907E-5	T	29317	2017.09.19 13:57:56.384183882	0000678	
69	0.000198	8.658178E-5	-0.000171	-4.801751E-5	T	29317	2017.09.19 13:57:56.394183882	0000678	
69	0.000198	7.257940E-5	-0.000181	-3.386254E-5	T	29317	2017.09.19 13:57:56.404183882	0000678	
69	0.000202	8.257836E-5	-0.000181	-3.394401E-5	T	29317	2017.09.19 13:57:56.414183882	0000678	
69	0.000214	0.000111	-0.000181	-2.417252E-5	T	29317	2017.09.19 13:57:56.424183882	0000678	
69	0.000204	0.000111	-0.000171	-1.021461E-5	T	29317	2017.09.19 13:57:56.434183882	0000678	
70	0.000196	9.177794E-5	-0.000171	-2.405924E-5	T	29328	2017.09.19 13:57:56.544271382	0000678	
70	0.000191	8.656940E-5	-0.000152	-7.709515E-5	T	29328	2017.09.19 13:57:56.554271382	0000678	
70	0.000218	0.000125	-0.000177	-2.930711E-5	T	29328	2017.09.19 13:57:56.564271382	0000678	
70	0.000229	0.000110	-0.000186	-7.715371E-5	T	29328	2017.09.19 13:57:56.574271382	0000678	
70	0.000191	8.267060E-5	-0.000167	-4.300173E-5	T	29328	2017.09.19 13:57:56.584271382	0000678	
70	0.000221	0.000125	-0.000177	-4.830632E-5	T	29328	2017.09.19 13:57:56.594271382	0000678	
70	0.000222	0.000144	-0.000163	-4.351941E-5	T	29328	2017.09.19 13:57:56.604271382	0000678	
70	0.000219	0.000130	-0.000172	-3.936818E-5	T	29328	2017.09.19 13:57:56.614271382	0000678	
70	0.000221	0.000115	-0.000177	-6.723221E-5	T	29328	2017.09.19 13:57:56.624271382	0000678	
70	0.000215	9.133332E-5	-0.000185	-5.799972E-5	T	29328	2017.09.19 13:57:56.634271382	0000678	
71	0.000192	0.000116	-0.000144	-5.336974E-5	T	29335	2017.09.19 13:57:56.744358882	0000678	
71	0.000211	0.000111	-0.000176	-3.419285E-5	T	29335	2017.09.19 13:57:56.754358882	0000678	
71	0.000232	0.000120	-0.000177	-9.127194E-5	T	29335	2017.09.19 13:57:56.764358882	0000678	
71	0.000209	0.000106	-0.000176	-3.915191E-5	T	29335	2017.09.19 13:57:56.774358882	0000678	
71	0.000208	0.000102	-0.000181	-1.509958E-5	T	29335	2017.09.19 13:57:56.784358882	0000678	
71	0.000225	0.000110	-0.000191	-4.813417E-5	T	29335	2017.09.19 13:57:56.794358882	0000678	
71	0.000213	0.000101	-0.000181	-4.809820E-5	T	29335	2017.09.19 13:57:56.804358882	0000678	
71	0.000219	0.000125	-0.000177	-3.430690E-5	T	29335	2017.09.19 13:57:56.814358882	0000678	
71	0.000201	9.665450E-5	-0.000171	-3.909935E-5	T	29335	2017.09.19 13:57:56.824358882	0000678	
71	0.000194	8.656556E-5	-0.000162	-6.305423E-5	T	29335	2017.09.19 13:57:56.834358882	0000678	
72	0.000205	8.644055E-5	-0.000176	-5.799634E-5	T	29319	2017.09.19 13:57:56.944446382	0000678	
72	0.000201	9.665450E-5	-0.000171	-3.909935E-5	T	29319	2017.09.19 13:57:56.954446382	0000678	
72	0.000205	0.000116	-0.000167	-2.027152E-5	T	29319	2017.09.19 13:57:56.964446382	0000678	
72	0.000212	9.652948E-5	-0.000185	-3.404146E-5	T	29319	2017.09.19 13:57:56.974446382	0000678	
72	0.000216	0.000116	-0.000177	-4.823300E-5	T	29319	2017.09.19 13:57:56.984446382	0000678	
72	0.000209	0.000105	-0.000168	-6.718809E-5	T	29319	2017.09.19 13:57:56.994446382	0000678	
72	0.000208	0.000111	-0.000168	-5.322941E-5	T	29319	2017.09.19 13:57:57.004446382	0000678	
72	0.000215	9.633925E-5	-0.000181	-6.305684E-5	T	29319	2017.09.19 13:57:57.014446382	0000678	
72	0.000216	9.647020E-5	-0.000190	-3.402071E-5	T	29319	2017.09.19 13:57:57.024446382	0000678	
72	0.000221	0.000110	-0.000186	-4.815492E-5	T	29319	2017.09.19 13:57:57.034446382	0000678	
73	0.000200	0.000111	-0.000162	-3.425096E-5	T	29319	2017.09.19 13:57:57.144533882	0000678	
73	0.000177	6.891982E-5	-0.000162	-1.990940E-5	T	29319	2017.09.19 13:57:57.154533882	0000678	
73	0.000212	9.141527E-5	-0.000185	-4.800014E-5	T	29319	2017.09.19 13:57:57.164533882	0000678	
73	0.000225	0.000144	-0.000172	-2.448285E-5	T	29319	2017.09.19 13:57:57.174533882	0000678	
73	0.000205	0.000111	-0.000167	-3.923000E-5	T	29319	2017.09.19 13:57:57.184533882	0000678	
73	0.000205	0.000116	-0.000158	-6.331123E-5	T	29319	2017.09.19 13:57:57.194533882	0000678	
73	0.000196	7.252395E-5	-0.000176	-4.788271E-5	T	29319	2017.09.19 13:57:57.204533882	0000678	
73	0.000202	9.147298E-5	-0.000167	-6.707405E-5	T	29319	2017.09.19 13:57:57.214533882	0000678	
73	0.000203	0.000106	-0.000171	-2.917308E-5	T	29319	2017.09.19 13:57:57.224533882	0000678	
73	0.000212	8.633384E-5	-0.000185	-5.795899E-5	T	29319	2017.09.19 13:57:57.234533882	0000678	
74	0.000207	0.000111	-0.000171	-3.421361E-5	T	29330	2017.09.19 13:57:57.344621382	0000678	
74	0.000219	0.000130	-0.000168	-5.338419E-5	T	29330	2017.09.19 13:57:57.354621382	0000678	
74	0.000205	8.246363E-5	-0.000181	-4.794342E-5	T	29330	2017.09.19 13:57:57.364621382	0000678	
74	0.000207	0.000111	-0.000171	-3.421361E-5	T	29330	2017.09.19 13:57:57.374621382	0000678	
74	0.000205	0.000102	-0.000176	-2.012012E-5	T	29330	2017.09.19 13:57:57.384621382	0000678	
74	0.000199	8.654080E-5	-0.000171	-5.301730E-5	T	29330	2017.09.19 13:57:57.394621382	0000678	
74	0.000193	7.263868E-5	-0.000176	-3.388330E-5	T	29330	2017.09.19 13:57:57.404621382	0000678	
74	0.000205	9.659521E-5	-0.000176	-3.907860E-5	T	29330	2017.09.19 13:57:57.414621382	0000678	
74	0.000230	0.000144	-0.000177	-3.446168E-5	T	29330	2017.09.19 13:57:57.424621382	0000678	
74	0.000226	0.000140	-0.000172	-4.344947E-5	T	29330	2017.09.19 13:57:57.434621382	0000678	
75	0.000199	8.654080E-5	-0.000171	-5.301730E-5	T	29320	2017.09.19 13:57:57.544708882	0000678	
75	0.000208	9.139905E-5	-0.000176	-6.303686E-5	T	29320	2017.09.19 13:57:57.554708882	0000678	
75	0.000189	8.689964E-5	-0.000167	-1.503549E-5	T	29320	2017.09.19 13:57:57.564708882	0000678	
75	0.000183	7.273092E-5	-0.000162	-4.294102E-5	T	29320	2017.09.19 13:57:57.574708882	0000678	
75	0.000204	9.145833E-5	-0.000171	-6.305761E-5	T	29320	2017.09.19 13:57:57.584708882	0000678	
75	0.000209	9.653593E-5	-0.000181	-3.905785E-5	T	29320	2017.09.19 13:57:57.594708882	0000678	
75	0.000195	7.763816E-5	-0.000176	-3.392403E-5	T	29320	2017.09.19 13:57:57.604708882	0000678	
75	0.000217	0.000135	-0.000163	-4.844588E-5	T	29320	2017.09.19 13:57:57.614708882	0000678	
75	0.000201	0.000130	-0.000153	-1.544803E-5	T	29320	2017.09.19 13:57:57.624708882	0000678	
75	0.000206	9.139103E-5	-0.000167	-7.707363E-5	T	29320	2017.09.19 13:57:57.634708882	0000678	
76	0.000206	9.656243E-5	-0.000176	-4.307843E-5	T	29331	2017.09.19 13:57:57.744796382	0000678	
76	0.000213	9.638022E-5	-0.000181	-5.805705E-5	T	29331	2017.09.19 13:57:57.754796382	0000678	
76	0.000202	0.000102	-0.000167	-4.815630E-5	T	29331	2017.09.19 13:57:57.764796382	0000678	
76	0.000195	9.682485E-5	-0.000167	-2.411657E-5	T	29331	2017.09.19 13:57:57.774796382	0000678	
76	0.000206	9.656243E-5	-0.000176	-4.307843E-5	T	29331	2017.09.19 13:57:57.784796382	0000678	
76	0.000224	0.000135	-0.000172	-4.840853E-5	T	29331	2017.09.19 13:57:57.794796382	0000678	
76	0.000201	8.261933E-5	-0.000181	-2.894422E-5	T	29331	2017.09.19 13:57:57.804796382	0000678	
76	0.000220	7.210200E-5	-0.000195	-7.180286E-5	T	29331	2017.09.19 13:57:57.814796382	0000678	
76	0.000222	0.000135	-0.000168	-5.342492E-5	T	29331	2017.09.19 13:57:57.824796382	0000678	
76	0.000195	0.000111	-0.000153	-4.829187E-5	T	29331	2017.09.19 13:57:57.834796382	0000678	
77	0.000194	0.000102	-0.000152	-6.321793E-5	T	29327	2017.09.19 13:57:57.944883882	0000678	
77	0.000229	0.000144	-0.000177	-2.446210E-5	T	29327	2017.09.19 13:57:57.954883882	0000678	
77	0.000193	0.000106	-0.000157	-3.423097E-5	T	29327	2017.09.19 13:57:57.964883882	0000678	
77	0.000214	0.000130	-0.000163	-4.840515E-5	T	29327	2017.09.19 13:57:57.974883882	0000678	
77	0.000222	0.000105	-0.000182	-7.212979E-5	T	29327	2017.09.19 13:57:57.984883882	0000678	
77	0.000212	0.000102	-0.000181	-4.309841E-5	T	29327	2017.09.19 13:57:57.994883882	0000678	
77	0.000211	0.000125	-0.000168	-2.934446E-5	T	29327	2017.09.19 13:57:58.004883882	0000678	
77	0.000204	0.000106	-0.000167	-4.818889E-5	T	29327	2017.09.19 13:57:58.014883882	0000678	
77	0.000204	0.000102	-0.000167	-5.815589E-5	T	29327	2017.09.19 13:57:58.024883882	0000678	
77	0.000170	7.791470E-5	-0.000143	-4.806039E-5	T	29327	2017.09.19 13:57:58.034883882	0000678	
78	0.000211	0.000111	-0.000172	-5.321281E-5	T	29311	2017.09.19 13:57:58.144971382	0000678	
78	0.000214	0.000111	-0.000177	-4.819227E-5	T	29311	2017.09.19 13:57:58.154971382	0000678	
78	0.000210	9.650315E-5	-0.000181	-4.305768E-5	T	29311	2017.09.19 13:57:58.164971382	0000678	
78	0.000222	0.000105	-0.000190	-4.309365E-5	T	29311	2017.09.19 13:57:58.174971382	0000678	
78	0.000224	0.000124	-0.000177	-5.830590E-5	T	29311	2017.09.19 13:57:58.184971382	0000678	
78	0.000213	9.638022E-5	-0.000181	-5.805705E-5	T	29311	2017.09.19 13:57:58.194971382	0000678	
78	0.000227	0.000105	-0.000195	-4.807269E-5	T	29311	2017.09.19 13:57:58.204971382	0000678	
78	0.000222	0.000101	-0.000190	-5.306064E-5	T	29311	2017.09.19 13:57:58.214971382	0000678	
78	0.000224	0.000125	-0.000186	-5.270765E-6	T	29311	2017.09.19 13:57:58.224971382	0000678	
78	0.000201	0.000102	-0.000171	-2.414071E-5	T	29311	2017.09.19 13:57:58.234971382	0000678	
79	0.000232	0.000124	-0.000186	-6.326834E-5	T	29306	2017.09.19 13:57:58.345058882	0000678	
79	0.000219	0.000121	-0.000177	-4.827373E-5	T	29306	2017.09.19 13:57:58.355058882	0000678	
79	0.000219	0.000121	-0.000177	-4.827373E-5	T	29306	2017.09.19 13:57:58.365058882	0000678	
79	0.000210	0.000121	-0.000172	-1.529586E-5	T	29306	2017.09.19 13:57:58.375058882	0000678	
79	0.000216	0.000125	-0.000168	-5.334346E-5	T	29306	2017.09.19 13:57:58.385058882	0000678	
79	0.000221	0.000121	-0.000182	-3.425357E-5	T	29306	2017.09.19 13:57:58.395058882	0000678	
79	0.000209	8.237523E-5	-0.000185	-5.292661E-5	T	29306	2017.09.19 13:57:58.405058882	0000678	
79	0.000209	9.653593E-5	-0.000181	-3.905785E-5	T	29306	2017.09.19 13:57:58.415058882	0000678	
79	0.000173	7.789639E-5	-0.000148	-4.303985E-5	T	29306	2017.09.19 13:57:58.425058882	0000678	
79	0.000235	0.000129	-0.000191	-4.828895E-5	T	29306	2017.09.19 13:57:58.435058882	0000678	
80	0.000194	8.253320E-5	-0.000162	-6.702148E-5	T	29329	2017.09.19 13:57:58.545146382	0000678	
80	0.000209	8.645676E-5	-0.000185	-4.295962E-5	T	29329	2017.09.19 13:57:58.555146382	0000678	
80	0.000210	0.000111	-0.000176	-2.419327E-5	T	29329	2017.09.19 13:57:58.565146382	0000678	
80	0.000182	7.276370E-5	-0.000162	-3.894119E-5	T	29329	2017.09.19 13:57:58.575146382	0000678	
80	0.000194	9.174342E-5	-0.000167	-3.407543E-5	T	29329	2017.09.19 13:57:58.585146382	0000678	
80	0.000209	0.000106	-0.000176	-3.915191E-5	T	29329	2017.09.19 13:57:58.595146382	0000678	
80	0.000224	0.000135	-0.000177	-2.438878E-5	T	29329	2017.09.19 13:57:58.605146382	0000678	
80	0.000186	9.182101E-5	-0.000157	-3.911672E-5	T	29329	2017.09.19 13:57:58.615146382	0000678	
80	0.000196	0.000102	-0.000162	-4.317726E-5	T	29329	2017.09.19 13:57:58.625146382	0000678	
80	0.000191	8.267060E-5	-0.000167	-4.300173E-5	T	29329	2017.09.19 13:57:58.635146382	0000678	
81	0.000225	0.000134	-0.000168	-6.742434E-5	T	29320	2017.09.19 13:57:58.745233882	0000678	
81	0.000209	0.000110	-0.000163	-7.224937E-5	T	29320	2017.09.19 13:57:58.755233882	0000678	
81	0.000224	0.000125	-0.000182	-4.328578E-5	T	29320	2017.09.19 13:57:58.765233882	0000678	
81	0.000198	9.666914E-5	-0.000167	-4.311578E-5	T	29320	2017.09.19 13:57:58.775233882	0000678	
81	0.000225	0.000115	-0.000182	-6.721146E-5	T	29320	2017.09.19 13:57:58.785233882	0000678	
81	0.000221	0.000105	-0.000186	-5.811377E-5	T	29320	2017.09.19 13:57:58.795233882	0000678	
81	0.000213	0.000135	-0.000163	-2.444688E-5	T	29320	2017.09.19 13:57:58.805233882	0000678	
81	0.000211	0.000125	-0.000163	-4.836442E-5	T	29320	2017.09.19 13:57:58.815233882	0000678	
81	0.000208	9.637604E-5	-0.000163	-8.613473E-5	T	29320	2017.09.19 13:57:58.825233882	0000678	
81	0.000215	0.000105	-0.000177	-6.315091E-5	T	29320	2017.09.19 13:57:58.835233882	0000678	
82	0.000209	0.000101	-0.000171	-6.313908E-5	T	29305	2017.09.19 13:57:58.945321382	0000678	
82	0.000214	0.000111	-0.000177	-4.819227E-5	T	29305	2017.09.19 13:57:58.955321382	0000678	
82	0.000233	0.000140	-0.000182	-3.940814E-5	T	29305	2017.09.19 13:57:58.965321382	0000678	
82	0.000208	0.000111	-0.000168	-5.322941E-5	T	29305	2017.09.19 13:57:58.975321382	0000678	
82	0.000193	7.254226E-5	-0.000171	-5.290325E-5	T	29305	2017.09.19 13:57:58.985321382	0000678	
82	0.000209	0.000102	-0.000176	-4.811895E-5	T	29305	2017.09.19 13:57:58.995321382	0000678	
82	0.000211	0.000106	-0.000181	-2.013196E-5	T	29305	2017.09.19 13:57:59.005321382	0000678	
82	0.000204	0.000116	-0.000167	-2.723578E-7	T	29305	2017.09.19 13:57:59.015321382	0000678	
82	0.000218	0.000101	-0.000185	-5.308139E-5	T	29305	2017.09.19 13:57:59.025321382	0000678	
82	0.000229	0.000105	-0.000196	-5.807227E-5	T	29305	2017.09.19 13:57:59.035321382	0000678	
83	0.000209	0.000110	-0.000163	-7.224937E-5	T	29342	2017.09.19 13:57:59.145408882	0000678	
83	0.000209	0.000111	-0.000168	-5.822920E-5	T	29342	2017.09.19 13:57:59.155408882	0000678	
83	0.000218	0.000115	-0.000172	-6.725296E-5	T	29342	2017.09.19 13:57:59.165408882	0000678	
83	0.000201	0.000106	-0.000162	-5.320943E-5	T	29342	2017.09.19 13:57:59.175408882	0000678	
83	0.000193	8.262962E-5	-0.000167	-4.800152E-5	T	29342	2017.09.19 13:57:59.185408882	0000678	
83	0.000194	8.662921E-5	-0.000167	-4.803411E-5	T	29342	2017.09.19 13:57:59.195408882	0000678	
83	0.000207	0.000121	-0.000168	-1.531246E-5	T	29342	2017.09.19 13:57:59.205408882	0000678	
83	0.000227	0.000129	-0.000172	-7.236680E-5	T	29342	2017.09.19 13:57:59.215408882	0000678	
83	0.000213	8.626653E-5	-0.000181	-7.197501E-5	T	29342	2017.09.19 13:57:59.225408882	0000678	
83	0.000197	8.263764E-5	-0.000176	-3.396476E-5	T	29342	2017.09.19 13:57:59.235408882	0000678	
84	0.000190	8.264793E-5	-0.000162	-5.302206E-5	T	29325	2017.09.19 13:57:59.345496382	0000678	
84	0.000187	9.199938E-5	-0.000162	-1.009718E-5	T	29325	2017.09.19 13:57:59.355496382	0000678	
84	0.000230	0.000154	-0.000153	-7.764095E-5	T	29325	2017.09.19 13:57:59.365496382	0000678	
84	0.000229	0.000124	-0.000182	-6.328494E-5	T	29325	2017.09.19 13:57:59.375496382	0000678	
84	0.000216	0.000101	-0.000177	-7.211795E-5	T	29325	2017.09.19 13:57:59.385496382	0000678	
84	0.000193	0.000111	-0.000157	-5.272918E-6	T	29325	2017.09.19 13:57:59.395496382	0000678	
84	0.000198	0.000106	-0.000158	-5.822997E-5	T	29325	2017.09.19 13:57:59.405496382	0000678	
84	0.000208	9.135006E-5	-0.000167	-8.207342E-5	T	29325	2017.09.19 13:57:59.415496382	0000678	
84	0.000195	8.669651E-5	-0.000171	-3.401809E-5	T	29325	2017.09.19 13:57:59.425496382	0000678	
84	0.000198	6.346560E-5	-0.000181	-4.778864E-5	T	29325	2017.09.19 13:57:59.435496382	0000678	
85	0.000213	0.000116	-0.000177	-2.923380E-5	T	29326	2017.09.19 13:57:59.545583882	0000678	
85	0.000206	9.157742E-5	-0.000181	-3.401732E-5	T	29326	2017.09.19 13:57:59.555583882	0000678	
85	0.000197	0.000106	-0.000157	-5.323018E-5	T	29326	2017.09.19 13:57:59.565583882	0000678	
85	0.000215	0.000111	-0.000181	-3.417210E-5	T	29326	2017.09.19 13:57:59.575583882	0000678	
85	0.000211	8.224428E-5	-0.000176	-8.196275E-5	T	29326	2017.09.19 13:57:59.585583882	0000678	
85	0.000206	0.000106	-0.000176	-1.015313E-5	T	29326	2017.09.19 13:57:59.595583882	0000678	
85	0.000216	0.000130	-0.000163	-5.840473E-5	T	29326	2017.09.19 13:57:59.605583882	0000678	
85	0.000213	0.000121	-0.000163	-6.733104E-5	T	29326	2017.09.19 13:57:59.615583882	0000678	
85	0.000212	0.000125	-0.000168	-3.434425E-5	T	29326	2017.09.19 13:57:59.625583882	0000678	
85	0.000205	6.326892E-5	-0.000181	-7.178764E-5	T	29326	2017.09.19 13:57:59.635583882	0000678	
86	0.000211	0.000106	-0.000176	-4.815154E-5	T	29316	2017.09.19 13:57:59.745671382	0000678	
86	0.000212	0.000116	-0.000172	-4.825375E-5	T	29316	2017.09.19 13:57:59.755671382	0000678	
86	0.000219	0.000110	-0.000177	-6.719148E-5	T	29316	2017.09.19 13:57:59.765671382	0000678	
86	0.000217	9.624283E-5	-0.000176	-8.207680E-5	T	29316	2017.09.19 13:57:59.775671382	0000678	
86	0.000203	7.238272E-5	-0.000181	-5.786154E-5	T	29316	2017.09.19 13:57:59.785671382	0000678	
86	0.000207	0.000116	-0.000168	-3.927073E-5	T	29316	2017.09.19 13:57:59.795671382	0000678	
86	0.000226	0.000115	-0.000177	-8.223158E-5	T	29316	2017.09.19 13:57:59.805671382	0000678	
86	0.000219	0.000130	-0.000177	-5.348847E-6	T	29316	2017.09.19 13:57:59.815671382	0000678	
86	0.000212	0.000102	-0.000181	-4.309841E-5	T	29316	2017.09.19 13:57:59.825671382	0000678	
86	0.000234	0.000144	-0.000182	-3.444093E-5	T	29316	2017.09.19 13:57:59.835671382	0000678	
87	0.000193	9.168797E-5	-0.000162	-4.809559E-5	T	29325	2017.09.19 13:57:59.945758882	0000678	
87	0.000199	9.162223E-5	-0.000171	-4.305845E-5	T	29325	2017.09.19 13:57:59.955758882	0000678	
87	0.000232	0.000115	-0.000186	-7.719444E-5	T	29325	2017.09.19 13:57:59.965758882	0000678	
87	0.000204	9.145833E-5	-0.000171	-6.305761E-5	T	29325	2017.09.19 13:57:59.975758882	0000678	
87	0.000202	9.649077E-5	-0.000162	-7.213532E-5	T	29325	2017.09.19 13:57:59.985758882	0000678	
87	0.000208	0.000102	-0.000181	-1.509958E-5	T	29325	2017.09.19 13:57:59.995758882	0000678	
87	0.000224	0.000130	-0.000182	-2.032747E-5	T	29325	2017.09.19 13:58:00.005758882	0000678	
87	0.000231	0.000134	-0.000182	-4.836703E-5	T	29325	2017.09.19 13:58:00.015758882	0000678	
87	0.000205	0.000106	-0.000163	-6.720884E-5	T	29325	2017.09.19 13:58:00.025758882	0000678	
87	0.000211	9.657045E-5	-0.000185	-2.904167E-5	T	29325	2017.09.19 13:58:00.035758882	0000678	
88	0.000211	9.138074E-5	-0.000181	-5.801632E-5	T	29316	2017.09.19 13:58:00.145846382	0000678	
88	0.000200	8.245927E-5	-0.000171	-6.298430E-5	T	29316	2017.09.19 13:58:00.155846382	0000678	
88	0.000196	9.166966E-5	-0.000167	-4.307505E-5	T	29316	2017.09.19 13:58:00.165846382	0000678	
88	0.000207	9.652146E-5	-0.000176	-4.807822E-5	T	29316	2017.09.19 13:58:00.175846382	0000678	
88	0.000192	7.258323E-5	-0.000171	-4.790346E-5	T	29316	2017.09.19 13:58:00.185846382	0000678	
88	0.000215	0.000116	-0.000177	-4.323321E-5	T	29316	2017.09.19 13:58:00.195846382	0000678	
88	0.000198	8.658178E-5	-0.000171	-4.801751E-5	T	29316	2017.09.19 13:58:00.205846382	0000678	
88	0.000214	0.000111	-0.000181	-2.917231E-5	T	29316	2017.09.19 13:58:00.215846382	0000678	
88	0.000219	0.000106	-0.000190	-2.409444E-5	T	29316	2017.09.19 13:58:00.225846382	0000678	
88	0.000204	0.000111	-0.000171	-5.214817E-6	T	29316	2017.09.19 13:58:00.235846382	0000678	
89	0.000209	0.000102	-0.000176	-4.811895E-5	T	29330	2017.09.19 13:58:00.345933882	0000678	
89	0.000215	9.124335E-5	-0.000176	-8.203607E-5	T	29330	2017.09.19 13:58:00.355933882	0000678	
89	0.000204	9.152198E-5	-0.000176	-4.803749E-5	T	29330	2017.09.19 13:58:00.365933882	0000678	
89	0.000219	0.000115	-0.000172	-7.225275E-5	T	29330	2017.09.19 13:58:00.375933882	0000678	
89	0.000204	0.000106	-0.000163	-6.320901E-5	T	29330	2017.09.19 13:58:00.385933882	0000678	
89	0.000230	0.000129	-0.000186	-3.931008E-5	T	29330	2017.09.19 13:58:00.395933882	0000678	
89	0.000208	0.000106	-0.000176	-2.915233E-5	T	29330	2017.09.19 13:58:00.405933882	0000678	
89	0.000185	9.709912E-5	-0.000157	-5.158869E-6	T	29330	2017.09.19 13:58:00.415933882	0000678	
89	0.000224	0.000115	-0.000172	-8.625216E-5	T	29330	2017.09.19 13:58:00.425933882	0000678	
89	0.000175	9.710940E-5	-0.000143	-2.421618E-5	T	29330	2017.09.19 13:58:00.435933882	0000678	
90	0.000215	0.000116	-0.000177	-3.923338E-5	T	29325	2017.09.19 13:58:00.546021382	0000678	
90	0.000200	0.000102	-0.000162	-5.817664E-5	T	29325	2017.09.19 13:58:00.556021382	0000678	
90	0.000203	8.648152E-5	-0.000176	-5.299655E-5	T	29325	2017.09.19 13:58:00.566021382	0000678	
90	0.000212	0.000130	-0.000168	-3.864062E-7	T	29325	2017.09.19 13:58:00.576021382	0000678	
90	0.000206	0.000106	-0.000171	-4.317250E-5	T	29325	2017.09.19 13:58:00.586021382	0000678	
90	0.000204	0.000106	-0.000167	-4.818889E-5	T	29325	2017.09.19 13:58:00.596021382	0000678	
90	0.000196	0.000106	-0.000157	-4.823039E-5	T	29325	2017.09.19 13:58:00.606021382	0000678	
90	0.000211	9.127630E-5	-0.000167	-9.107304E-5	T	29325	2017.09.19 13:58:00.616021382	0000678	
90	0.000220	0.000125	-0.000177	-4.330653E-5	T	29325	2017.09.19 13:58:00.626021382	0000678	
90	0.000211	0.000106	-0.000176	-4.815154E-5	T	29325	2017.09.19 13:58:00.636021382	0000678	
91	0.000189	8.672946E-5	-0.000162	-4.305507E-5	T	29312	2017.09.19 13:58:00.746108882	0000678	
91	0.000196	7.269413E-5	-0.000181	-1.986313E-5	T	29312	2017.09.19 13:58:00.756108882	0000678	
91	0.000213	0.000116	-0.000168	-6.326972E-5	T	29312	2017.09.19 13:58:00.766108882	0000678	
91	0.000191	0.000102	-0.000157	-3.419839E-5	T	29312	2017.09.19 13:58:00.776108882	0000678	
91	0.000207	9.645782E-5	-0.000171	-6.309834E-5	T	29312	2017.09.19 13:58:00.786108882	0000678	
91	0.000214	0.000125	-0.000158	-7.238417E-5	T	29312	2017.09.19 13:58:00.796108882	0000678	
91	0.000210	0.000111	-0.000172	-4.821302E-5	T	29312	2017.09.19 13:58:00.806108882	0000678	
91	0.000202	9.163671E-5	-0.000176	-3.403808E-5	T	29312	2017.09.19 13:58:00.816108882	0000678	
91	0.000211	0.000102	-0.000181	-3.409879E-5	T	29312	2017.09.19 13:58:00.826108882	0000678	
91	0.000190	9.691691E-5	-0.000162	-2.013749E-5	T	29312	2017.09.19 13:58:00.836108882	0000678	
92	0.000209	0.000111	-0.000172	-4.321323E-5	T	29318	2017.09.19 13:58:00.946196382	0000678	
92	0.000229	0.000115	-0.000191	-5.317469E-5	T	29318	2017.09.19 13:58:00.956196382	0000678	
92	0.000224	0.000121	-0.000186	-3.423697E-5	T	29318	2017.09.19 13:58:00.966196382	0000678	
92	0.000193	0.000116	-0.000152	-2.033377E-5	T	29318	2017.09.19 13:58:00.976196382	0000678	
92	0.000188	6.865740E-5	-0.000171	-3.887125E-5	T	29318	2017.09.19 13:58:00.986196382	0000678	
92	0.000184	9.190296E-5	-0.000157	-2.911713E-5	T	29318	2017.09.19 13:58:00.996196382	0000678	
92	0.000199	8.650628E-5	-0.000167	-6.303348E-5	T	29318	2017.09.19 13:58:01.006196382	0000678	
92	0.000224	0.000140	-0.000172	-3.444985E-5	T	29318	2017.09.19 13:58:01.016196382	0000678	
92	0.000216	7.216128E-5	-0.000190	-7.182361E-5	T	29318	2017.09.19 13:58:01.026196382	0000678	
92	0.000214	0.000106	-0.000185	-2.011536E-5	T	29318	2017.09.19 13:58:01.036196382	0000678	
93	0.000228	0.000120	-0.000182	-6.725219E-5	T	29325	2017.09.19 13:58:01.146283882	0000678	
93	0.000233	0.000120	-0.000172	-0.000101	T	29325	2017.09.19 13:58:01.156283882	0000678	
93	0.000213	0.000116	-0.000177	-2.923380E-5	T	29325	2017.09.19 13:58:01.166283882	0000678	
93	0.000216	0.000116	-0.000177	-4.823300E-5	T	29325	2017.09.19 13:58:01.176283882	0000678	
93	0.000188	8.676224E-5	-0.000162	-3.905524E-5	T	29325	2017.09.19 13:58:01.186283882	0000678	
93	0.000213	9.128432E-5	-0.000176	-7.703628E-5	T	29325	2017.09.19 13:58:01.196283882	0000678	
93	0.000206	0.000106	-0.000176	-1.535444E-7	T	29325	2017.09.19 13:58:01.206283882	0000678	
93	0.000203	0.000130	-0.000153	-3.444724E-5	T	29325	2017.09.19 13:58:01.216283882	0000678	
93	0.000209	0.000101	-0.000171	-6.313908E-5	T	29325	2017.09.19 13:58:01.226283882	0000678	
93	0.000194	8.662921E-5	-0.000167	-4.803411E-5	T	29325	2017.09.19 13:58:01.236283882	0000678	
94	0.000219	0.000110	-0.000185	-3.915530E-5	T	29325	2017.09.19 13:58:01.346371382	0000678	
94	0.000222	0.000105	-0.000182	-7.212979E-5	T	29325	2017.09.19 13:58:01.356371382	0000678	
94	0.000204	8.250460E-5	-0.000181	-4.294363E-5	T	29325	2017.09.19 13:58:01.366371382	0000678	
94	0.000213	9.648850E-5	-0.000185	-3.904125E-5	T	29325	2017.09.19 13:58:01.376371382	0000678	
94	0.000178	6.874964E-5	-0.000157	-4.792898E-5	T	29325	2017.09.19 13:58:01.386371382	0000678	
94	0.000213	0.000116	-0.000168	-6.326972E-5	T	29325	2017.09.19 13:58:01.396371382	0000678	
94	0.000219	9.625904E-5	-0.000185	-6.704008E-5	T	29325	2017.09.19 13:58:01.406371382	0000678	
94	0.000187	8.266624E-5	-0.000157	-5.804261E-5	T	29325	2017.09.19 13:58:01.416371382	0000678	
94	0.000224	0.000101	-0.000195	-3.904048E-5	T	29325	2017.09.19 13:58:01.426371382	0000678	
94	0.000216	0.000125	-0.000177	-1.030791E-5	T	29325	2017.09.19 13:58:01.436371382	0000678	
95	0.000205	0.000111	-0.000168	-4.322983E-5	T	29328	2017.09.19 13:58:01.546458882	0000678	
95	0.000201	9.662172E-5	-0.000171	-4.309918E-5	T	29328	2017.09.19 13:58:01.556458882	0000678	
95	0.000205	0.000116	-0.000167	-2.027152E-5	T	29328	2017.09.19 13:58:01.566458882	0000678	
95	0.000207	9.144003E-5	-0.000176	-5.803707E-5	T	29328	2017.09.19 13:58:01.576458882	0000678	
95	0.000197	9.162869E-5	-0.000167	-4.807484E-5	T	29328	2017.09.19 13:58:01.586458882	0000678	
95	0.000191	8.674394E-5	-0.000167	-3.403469E-5	T	29328	2017.09.19 13:58:01.596458882	0000678	
95	0.000221	0.000135	-0.000172	-3.440912E-5	T	29328	2017.09.19 13:58:01.606458882	0000678	
95	0.000185	9.687977E-5	-0.000152	-3.917820E-5	T	29328	2017.09.19 13:58:01.616458882	0000678	
95	0.000207	0.000101	-0.000167	-6.715551E-5	T	29328	2017.09.19 13:58:01.626458882	0000678	
95	0.000194	7.758271E-5	-0.000171	-4.794419E-5	T	29328	2017.09.19 13:58:01.636458882	0000678	
96	0.000200	8.659625E-5	-0.000176	-3.899713E-5	T	29326	2017.09.19 13:58:01.746546382	0000678	
96	0.000211	0.000106	-0.000181	-2.413179E-5	T	29326	2017.09.19 13:58:01.756546382	0000678	
96	0.000202	9.654622E-5	-0.000167	-5.811515E-5	T	29326	2017.09.19 13:58:01.766546382	0000678	
96	0.000195	8.262317E-5	-0.000171	-4.298513E-5	T	29326	2017.09.19 13:58:01.776546382	0000678	
96	0.000212	9.636575E-5	-0.000176	-6.707743E-5	T	29326	2017.09.19 13:58:01.786546382	0000678	
96	0.000207	0.000116	-0.000168	-3.927073E-5	T	29326	2017.09.19 13:58:01.796546382	0000678	
96	0.000227	0.000129	-0.000177	-5.834663E-5	T	29326	2017.09.19 13:58:01.806546382	0000678	
96	0.000197	0.000106	-0.000162	-3.421022E-5	T	29326	2017.09.19 13:58:01.816546382	0000678	
96	0.000218	0.000110	-0.000182	-4.817152E-5	T	29326	2017.09.19 13:58:01.826546382	0000678	
96	0.000213	0.000116	-0.000177	-2.923380E-5	T	29326	2017.09.19 13:58:01.836546382	0000678	
97	0.000214	0.000105	-0.000177	-5.815112E-5	T	29338	2017.09.19 13:58:01.946633882	0000678	
97	0.000184	8.268454E-5	-0.000152	-6.306315E-5	T	29338	2017.09.19 13:58:01.956633882	0000678	
97	0.000207	0.000102	-0.000176	-3.911933E-5	T	29338	2017.09.19 13:58:01.966633882	0000678	
97	0.000210	0.000116	-0.000172	-3.425434E-5	T	29338	2017.09.19 13:58:01.976633882	0000678	
97	0.000196	0.000102	-0.000167	-1.515768E-5	T	29338	2017.09.19 13:58:01.986633882	0000678	
97	0.000191	0.000106	-0.000157	-2.423139E-5	T	29338	2017.09.19 13:58:01.996633882	0000678	
97	0.000199	0.000121	-0.000157	-5.354381E-6	T	29338	2017.09.19 13:58:02.006633882	0000678	
97	0.000220	0.000115	-0.000168	-8.226893E-5	T	29338	2017.09.19 13:58:02.016633882	0000678	
97	0.000205	0.000130	-0.000149	-5.346304E-5	T	29338	2017.09.19 13:58:02.026633882	0000678	
97	0.000209	0.000101	-0.000168	-7.215530E-5	T	29338	2017.09.19 13:58:02.036633882	0000678	
98	0.000197	0.000111	-0.000158	-4.327133E-5	T	29347	2017.09.19 13:58:02.146721382	0000678	
98	0.000205	9.647246E-5	-0.000167	-6.711478E-5	T	29347	2017.09.19 13:58:02.156721382	0000678	
98	0.000194	0.000102	-0.000152	-6.321793E-5	T	29347	2017.09.19 13:58:02.166721382	0000678	
98	0.000235	0.000129	-0.000186	-6.330907E-5	T	29347	2017.09.19 13:58:02.176721382	0000678	
98	0.000218	0.000101	-0.000185	-5.308139E-5	T	29347	2017.09.19 13:58:02.186721382	0000678	
98	0.000214	0.000116	-0.000172	-5.325354E-5	T	29347	2017.09.19 13:58:02.196721382	0000678	
98	0.000201	0.000102	-0.000167	-4.315651E-5	T	29347	2017.09.19 13:58:02.206721382	0000678	
98	0.000208	0.000116	-0.000163	-5.829068E-5	T	29347	2017.09.19 13:58:02.216721382	0000678	
98	0.000187	9.178823E-5	-0.000157	-4.311655E-5	T	29347	2017.09.19 13:58:02.226721382	0000678	
98	0.000207	0.000121	-0.000167	-1.031267E-5	T	29347	2017.09.19 13:58:02.236721382	0000678	
99	0.000213	0.000102	-0.000185	-2.908240E-5	T	29328	2017.09.19 13:58:02.346808882	0000678	
99	0.000216	0.000102	-0.000190	-5.062650E-6	T	29328	2017.09.19 13:58:02.356808882	0000678	
99	0.000203	0.000125	-0.000149	-5.842210E-5	T	29328	2017.09.19 13:58:02.366808882	0000678	
99	0.000200	0.000106	-0.000167	-2.918968E-5	T	29328	2017.09.19 13:58:02.376808882	0000678	
99	0.000196	0.000102	-0.000162	-4.317726E-5	T	29328	2017.09.19 13:58:02.386808882	0000678	
99	0.000209	0.000102	-0.000181	-2.409921E-5	T	29328	2017.09.19 13:58:02.396808882	0000678	
99	0.000216	0.000130	-0.000168	-4.338461E-5	T	29328	2017.09.19 13:58:02.406808882	0000678	
99	0.000191	8.674394E-5	-0.000167	-3.403469E-5	T	29328	2017.09.19 13:58:02.416808882	0000678	
99	0.000227	0.000135	-0.000182	-2.436803E-5	T	29328	2017.09.19 13:58:02.426808882	0000678	
99	0.000205	0.000106	-0.000171	-3.917266E-5	T	29328	2017.09.19 13:58:02.436808882	0000678	
100	0.000219	0.000116	-0.000185	-5.197448E-6	T	29319	2017.09.19 13:58:02.546896382	0000678	
100	0.000193	7.762369E-5	-0.000171	-4.294440E-5	T	29319	2017.09.19 13:58:02.556896382	0000678	
100	0.000207	0.000105	-0.000163	-7.220864E-5	T	29319	2017.09.19 13:58:02.566896382	0000678	
100	0.000207	0.000105	-0.000163	-7.220864E-5	T	29319	2017.09.19 13:58:02.576896382	0000678	
100	0.000211	8.224428E-5	-0.000176	-8.196275E-5	T	29319	2017.09.19 13:58:02.586896382	0000678	
100	0.000206	0.000106	-0.000168	-5.818847E-5	T	29319	2017.09.19 13:58:02.596896382	0000678	
100	0.000209	9.638406E-5	-0.000171	-7.209797E-5	T	29319	2017.09.19 13:58:02.606896382	0000678	
100	0.000202	0.000106	-0.000163	-5.820922E-5	T	29319	2017.09.19 13:58:02.616896382	0000678	
100	0.000206	0.000111	-0.000171	-2.921381E-5	T	29319	2017.09.19 13:58:02.626896382	0000678	
100	0.000181	7.280467E-5	-0.000162	-3.394140E-5	T	29319	2017.09.19 13:58:02.636896382	0000678	
101	0.000238	0.000143	-0.000182	-5.344014E-5	T	29332	2017.09.19 13:58:02.746983882	0000678	
101	0.000211	6.320319E-5	-0.000190	-6.675050E-5	T	29332	2017.09.19 13:58:02.756983882	0000678	
101	0.000206	0.000102	-0.000167	-6.315568E-5	T	29332	2017.09.19 13:58:02.766983882	0000678	
101	0.000204	9.145833E-5	-0.000171	-6.305761E-5	T	29332	2017.09.19 13:58:02.776983882	0000678	
101	0.000200	7.748246E-5	-0.000176	-5.292323E-5	T	29332	2017.09.19 13:58:02.786983882	0000678	
101	0.000188	7.770390E-5	-0.000167	-3.896117E-5	T	29332	2017.09.19 13:58:02.796983882	0000678	
101	0.000202	0.000102	-0.000167	-4.815630E-5	T	29332	2017.09.19 13:58:02.806983882	0000678	
101	0.000228	0.000129	-0.000177	-6.334642E-5	T	29332	2017.09.19 13:58:02.816983882	0000678	
101	0.000196	9.177794E-5	-0.000171	-2.405924E-5	T	29332	2017.09.19 13:58:02.826983882	0000678	
101	0.000219	9.622452E-5	-0.000181	-7.705626E-5	T	29332	2017.09.19 13:58:02.836983882	0000678	
102	0.000187	6.863108E-5	-0.000167	-4.788748E-5	T	29319	2017.09.19 13:58:02.947071382	0000678	
102	0.000216	0.000115	-0.000172	-6.325312E-5	T	29319	2017.09.19 13:58:02.957071382	0000678	
102	0.000228	0.000110	-0.000186	-7.215392E-5	T	29319	2017.09.19 13:58:02.967071382	0000678	
102	0.000209	0.000116	-0.000172	-2.925455E-5	T	29319	2017.09.19 13:58:02.977071382	0000678	
102	0.000201	9.665450E-5	-0.000171	-3.909935E-5	T	29319	2017.09.19 13:58:02.987071382	0000678	
102	0.000210	0.000115	-0.000153	-8.633101E-5	T	29319	2017.09.19 13:58:02.997071382	0000678	
102	0.000209	9.157097E-5	-0.000185	-2.900093E-5	T	29319	2017.09.19 13:58:03.007071382	0000678	
102	0.000220	0.000105	-0.000185	-5.311398E-5	T	29319	2017.09.19 13:58:03.017071382	0000678	
102	0.000203	9.156295E-5	-0.000176	-4.303770E-5	T	29319	2017.09.19 13:58:03.027071382	0000678	
102	0.000180	5.874684E-5	-0.000167	-3.380660E-5	T	29319	2017.09.19 13:58:03.037071382	0000678	
103	0.000204	0.000102	-0.000171	-4.313991E-5	T	29346	2017.09.19 13:58:03.147158882	0000678	
103	0.000210	0.000105	-0.000172	-5.817187E-5	T	29346	2017.09.19 13:58:03.157158882	0000678	
103	0.000219	0.000115	-0.000177	-5.823258E-5	T	29346	2017.09.19 13:58:03.167158882	0000678	
103	0.000214	0.000110	-0.000172	-6.321239E-5	T	29346	2017.09.19 13:58:03.177158882	0000678	
103	0.000196	0.000102	-0.000157	-5.819739E-5	T	29346	2017.09.19 13:58:03.187158882	0000678	
103	0.000203	0.000116	-0.000158	-5.331164E-5	T	29346	2017.09.19 13:58:03.197158882	0000678	
103	0.000200	0.000102	-0.000167	-3.915668E-5	T	29346	2017.09.19 13:58:03.207158882	0000678	
103	0.000237	0.000134	-0.000172	-9.140673E-5	T	29346	2017.09.19 13:58:03.217158882	0000678	
103	0.000224	0.000105	-0.000182	-7.712958E-5	T	29346	2017.09.19 13:58:03.227158882	0000678	
103	0.000206	9.643149E-5	-0.000167	-7.211457E-5	T	29346	2017.09.19 13:58:03.237158882	0000678	
