Block	B	Bx	By	Bz	Units	Temperature	Timestamp	Serial No.	Comment
0	0.000199	-2.607302E-5	0.000192	-4.356691E-5	T	29245	2017.09.19 13:43:27.164083882	0000678	
0	0.000185	-3.120571E-5	0.000178	-3.946825E-5	T	29245	2017.09.19 13:43:27.174083882	0000678	
0	0.000198	-1.707395E-5	0.000192	-4.364023E-5	T	29245	2017.09.19 13:43:27.184083882	0000678	
0	0.000172	-3.108662E-5	0.000168	-1.042796E-5	T	29245	2017.09.19 13:43:27.194083882	0000678	
0	0.000205	-2.605471E-5	0.000197	-4.858746E-5	T	29245	2017.09.19 13:43:27.204083882	0000678	
0	0.000198	-1.741832E-5	0.000183	-7.260167E-5	T	29245	2017.09.19 13:43:27.214083882	0000678	
0	0.000217	-3.577295E-5	0.000211	-3.456468E-5	T	29245	2017.09.19 13:43:27.224083882	0000678	
0	0.000217	-3.106095E-6	0.000206	-6.781138E-5	T	29245	2017.09.19 13:43:27.234083882	0000678	
0	0.000181	-3.626447E-5	0.000173	-3.940677E-5	T	29245	2017.09.19 13:43:27.244083882	0000678	
0	0.000198	2.171843E-6	0.000197	-2.081672E-5	T	29245	2017.09.19 13:43:27.254083882	0000678	
1	0.000205	-3.565386E-5	0.000201	-5.524389E-6	T	29246	2017.09.19 13:43:27.364171382	0000678	
1	0.000201	-3.111347E-5	0.000192	-4.852597E-5	T	29246	2017.09.19 13:43:27.374171382	0000678	
1	0.000197	-3.095777E-5	0.000192	-2.952677E-5	T	29246	2017.09.19 13:43:27.384171382	0000678	
1	0.000201	-1.719688E-5	0.000192	-5.863960E-5	T	29246	2017.09.19 13:43:27.394171382	0000678	
1	0.000208	-4.484960E-5	0.000201	-2.945007E-5	T	29246	2017.09.19 13:43:27.404171382	0000678	
1	0.000192	2.276460E-6	0.000192	-7.968078E-7	T	29246	2017.09.19 13:43:27.414171382	0000678	
1	0.000213	-5.000479E-5	0.000201	-4.840854E-5	T	29246	2017.09.19 13:43:27.424171382	0000678	
1	0.000205	-2.585158E-5	0.000201	-2.960485E-5	T	29246	2017.09.19 13:43:27.434171382	0000678	
1	0.000184	-2.620623E-5	0.000178	-3.950898E-5	T	29246	2017.09.19 13:43:27.444171382	0000678	
1	0.000205	-4.982276E-5	0.000198	-2.039311E-5	T	29246	2017.09.19 13:43:27.454171382	0000678	
2	0.000188	1.105234E-5	0.000187	-2.084854E-5	T	29250	2017.09.19 13:43:27.564258882	0000678	
2	0.000207	-2.613666E-5	0.000197	-5.858704E-5	T	29250	2017.09.19 13:43:27.574258882	0000678	
2	0.000187	-7.148920E-6	0.000183	-3.968451E-5	T	29250	2017.09.19 13:43:27.584258882	0000678	
2	0.000197	1.924075E-6	0.000192	-4.379501E-5	T	29250	2017.09.19 13:43:27.594258882	0000678	
2	0.000191	-2.101809E-5	0.000187	-2.958748E-5	T	29250	2017.09.19 13:43:27.604258882	0000678	
2	0.000217	2.438092E-6	0.000216	-1.589578E-5	T	29250	2017.09.19 13:43:27.614258882	0000678	
2	0.000203	-4.478230E-5	0.000197	-1.543405E-5	T	29250	2017.09.19 13:43:27.624258882	0000678	
2	0.000196	-4.997410E-5	0.000188	-2.435145E-5	T	29250	2017.09.19 13:43:27.634258882	0000678	
2	0.000222	-4.014323E-5	0.000206	-7.250975E-5	T	29250	2017.09.19 13:43:27.644258882	0000678	
2	0.000193	-3.997514E-5	0.000187	-2.443291E-5	T	29250	2017.09.19 13:43:27.654258882	0000678	
3	0.000196	-4.505657E-5	0.000187	-3.439176E-5	T	29251	2017.09.19 13:43:27.764346382	0000678	
3	0.000220	-2.097119E-5	0.000211	-5.868587E-5	T	29251	2017.09.19 13:43:27.774346382	0000678	
3	0.000212	-2.090754E-5	0.000206	-4.366575E-5	T	29251	2017.09.19 13:43:27.784346382	0000678	
3	0.000202	-3.585699E-5	0.000197	-2.450700E-5	T	29251	2017.09.19 13:43:27.794346382	0000678	
3	0.000201	-6.656871E-6	0.000201	-5.760632E-6	T	29251	2017.09.19 13:43:27.804346382	0000678	
3	0.000195	-5.510296E-5	0.000184	-3.429370E-5	T	29251	2017.09.19 13:43:27.814346382	0000678	
3	0.000220	-3.588768E-5	0.000211	-4.856409E-5	T	29251	2017.09.19 13:43:27.824346382	0000678	
3	0.000193	-5.923558E-5	0.000179	-4.323999E-5	T	29251	2017.09.19 13:43:27.834346382	0000678	
3	0.000204	-4.482328E-5	0.000197	-2.043385E-5	T	29251	2017.09.19 13:43:27.844346382	0000678	
3	0.000190	-1.701850E-5	0.000187	-2.962007E-5	T	29251	2017.09.19 13:43:27.854346382	0000678	
4	0.000213	-5.493052E-5	0.000202	-3.936819E-5	T	29249	2017.09.19 13:43:27.964433882	0000678	
4	0.000198	-5.009703E-5	0.000187	-3.935082E-5	T	29249	2017.09.19 13:43:27.974433882	0000678	
4	0.000201	-1.719688E-5	0.000192	-5.863960E-5	T	29249	2017.09.19 13:43:27.984433882	0000678	
4	0.000204	-1.705564E-5	0.000197	-4.866077E-5	T	29249	2017.09.19 13:43:27.994433882	0000678	
4	0.000203	-2.101425E-5	0.000197	-4.362840E-5	T	29249	2017.09.19 13:43:28.004433882	0000678	
4	0.000205	-3.601270E-5	0.000197	-4.350620E-5	T	29249	2017.09.19 13:43:28.014433882	0000678	
4	0.000192	-2.763996E-6	0.000192	-5.755867E-6	T	29249	2017.09.19 13:43:28.024433882	0000678	
4	0.000199	-2.629620E-5	0.000187	-6.354533E-5	T	29249	2017.09.19 13:43:28.034433882	0000678	
4	0.000222	-2.872799E-6	0.000216	-5.385346E-5	T	29249	2017.09.19 13:43:28.044433882	0000678	
4	0.000184	-4.000809E-5	0.000178	-1.539594E-5	T	29249	2017.09.19 13:43:28.054433882	0000678	
5	0.000207	-3.585054E-5	0.000201	-2.952339E-5	T	29240	2017.09.19 13:43:28.164521382	0000678	
5	0.000184	-4.008185E-5	0.000178	-2.439556E-5	T	29240	2017.09.19 13:43:28.174521382	0000678	
5	0.000206	-1.693446E-5	0.000201	-3.967775E-5	T	29240	2017.09.19 13:43:28.184521382	0000678	
5	0.000203	-3.057098E-6	0.000197	-4.877482E-5	T	29240	2017.09.19 13:43:28.194521382	0000678	
5	0.000181	-3.167643E-6	0.000178	-3.469655E-5	T	29240	2017.09.19 13:43:28.204521382	0000678	
5	0.000193	-1.180404E-5	0.000192	-1.068234E-5	T	29240	2017.09.19 13:43:28.214521382	0000678	
5	0.000206	-2.093405E-5	0.000201	-3.964516E-5	T	29240	2017.09.19 13:43:28.224521382	0000678	
5	0.000212	-5.884815E-5	0.000202	-2.933602E-5	T	29240	2017.09.19 13:43:28.234521382	0000678	
5	0.000192	-4.510400E-5	0.000183	-3.437516E-5	T	29240	2017.09.19 13:43:28.244521382	0000678	
5	0.000221	-3.097015E-5	0.000211	-5.860441E-5	T	29240	2017.09.19 13:43:28.254521382	0000678	
6	0.000183	-6.870289E-6	0.000183	-5.685932E-6	T	29243	2017.09.19 13:43:28.364608882	0000678	
6	0.000199	-1.685896E-5	0.000197	-2.466178E-5	T	29243	2017.09.19 13:43:28.374608882	0000678	
6	0.000191	-1.206000E-5	0.000187	-3.466059E-5	T	29243	2017.09.19 13:43:28.384608882	0000678	
6	0.000196	-7.257199E-6	0.000187	-5.870032E-5	T	29243	2017.09.19 13:43:28.394608882	0000678	
6	0.000185	1.973071E-6	0.000183	-2.475845E-5	T	29243	2017.09.19 13:43:28.404608882	0000678	
6	0.000208	-3.096579E-5	0.000201	-4.356353E-5	T	29243	2017.09.19 13:43:28.414608882	0000678	
6	0.000186	-2.599124E-5	0.000183	-2.053052E-5	T	29243	2017.09.19 13:43:28.424608882	0000678	
6	0.000208	-1.675225E-5	0.000206	-2.469913E-5	T	29243	2017.09.19 13:43:28.434608882	0000678	
6	0.000198	-1.171197E-5	0.000197	-6.703259E-6	T	29243	2017.09.19 13:43:28.444608882	0000678	
6	0.000208	-4.505274E-5	0.000197	-4.843268E-5	T	29243	2017.09.19 13:43:28.454608882	0000678	
7	0.000207	-4.501176E-5	0.000197	-4.343288E-5	T	29251	2017.09.19 13:43:28.564696382	0000678	
7	0.000201	-2.094050E-5	0.000197	-3.462877E-5	T	29251	2017.09.19 13:43:28.574696382	0000678	
7	0.000202	-2.119646E-5	0.000192	-5.860702E-5	T	29251	2017.09.19 13:43:28.584696382	0000678	
7	0.000213	-4.967507E-5	0.000207	-1.543067E-5	T	29251	2017.09.19 13:43:28.594696382	0000678	
7	0.000191	-2.601757E-5	0.000187	-2.954675E-5	T	29251	2017.09.19 13:43:28.604696382	0000678	
7	0.000219	-2.559997E-5	0.000216	-2.066748E-5	T	29251	2017.09.19 13:43:28.614696382	0000678	
7	0.000204	-2.105523E-5	0.000197	-4.862819E-5	T	29251	2017.09.19 13:43:28.624696382	0000678	
7	0.000189	-3.110545E-5	0.000183	-3.448921E-5	T	29251	2017.09.19 13:43:28.634696382	0000678	
7	0.000210	1.112191E-5	0.000206	-3.992660E-5	T	29251	2017.09.19 13:43:28.644696382	0000678	
7	0.000210	-3.071802E-5	0.000206	-2.058524E-5	T	29251	2017.09.19 13:43:28.654696382	0000678	
8	0.000200	-3.107250E-5	0.000192	-4.352618E-5	T	29240	2017.09.19 13:43:28.764783882	0000678	
8	0.000199	-1.685896E-5	0.000197	-2.466178E-5	T	29240	2017.09.19 13:43:28.774783882	0000678	
8	0.000198	-1.211545E-5	0.000192	-4.868075E-5	T	29240	2017.09.19 13:43:28.784783882	0000678	
8	0.000198	-7.115966E-6	0.000192	-4.872148E-5	T	29240	2017.09.19 13:43:28.794783882	0000678	
8	0.000201	-2.615497E-5	0.000192	-5.356650E-5	T	29240	2017.09.19 13:43:28.804783882	0000678	
8	0.000208	-6.406907E-5	0.000193	-4.325735E-5	T	29240	2017.09.19 13:43:28.814783882	0000678	
8	0.000187	-1.710691E-5	0.000183	-3.460326E-5	T	29240	2017.09.19 13:43:28.824783882	0000678	
8	0.000210	-3.104774E-5	0.000201	-5.356311E-5	T	29240	2017.09.19 13:43:28.834783882	0000678	
8	0.000207	-3.589151E-5	0.000201	-3.452318E-5	T	29240	2017.09.19 13:43:28.844783882	0000678	
8	0.000192	-5.920280E-5	0.000179	-3.924015E-5	T	29240	2017.09.19 13:43:28.854783882	0000678	
9	0.000198	-1.211545E-5	0.000192	-4.868075E-5	T	29251	2017.09.19 13:43:28.964871382	0000678	
9	0.000204	-3.619490E-5	0.000192	-5.848482E-5	T	29251	2017.09.19 13:43:28.974871382	0000678	
9	0.000200	-1.689994E-5	0.000197	-2.966157E-5	T	29251	2017.09.19 13:43:28.984871382	0000678	
9	0.000215	-5.900386E-5	0.000202	-4.833523E-5	T	29251	2017.09.19 13:43:28.994871382	0000678	
9	0.000188	-3.106448E-5	0.000183	-2.948942E-5	T	29251	2017.09.19 13:43:29.004871382	0000678	
9	0.000211	-3.604722E-5	0.000201	-5.352238E-5	T	29251	2017.09.19 13:43:29.014871382	0000678	
9	0.000184	-1.691842E-5	0.000183	-1.160422E-5	T	29251	2017.09.19 13:43:29.024871382	0000678	
9	0.000196	-2.121477E-5	0.000187	-5.358648E-5	T	29251	2017.09.19 13:43:29.034871382	0000678	
9	0.000199	-4.488256E-5	0.000192	-2.041310E-5	T	29251	2017.09.19 13:43:29.044871382	0000678	
9	0.000198	-5.505553E-5	0.000188	-3.431030E-5	T	29251	2017.09.19 13:43:29.054871382	0000678	
10	0.000202	-5.491430E-5	0.000193	-2.433147E-5	T	29242	2017.09.19 13:43:29.164958882	0000678	
10	0.000198	1.883099E-6	0.000192	-4.879480E-5	T	29242	2017.09.19 13:43:29.174958882	0000678	
10	0.000219	-4.968954E-5	0.000212	-2.445105E-5	T	29242	2017.09.19 13:43:29.184958882	0000678	
10	0.000198	-4.484158E-5	0.000192	-1.541330E-5	T	29242	2017.09.19 13:43:29.194958882	0000678	
10	0.000203	-2.598095E-5	0.000197	-3.958783E-5	T	29242	2017.09.19 13:43:29.204958882	0000678	
10	0.000203	1.942382E-6	0.000197	-4.881555E-5	T	29242	2017.09.19 13:43:29.214958882	0000678	
10	0.000196	-1.225668E-5	0.000187	-5.865959E-5	T	29242	2017.09.19 13:43:29.224958882	0000678	
10	0.000200	-5.905512E-5	0.000188	-3.427771E-5	T	29242	2017.09.19 13:43:29.234958882	0000678	
10	0.000180	-4.014113E-5	0.000173	-2.437481E-5	T	29242	2017.09.19 13:43:29.244958882	0000678	
10	0.000189	-2.094433E-5	0.000187	-2.058786E-5	T	29242	2017.09.19 13:43:29.254958882	0000678	
11	0.000217	-3.620292E-5	0.000201	-7.252159E-5	T	29254	2017.09.19 13:43:29.365046382	0000678	
11	0.000205	-2.935917E-6	0.000201	-3.979180E-5	T	29254	2017.09.19 13:43:29.375046382	0000678	
11	0.000204	-3.101321E-5	0.000197	-4.354693E-5	T	29254	2017.09.19 13:43:29.385046382	0000678	
11	0.000194	-1.717421E-5	0.000187	-4.861927E-5	T	29254	2017.09.19 13:43:29.395046382	0000678	
11	0.000190	-3.082037E-5	0.000187	-5.507020E-6	T	29254	2017.09.19 13:43:29.405046382	0000678	
11	0.000202	-6.779796E-6	0.000201	-2.076001E-5	T	29254	2017.09.19 13:43:29.415046382	0000678	
11	0.000208	-5.001124E-5	0.000197	-4.339215E-5	T	29254	2017.09.19 13:43:29.425046382	0000678	
11	0.000197	2.335743E-6	0.000197	-8.175580E-7	T	29254	2017.09.19 13:43:29.435046382	0000678	
11	0.000228	-3.629935E-5	0.000206	-9.154155E-5	T	29254	2017.09.19 13:43:29.445046382	0000678	
11	0.000199	-4.517130E-5	0.000187	-4.839117E-5	T	29254	2017.09.19 13:43:29.455046382	0000678	
12	0.000207	-2.753709E-6	0.000206	-2.481317E-5	T	29257	2017.09.19 13:43:29.565133882	0000678	
12	0.000198	-1.178573E-5	0.000197	-1.570288E-5	T	29257	2017.09.19 13:43:29.575133882	0000678	
12	0.000210	-3.104774E-5	0.000201	-5.356311E-5	T	29257	2017.09.19 13:43:29.585133882	0000678	
12	0.000206	-4.001228E-5	0.000197	-4.347362E-5	T	29257	2017.09.19 13:43:29.595133882	0000678	
12	0.000207	-4.997846E-5	0.000197	-3.939232E-5	T	29257	2017.09.19 13:43:29.605133882	0000678	
12	0.000182	-1.716619E-5	0.000178	-3.458251E-5	T	29257	2017.09.19 13:43:29.615133882	0000678	
12	0.000206	-4.497898E-5	0.000197	-3.943305E-5	T	29257	2017.09.19 13:43:29.625133882	0000678	
12	0.000212	-2.590703E-5	0.000206	-4.362501E-5	T	29257	2017.09.19 13:43:29.635133882	0000678	
12	0.000195	-1.695922E-5	0.000192	-2.964082E-5	T	29257	2017.09.19 13:43:29.645133882	0000678	
12	0.000208	-1.717857E-5	0.000197	-6.366015E-5	T	29257	2017.09.19 13:43:29.655133882	0000678	
13	0.000206	-1.696724E-5	0.000201	-4.367758E-5	T	29243	2017.09.19 13:43:29.765221382	0000678	
13	0.000174	-4.012666E-5	0.000168	-1.535443E-5	T	29243	2017.09.19 13:43:29.775221382	0000678	
13	0.000200	-3.641634E-5	0.000183	-7.244689E-5	T	29243	2017.09.19 13:43:29.785221382	0000678	
13	0.000208	-4.480863E-5	0.000201	-2.445028E-5	T	29243	2017.09.19 13:43:29.795221382	0000678	
13	0.000206	-1.196776E-5	0.000201	-4.371831E-5	T	29243	2017.09.19 13:43:29.805221382	0000678	
13	0.000186	-4.512231E-5	0.000178	-2.935462E-5	T	29243	2017.09.19 13:43:29.815221382	0000678	
13	0.000206	-2.968697E-6	0.000201	-4.379163E-5	T	29243	2017.09.19 13:43:29.825221382	0000678	
13	0.000204	-5.921082E-5	0.000187	-5.327692E-5	T	29243	2017.09.19 13:43:29.835221382	0000678	
13	0.000195	-1.195974E-5	0.000192	-2.968155E-5	T	29243	2017.09.19 13:43:29.845221382	0000678	
13	0.000204	-2.601373E-5	0.000197	-4.358766E-5	T	29243	2017.09.19 13:43:29.855221382	0000678	
14	0.000197	-1.207447E-5	0.000192	-4.368096E-5	T	29249	2017.09.19 13:43:29.965308882	0000678	
14	0.000214	-1.177544E-5	0.000211	-3.476019E-5	T	29249	2017.09.19 13:43:29.975308882	0000678	
14	0.000213	-2.629236E-5	0.000197	-7.758624E-5	T	29249	2017.09.19 13:43:29.985308882	0000678	
14	0.000202	-3.982379E-5	0.000197	-2.047458E-5	T	29249	2017.09.19 13:43:29.995308882	0000678	
14	0.000202	-2.098147E-5	0.000197	-3.962856E-5	T	29249	2017.09.19 13:43:30.005308882	0000678	
14	0.000188	-3.986686E-5	0.000183	-5.417103E-6	T	29249	2017.09.19 13:43:30.015308882	0000678	
14	0.000207	-3.585054E-5	0.000201	-2.952339E-5	T	29249	2017.09.19 13:43:30.025308882	0000678	
14	0.000203	-1.701467E-5	0.000197	-4.366098E-5	T	29249	2017.09.19 13:43:30.035308882	0000678	
14	0.000196	-2.591731E-5	0.000192	-2.456771E-5	T	29249	2017.09.19 13:43:30.045308882	0000678	
14	0.000223	-2.582943E-5	0.000216	-4.866631E-5	T	29249	2017.09.19 13:43:30.055308882	0000678	
15	0.000201	1.579970E-5	0.000192	-5.890843E-5	T	29255	2017.09.19 13:43:30.165396382	0000678	
15	0.000193	-3.621966E-5	0.000183	-4.844789E-5	T	29255	2017.09.19 13:43:30.175396382	0000678	
15	0.000195	-2.091783E-5	0.000192	-2.460844E-5	T	29255	2017.09.19 13:43:30.185396382	0000678	
15	0.000198	-2.604024E-5	0.000192	-3.956708E-5	T	29255	2017.09.19 13:43:30.195396382	0000678	
15	0.000199	-1.185948E-5	0.000197	-2.470251E-5	T	29255	2017.09.19 13:43:30.205396382	0000678	
15	0.000197	-1.725616E-5	0.000187	-5.861885E-5	T	29255	2017.09.19 13:43:30.215396382	0000678	
15	0.000197	-5.005605E-5	0.000187	-3.435103E-5	T	29255	2017.09.19 13:43:30.225396382	0000678	
15	0.000201	-2.698262E-6	0.000201	-1.079301E-5	T	29255	2017.09.19 13:43:30.235396382	0000678	
15	0.000209	-2.121093E-5	0.000197	-6.762739E-5	T	29255	2017.09.19 13:43:30.245396382	0000678	
15	0.000198	-1.707395E-5	0.000192	-4.364023E-5	T	29255	2017.09.19 13:43:30.255396382	0000678	
16	0.000225	-3.086989E-5	0.000216	-5.362537E-5	T	29248	2017.09.19 13:43:30.365483882	0000678	
16	0.000195	-1.195974E-5	0.000192	-2.968155E-5	T	29248	2017.09.19 13:43:30.375483882	0000678	
16	0.000212	-4.464281E-5	0.000206	-1.147157E-5	T	29248	2017.09.19 13:43:30.385483882	0000678	
16	0.000203	-2.070459E-5	0.000201	-1.164633E-5	T	29248	2017.09.19 13:43:30.395483882	0000678	
16	0.000198	-3.595725E-5	0.000192	-2.948604E-5	T	29248	2017.09.19 13:43:30.405483882	0000678	
16	0.000200	-4.495631E-5	0.000192	-2.941272E-5	T	29248	2017.09.19 13:43:30.415483882	0000678	
16	0.000204	-7.817432E-5	0.000184	-4.310596E-5	T	29248	2017.09.19 13:43:30.425483882	0000678	
16	0.000212	-1.694894E-5	0.000206	-4.869812E-5	T	29248	2017.09.19 13:43:30.435483882	0000678	
16	0.000213	-3.587321E-5	0.000206	-3.954372E-5	T	29248	2017.09.19 13:43:30.445483882	0000678	
16	0.000190	-3.086135E-5	0.000187	-1.050681E-5	T	29248	2017.09.19 13:43:30.455483882	0000678	
17	0.000204	-2.081112E-5	0.000201	-2.464579E-5	T	29247	2017.09.19 13:43:30.565571382	0000678	
17	0.000209	-2.635165E-5	0.000192	-7.756549E-5	T	29247	2017.09.19 13:43:30.575571382	0000678	
17	0.000202	-4.507104E-5	0.000192	-4.341213E-5	T	29247	2017.09.19 13:43:30.585571382	0000678	
17	0.000211	-4.513469E-5	0.000197	-5.843226E-5	T	29247	2017.09.19 13:43:30.595571382	0000678	
17	0.000207	-4.501176E-5	0.000197	-4.343288E-5	T	29247	2017.09.19 13:43:30.605571382	0000678	
17	0.000211	-7.441240E-5	0.000184	-7.213733E-5	T	29247	2017.09.19 13:43:30.615571382	0000678	
17	0.000195	-4.501560E-5	0.000187	-2.939197E-5	T	29247	2017.09.19 13:43:30.625571382	0000678	
17	0.000202	1.983357E-6	0.000197	-4.381576E-5	T	29247	2017.09.19 13:43:30.635571382	0000678	
17	0.000228	-5.900821E-5	0.000211	-6.337610E-5	T	29247	2017.09.19 13:43:30.645571382	0000678	
17	0.000191	-3.094330E-5	0.000187	-2.050639E-5	T	29247	2017.09.19 13:43:30.655571382	0000678	
18	0.000212	-2.590703E-5	0.000206	-4.362501E-5	T	29243	2017.09.19 13:43:30.765658882	0000678	
18	0.000207	-4.477585E-5	0.000201	-2.045045E-5	T	29243	2017.09.19 13:43:30.775658882	0000678	
18	0.000199	-1.711493E-5	0.000192	-4.864002E-5	T	29243	2017.09.19 13:43:30.785658882	0000678	
18	0.000206	-1.693446E-5	0.000201	-3.967775E-5	T	29243	2017.09.19 13:43:30.795658882	0000678	
18	0.000195	-1.195974E-5	0.000192	-2.968155E-5	T	29243	2017.09.19 13:43:30.805658882	0000678	
18	0.000210	-1.709017E-5	0.000201	-5.867695E-5	T	29243	2017.09.19 13:43:30.815658882	0000678	
18	0.000200	-4.521228E-5	0.000187	-5.339097E-5	T	29243	2017.09.19 13:43:30.825658882	0000678	
18	0.000189	-6.978568E-6	0.000187	-2.470174E-5	T	29243	2017.09.19 13:43:30.835658882	0000678	
18	0.000177	-1.744046E-5	0.000168	-5.354021E-5	T	29243	2017.09.19 13:43:30.845658882	0000678	
18	0.000197	-1.166280E-5	0.000197	-7.035096E-7	T	29243	2017.09.19 13:43:30.855658882	0000678	
19	0.000205	-3.561288E-5	0.000201	-5.245984E-7	T	29243	2017.09.19 13:43:30.965746382	0000678	
19	0.000197	-3.588349E-5	0.000192	-2.048641E-5	T	29243	2017.09.19 13:43:30.975746382	0000678	
19	0.000194	-4.001612E-5	0.000187	-2.943270E-5	T	29243	2017.09.19 13:43:30.985746382	0000678	
19	0.000196	-2.621425E-5	0.000187	-5.354575E-5	T	29243	2017.09.19 13:43:30.995746382	0000678	
19	0.000183	-3.604948E-5	0.000178	-2.042831E-5	T	29243	2017.09.19 13:43:31.005746382	0000678	
19	0.000190	-6.922007E-5	0.000174	-3.413815E-5	T	29243	2017.09.19 13:43:31.015746382	0000678	
19	0.000183	-5.506582E-5	0.000174	-1.525299E-5	T	29243	2017.09.19 13:43:31.025746382	0000678	
19	0.000193	-1.713323E-5	0.000187	-4.361948E-5	T	29243	2017.09.19 13:43:31.035746382	0000678	
19	0.000200	-1.689994E-5	0.000197	-2.966157E-5	T	29243	2017.09.19 13:43:31.045746382	0000678	
19	0.000214	-3.094748E-5	0.000206	-4.858407E-5	T	29243	2017.09.19 13:43:31.055746382	0000678	
20	0.000216	-5.917421E-5	0.000197	-6.331800E-5	T	29246	2017.09.19 13:43:31.165833882	0000678	
20	0.000209	-3.596527E-5	0.000201	-4.352280E-5	T	29246	2017.09.19 13:43:31.175833882	0000678	
20	0.000200	-4.991482E-5	0.000193	-2.437220E-5	T	29246	2017.09.19 13:43:31.185833882	0000678	
20	0.000210	-3.600624E-5	0.000201	-4.852259E-5	T	29246	2017.09.19 13:43:31.195833882	0000678	
20	0.000207	-1.200874E-5	0.000201	-4.871810E-5	T	29246	2017.09.19 13:43:31.205833882	0000678	
20	0.000196	-2.099978E-5	0.000192	-3.460802E-5	T	29246	2017.09.19 13:43:31.215833882	0000678	
20	0.000210	-3.959416E-5	0.000206	-5.512554E-6	T	29246	2017.09.19 13:43:31.225833882	0000678	
20	0.000202	-3.585699E-5	0.000197	-2.450700E-5	T	29246	2017.09.19 13:43:31.235833882	0000678	
20	0.000212	1.834103E-6	0.000201	-6.783136E-5	T	29246	2017.09.19 13:43:31.245833882	0000678	
20	0.000203	-3.593894E-5	0.000197	-3.450658E-5	T	29246	2017.09.19 13:43:31.255833882	0000678	
21	0.000216	-1.184920E-5	0.000211	-4.375981E-5	T	29250	2017.09.19 13:43:31.365921382	0000678	
21	0.000201	-4.007156E-5	0.000192	-4.345287E-5	T	29250	2017.09.19 13:43:31.375921382	0000678	
21	0.000213	-2.594800E-5	0.000206	-4.862481E-5	T	29250	2017.09.19 13:43:31.385921382	0000678	
21	0.000223	-3.578742E-5	0.000216	-4.358505E-5	T	29250	2017.09.19 13:43:31.395921382	0000678	
21	0.000224	-3.946914E-5	0.000220	-1.057045E-5	T	29250	2017.09.19 13:43:31.405921382	0000678	
21	0.000199	-2.082577E-5	0.000197	-2.062936E-5	T	29250	2017.09.19 13:43:31.415921382	0000678	
21	0.000215	-2.103047E-5	0.000206	-5.866512E-5	T	29250	2017.09.19 13:43:31.425921382	0000678	
21	0.000206	-1.713759E-5	0.000197	-5.866035E-5	T	29250	2017.09.19 13:43:31.435921382	0000678	
21	0.000196	-5.021821E-5	0.000183	-4.833384E-5	T	29250	2017.09.19 13:43:31.445921382	0000678	
21	0.000215	-2.817351E-6	0.000211	-3.983330E-5	T	29250	2017.09.19 13:43:31.455921382	0000678	
22	0.000197	-2.599926E-5	0.000192	-3.456729E-5	T	29246	2017.09.19 13:43:31.566008882	0000678	
22	0.000189	-7.222675E-6	0.000183	-4.868413E-5	T	29246	2017.09.19 13:43:31.576008882	0000678	
22	0.000215	-1.677492E-5	0.000211	-3.471946E-5	T	29246	2017.09.19 13:43:31.586008882	0000678	
22	0.000196	-1.700020E-5	0.000192	-3.464061E-5	T	29246	2017.09.19 13:43:31.596008882	0000678	
22	0.000208	-6.794269E-6	0.000206	-2.978038E-5	T	29246	2017.09.19 13:43:31.606008882	0000678	
22	0.000179	-3.122402E-5	0.000173	-3.444771E-5	T	29246	2017.09.19 13:43:31.616008882	0000678	
22	0.000207	-2.096683E-5	0.000201	-4.364500E-5	T	29246	2017.09.19 13:43:31.626008882	0000678	
22	0.000212	-2.090754E-5	0.000206	-4.366575E-5	T	29246	2017.09.19 13:43:31.636008882	0000678	
22	0.000205	-2.935917E-6	0.000201	-3.979180E-5	T	29246	2017.09.19 13:43:31.646008882	0000678	
22	0.000180	-2.129881E-5	0.000173	-4.352879E-5	T	29246	2017.09.19 13:43:31.656008882	0000678	
23	0.000194	-1.684449E-5	0.000192	-1.564140E-5	T	29250	2017.09.19 13:43:31.766096382	0000678	
23	0.000205	-4.515299E-5	0.000192	-5.341172E-5	T	29250	2017.09.19 13:43:31.776096382	0000678	
23	0.000198	-1.229765E-5	0.000187	-6.365938E-5	T	29250	2017.09.19 13:43:31.786096382	0000678	
23	0.000206	-3.605367E-5	0.000197	-4.850599E-5	T	29250	2017.09.19 13:43:31.796096382	0000678	
23	0.000187	1.588967E-5	0.000183	-3.487208E-5	T	29250	2017.09.19 13:43:31.806096382	0000678	
23	0.000196	-1.225668E-5	0.000187	-5.865959E-5	T	29250	2017.09.19 13:43:31.816096382	0000678	
23	0.000197	-3.591627E-5	0.000192	-2.448624E-5	T	29250	2017.09.19 13:43:31.826096382	0000678	
23	0.000200	-4.991482E-5	0.000193	-2.437220E-5	T	29250	2017.09.19 13:43:31.836096382	0000678	
23	0.000202	1.983357E-6	0.000197	-4.381576E-5	T	29250	2017.09.19 13:43:31.846096382	0000678	
23	0.000194	-5.902059E-5	0.000184	-2.426153E-5	T	29250	2017.09.19 13:43:31.856096382	0000678	
24	0.000194	-2.613230E-5	0.000187	-4.354616E-5	T	29245	2017.09.19 13:43:31.966183882	0000678	
24	0.000181	-2.605052E-5	0.000178	-2.050977E-5	T	29245	2017.09.19 13:43:31.976183882	0000678	
24	0.000181	-3.626447E-5	0.000173	-3.940677E-5	T	29245	2017.09.19 13:43:31.986183882	0000678	
24	0.000226	-3.586937E-5	0.000216	-5.358463E-5	T	29245	2017.09.19 13:43:31.996183882	0000678	
24	0.000206	2.030784E-6	0.000201	-4.383236E-5	T	29245	2017.09.19 13:43:32.006183882	0000678	
24	0.000186	-3.090877E-5	0.000183	-1.049021E-5	T	29245	2017.09.19 13:43:32.016183882	0000678	
24	0.000214	-4.483130E-5	0.000206	-3.447061E-5	T	29245	2017.09.19 13:43:32.026183882	0000678	
24	0.000218	-6.404431E-5	0.000202	-5.329429E-5	T	29245	2017.09.19 13:43:32.036183882	0000678	
24	0.000207	-7.009257E-6	0.000201	-4.875884E-5	T	29245	2017.09.19 13:43:32.046183882	0000678	
24	0.000197	-5.005605E-5	0.000187	-3.435103E-5	T	29245	2017.09.19 13:43:32.056183882	0000678	
25	0.000211	-4.513469E-5	0.000197	-5.843226E-5	T	29249	2017.09.19 13:43:32.166271382	0000678	
25	0.000205	-2.109620E-5	0.000197	-5.362798E-5	T	29249	2017.09.19 13:43:32.176271382	0000678	
25	0.000204	-2.085210E-5	0.000201	-2.964558E-5	T	29249	2017.09.19 13:43:32.186271382	0000678	
25	0.000204	-2.577782E-5	0.000201	-2.060523E-5	T	29249	2017.09.19 13:43:32.196271382	0000678	
25	0.000210	-5.919251E-5	0.000192	-5.829746E-5	T	29249	2017.09.19 13:43:32.206271382	0000678	
25	0.000199	-6.900978E-6	0.000197	-2.974303E-5	T	29249	2017.09.19 13:43:32.216271382	0000678	
25	0.000196	-3.134311E-5	0.000183	-6.348800E-5	T	29249	2017.09.19 13:43:32.226271382	0000678	
25	0.000183	-3.241398E-6	0.000178	-4.369618E-5	T	29249	2017.09.19 13:43:32.236271382	0000678	
25	0.000207	-2.113718E-5	0.000197	-5.862777E-5	T	29249	2017.09.19 13:43:32.246271382	0000678	
25	0.000205	-4.489703E-5	0.000197	-2.943347E-5	T	29249	2017.09.19 13:43:32.256271382	0000678	
26	0.000202	-2.098147E-5	0.000197	-3.962856E-5	T	29250	2017.09.19 13:43:32.366358882	0000678	
26	0.000202	-3.089848E-5	0.000197	-2.954752E-5	T	29250	2017.09.19 13:43:32.376358882	0000678	
26	0.000211	-1.687518E-5	0.000206	-3.969850E-5	T	29250	2017.09.19 13:43:32.386358882	0000678	
26	0.000219	-4.520199E-5	0.000201	-7.244827E-5	T	29250	2017.09.19 13:43:32.396358882	0000678	
26	0.000203	-5.537339E-5	0.000183	-6.729232E-5	T	29250	2017.09.19 13:43:32.406358882	0000678	
26	0.000203	-3.163185E-5	0.000178	-9.146608E-5	T	29250	2017.09.19 13:43:32.416358882	0000678	
26	0.000179	-1.197003E-5	0.000178	-1.062424E-5	T	29250	2017.09.19 13:43:32.426358882	0000678	
26	0.000199	-2.082577E-5	0.000197	-2.062936E-5	T	29250	2017.09.19 13:43:32.436358882	0000678	
26	0.000224	-4.475371E-5	0.000216	-3.951190E-5	T	29250	2017.09.19 13:43:32.446358882	0000678	
26	0.000189	-2.614695E-5	0.000183	-3.952973E-5	T	29250	2017.09.19 13:43:32.456358882	0000678	
27	0.000201	1.801149E-6	0.000192	-5.879438E-5	T	29237	2017.09.19 13:43:32.566446382	0000678	
27	0.000178	-2.618356E-5	0.000173	-2.948865E-5	T	29237	2017.09.19 13:43:32.576446382	0000678	
27	0.000194	-7.345600E-6	0.000183	-6.368351E-5	T	29237	2017.09.19 13:43:32.586446382	0000678	
27	0.000200	-1.215642E-5	0.000192	-5.368054E-5	T	29237	2017.09.19 13:43:32.596446382	0000678	
27	0.000209	-4.526772E-5	0.000192	-6.741113E-5	T	29237	2017.09.19 13:43:32.606446382	0000678	
27	0.000195	-2.588453E-5	0.000192	-2.056788E-5	T	29237	2017.09.19 13:43:32.616446382	0000678	
27	0.000219	-4.006947E-5	0.000206	-6.351013E-5	T	29237	2017.09.19 13:43:32.626446382	0000678	
27	0.000191	-4.506302E-5	0.000183	-2.937537E-5	T	29237	2017.09.19 13:43:32.636446382	0000678	
27	0.000178	-2.122506E-5	0.000173	-3.452917E-5	T	29237	2017.09.19 13:43:32.646446382	0000678	
27	0.000211	-3.604722E-5	0.000201	-5.352238E-5	T	29237	2017.09.19 13:43:32.656446382	0000678	
28	0.000209	-2.075184E-5	0.000206	-2.466654E-5	T	29252	2017.09.19 13:43:32.766533882	0000678	
28	0.000201	-3.111347E-5	0.000192	-4.852597E-5	T	29252	2017.09.19 13:43:32.776533882	0000678	
28	0.000213	-7.829080E-5	0.000188	-6.312172E-5	T	29252	2017.09.19 13:43:32.786533882	0000678	
28	0.000206	-4.465292E-5	0.000202	-5.451073E-6	T	29252	2017.09.19 13:43:32.796533882	0000678	
28	0.000202	-4.011254E-5	0.000192	-4.845266E-5	T	29252	2017.09.19 13:43:32.806533882	0000678	
28	0.000220	-5.857388E-5	0.000212	-1.037832E-5	T	29252	2017.09.19 13:43:32.816533882	0000678	
28	0.000222	-4.984525E-5	0.000211	-4.345025E-5	T	29252	2017.09.19 13:43:32.826533882	0000678	
28	0.000192	-3.122018E-5	0.000183	-4.848862E-5	T	29252	2017.09.19 13:43:32.836533882	0000678	
28	0.000207	-3.985012E-5	0.000201	-2.949080E-5	T	29252	2017.09.19 13:43:32.846533882	0000678	
28	0.000232	-4.998265E-5	0.000216	-6.747000E-5	T	29252	2017.09.19 13:43:32.856533882	0000678	
29	0.000196	-1.700020E-5	0.000192	-3.464061E-5	T	29257	2017.09.19 13:43:32.966621382	0000678	
29	0.000211	-3.120990E-5	0.000197	-6.754593E-5	T	29257	2017.09.19 13:43:32.976621382	0000678	
29	0.000199	-4.491534E-5	0.000192	-2.441293E-5	T	29257	2017.09.19 13:43:32.986621382	0000678	
29	0.000200	-2.582525E-5	0.000197	-2.058863E-5	T	29257	2017.09.19 13:43:32.996621382	0000678	
29	0.000187	-2.606500E-5	0.000183	-2.953015E-5	T	29257	2017.09.19 13:43:33.006621382	0000678	
29	0.000188	-2.078043E-5	0.000187	-5.886924E-7	T	29257	2017.09.19 13:43:33.016621382	0000678	
29	0.000202	-2.098147E-5	0.000197	-3.962856E-5	T	29257	2017.09.19 13:43:33.026621382	0000678	
29	0.000193	-5.031847E-5	0.000178	-5.331288E-5	T	29257	2017.09.19 13:43:33.036621382	0000678	
29	0.000213	-6.377388E-5	0.000202	-2.029567E-5	T	29257	2017.09.19 13:43:33.046621382	0000678	
29	0.000207	-1.159707E-5	0.000206	-5.740651E-6	T	29257	2017.09.19 13:43:33.056621382	0000678	
30	0.000193	-3.126116E-5	0.000183	-5.348841E-5	T	29245	2017.09.19 13:43:33.166708882	0000678	
30	0.000189	-3.998979E-5	0.000183	-2.041648E-5	T	29245	2017.09.19 13:43:33.176708882	0000678	
30	0.000182	-2.608330E-5	0.000178	-2.450961E-5	T	29245	2017.09.19 13:43:33.186708882	0000678	
30	0.000206	-7.138633E-6	0.000197	-5.874182E-5	T	29245	2017.09.19 13:43:33.196708882	0000678	
30	0.000228	2.133133E-6	0.000220	-5.891058E-5	T	29245	2017.09.19 13:43:33.206708882	0000678	
30	0.000213	-3.608819E-5	0.000201	-5.852217E-5	T	29245	2017.09.19 13:43:33.216708882	0000678	
30	0.000213	-4.971605E-5	0.000207	-2.043046E-5	T	29245	2017.09.19 13:43:33.226708882	0000678	
30	0.000209	-4.489058E-5	0.000201	-3.444986E-5	T	29245	2017.09.19 13:43:33.236708882	0000678	
30	0.000208	-2.794684E-6	0.000206	-2.981296E-5	T	29245	2017.09.19 13:43:33.246708882	0000678	
30	0.000199	-2.111451E-5	0.000192	-4.860744E-5	T	29245	2017.09.19 13:43:33.256708882	0000678	
31	0.000201	-1.198241E-5	0.000197	-3.970188E-5	T	29245	2017.09.19 13:43:33.366796382	0000678	
31	0.000209	-3.993207E-5	0.000201	-3.949038E-5	T	29245	2017.09.19 13:43:33.376796382	0000678	
31	0.000215	-4.983078E-5	0.000206	-3.442988E-5	T	29245	2017.09.19 13:43:33.386796382	0000678	
31	0.000201	-6.893935E-5	0.000188	-2.019683E-5	T	29245	2017.09.19 13:43:33.396796382	0000678	
31	0.000209	-2.571854E-5	0.000206	-2.062598E-5	T	29245	2017.09.19 13:43:33.406796382	0000678	
31	0.000196	-1.700020E-5	0.000192	-3.464061E-5	T	29245	2017.09.19 13:43:33.416796382	0000678	
31	0.000196	-5.517671E-5	0.000183	-4.329332E-5	T	29245	2017.09.19 13:43:33.426796382	0000678	
31	0.000205	-3.077730E-5	0.000201	-2.056449E-5	T	29245	2017.09.19 13:43:33.436796382	0000678	
31	0.000220	6.208217E-6	0.000216	-4.392720E-5	T	29245	2017.09.19 13:43:33.446796382	0000678	
31	0.000207	-2.593353E-5	0.000201	-3.960443E-5	T	29245	2017.09.19 13:43:33.456796382	0000678	
32	0.000182	-1.716619E-5	0.000178	-3.458251E-5	T	29259	2017.09.19 13:43:33.566883882	0000678	
32	0.000202	-1.169733E-5	0.000201	-1.071969E-5	T	29259	2017.09.19 13:43:33.576883882	0000678	
32	0.000190	-4.031950E-5	0.000178	-5.339435E-5	T	29259	2017.09.19 13:43:33.586883882	0000678	
32	0.000195	-2.091783E-5	0.000192	-2.460844E-5	T	29259	2017.09.19 13:43:33.596883882	0000678	
32	0.000211	-4.496433E-5	0.000201	-4.344948E-5	T	29259	2017.09.19 13:43:33.606883882	0000678	
32	0.000215	-7.397597E-5	0.000198	-3.919681E-5	T	29259	2017.09.19 13:43:33.616883882	0000678	
32	0.000204	-6.894526E-6	0.000201	-3.475942E-5	T	29259	2017.09.19 13:43:33.626883882	0000678	
32	0.000197	-6.745272E-6	0.000197	-1.074382E-5	T	29259	2017.09.19 13:43:33.636883882	0000678	
32	0.000203	-5.499625E-5	0.000193	-3.433105E-5	T	29259	2017.09.19 13:43:33.646883882	0000678	
32	0.000204	-1.705564E-5	0.000197	-4.866077E-5	T	29259	2017.09.19 13:43:33.656883882	0000678	
33	0.000210	-3.955319E-5	0.000206	-5.127633E-7	T	29250	2017.09.19 13:43:33.766971382	0000678	
33	0.000212	-2.625139E-5	0.000197	-7.258645E-5	T	29250	2017.09.19 13:43:33.776971382	0000678	
33	0.000195	-5.906157E-5	0.000184	-2.926132E-5	T	29250	2017.09.19 13:43:33.786971382	0000678	
33	0.000201	-7.501305E-6	0.000183	-8.268271E-5	T	29250	2017.09.19 13:43:33.796971382	0000678	
33	0.000178	-4.032334E-5	0.000168	-3.935343E-5	T	29250	2017.09.19 13:43:33.806971382	0000678	
33	0.000195	-2.617327E-5	0.000187	-4.854595E-5	T	29250	2017.09.19 13:43:33.816971382	0000678	
33	0.000191	-1.206000E-5	0.000187	-3.466059E-5	T	29250	2017.09.19 13:43:33.826971382	0000678	
33	0.000200	-1.689994E-5	0.000197	-2.966157E-5	T	29250	2017.09.19 13:43:33.836971382	0000678	
33	0.000194	-4.497462E-5	0.000187	-2.439218E-5	T	29250	2017.09.19 13:43:33.846971382	0000678	
33	0.000202	-3.585699E-5	0.000197	-2.450700E-5	T	29250	2017.09.19 13:43:33.856971382	0000678	
34	0.000219	-4.973052E-5	0.000211	-2.945084E-5	T	29242	2017.09.19 13:43:33.967058882	0000678	
34	0.000196	-7.257199E-6	0.000187	-5.870032E-5	T	29242	2017.09.19 13:43:33.977058882	0000678	
34	0.000195	1.997830E-6	0.000192	-3.479539E-5	T	29242	2017.09.19 13:43:33.987058882	0000678	
34	0.000201	-2.589900E-5	0.000197	-2.958825E-5	T	29242	2017.09.19 13:43:33.997058882	0000678	
34	0.000209	-2.600728E-5	0.000201	-4.860406E-5	T	29242	2017.09.19 13:43:34.007058882	0000678	
34	0.000194	-5.506198E-5	0.000184	-2.929391E-5	T	29242	2017.09.19 13:43:34.017058882	0000678	
34	0.000188	2.094252E-6	0.000187	-1.577543E-5	T	29242	2017.09.19 13:43:34.027058882	0000678	
34	0.000192	-5.006250E-5	0.000183	-2.933464E-5	T	29242	2017.09.19 13:43:34.037058882	0000678	
34	0.000199	-1.682618E-5	0.000197	-2.066194E-5	T	29242	2017.09.19 13:43:34.047058882	0000678	
34	0.000206	-4.023546E-5	0.000192	-6.345203E-5	T	29242	2017.09.19 13:43:34.057058882	0000678	
35	0.000198	-4.017182E-5	0.000187	-4.843191E-5	T	29266	2017.09.19 13:43:34.167146382	0000678	
35	0.000207	-3.589151E-5	0.000201	-3.452318E-5	T	29266	2017.09.19 13:43:34.177146382	0000678	
35	0.000193	-3.175664E-6	0.000187	-4.873332E-5	T	29266	2017.09.19 13:43:34.187146382	0000678	
35	0.000188	-7.181700E-6	0.000183	-4.368434E-5	T	29266	2017.09.19 13:43:34.197146382	0000678	
35	0.000210	-1.683420E-5	0.000206	-3.469871E-5	T	29266	2017.09.19 13:43:34.207146382	0000678	
35	0.000208	-2.067808E-5	0.000206	-1.566692E-5	T	29266	2017.09.19 13:43:34.217146382	0000678	
35	0.000206	-3.577678E-5	0.000201	-2.052376E-5	T	29266	2017.09.19 13:43:34.227146382	0000678	
35	0.000218	-6.675703E-6	0.000216	-2.982188E-5	T	29266	2017.09.19 13:43:34.237146382	0000678	
35	0.000215	-4.012875E-5	0.000201	-6.348938E-5	T	29266	2017.09.19 13:43:34.247146382	0000678	
35	0.000205	-3.565386E-5	0.000201	-5.524389E-6	T	29266	2017.09.19 13:43:34.257146382	0000678	
36	0.000191	-1.705948E-5	0.000187	-3.461986E-5	T	29254	2017.09.19 13:43:34.367233882	0000678	
36	0.000199	-4.984106E-5	0.000193	-1.537257E-5	T	29254	2017.09.19 13:43:34.377233882	0000678	
36	0.000207	5.989393E-6	0.000201	-4.886474E-5	T	29254	2017.09.19 13:43:34.387233882	0000678	
36	0.000185	-3.142070E-5	0.000173	-5.844670E-5	T	29254	2017.09.19 13:43:34.397233882	0000678	
36	0.000192	2.235485E-6	0.000192	-5.796599E-6	T	29254	2017.09.19 13:43:34.407233882	0000678	
36	0.000227	-1.198659E-5	0.000216	-6.777956E-5	T	29254	2017.09.19 13:43:34.417233882	0000678	
36	0.000209	-2.075184E-5	0.000206	-2.466654E-5	T	29254	2017.09.19 13:43:34.427233882	0000678	
36	0.000235	-7.803902E-5	0.000212	-6.722115E-5	T	29254	2017.09.19 13:43:34.437233882	0000678	
36	0.000192	-4.531899E-5	0.000178	-5.335362E-5	T	29254	2017.09.19 13:43:34.447233882	0000678	
36	0.000203	-6.812576E-6	0.000201	-2.475984E-5	T	29254	2017.09.19 13:43:34.457233882	0000678	
37	0.000219	-1.197212E-5	0.000211	-5.875919E-5	T	29248	2017.09.19 13:43:34.567321382	0000678	
37	0.000203	-2.619594E-5	0.000192	-5.856629E-5	T	29248	2017.09.19 13:43:34.577321382	0000678	
37	0.000209	-2.075184E-5	0.000206	-2.466654E-5	T	29248	2017.09.19 13:43:34.587321382	0000678	
37	0.000199	-2.607302E-5	0.000192	-4.356691E-5	T	29248	2017.09.19 13:43:34.597321382	0000678	
37	0.000213	-3.587321E-5	0.000206	-3.954372E-5	T	29248	2017.09.19 13:43:34.607321382	0000678	
37	0.000194	-2.084408E-5	0.000192	-1.560882E-5	T	29248	2017.09.19 13:43:34.617321382	0000678	
37	0.000205	-2.585158E-5	0.000201	-2.960485E-5	T	29248	2017.09.19 13:43:34.627321382	0000678	
37	0.000201	-2.698262E-6	0.000201	-1.079301E-5	T	29248	2017.09.19 13:43:34.637321382	0000678	
37	0.000203	-7.393883E-5	0.000188	-2.015610E-5	T	29248	2017.09.19 13:43:34.647321382	0000678	
37	0.000192	-5.490628E-5	0.000184	-1.029470E-5	T	29248	2017.09.19 13:43:34.657321382	0000678	
38	0.000215	-3.594696E-5	0.000206	-4.854334E-5	T	29261	2017.09.19 13:43:34.767408882	0000678	
38	0.000193	-5.010348E-5	0.000183	-3.433443E-5	T	29261	2017.09.19 13:43:34.777408882	0000678	
38	0.000197	-3.984210E-5	0.000192	-1.545404E-5	T	29261	2017.09.19 13:43:34.787408882	0000678	
38	0.000217	-3.577295E-5	0.000211	-3.456468E-5	T	29261	2017.09.19 13:43:34.797408882	0000678	
38	0.000204	-1.189401E-5	0.000201	-3.471869E-5	T	29261	2017.09.19 13:43:34.807408882	0000678	
38	0.000219	-8.814853E-5	0.000193	-5.306142E-5	T	29261	2017.09.19 13:43:34.817408882	0000678	
38	0.000200	-4.988204E-5	0.000193	-2.037236E-5	T	29261	2017.09.19 13:43:34.827408882	0000678	
38	0.000216	-2.602995E-5	0.000206	-5.862439E-5	T	29261	2017.09.19 13:43:34.837408882	0000678	
38	0.000193	-5.563319E-5	0.000168	-7.722965E-5	T	29261	2017.09.19 13:43:34.847408882	0000678	
38	0.000219	2.241412E-6	0.000216	-3.989478E-5	T	29261	2017.09.19 13:43:34.857408882	0000678	
39	0.000226	-2.574103E-5	0.000220	-4.368312E-5	T	29251	2017.09.19 13:43:34.967496382	0000678	
39	0.000199	-6.900978E-6	0.000197	-2.974303E-5	T	29251	2017.09.19 13:43:34.977496382	0000678	
39	0.000195	-1.195974E-5	0.000192	-2.968155E-5	T	29251	2017.09.19 13:43:34.987496382	0000678	
39	0.000212	-6.949974E-6	0.000206	-4.877959E-5	T	29251	2017.09.19 13:43:34.997496382	0000678	
39	0.000193	-1.184501E-5	0.000192	-1.568213E-5	T	29251	2017.09.19 13:43:35.007496382	0000678	
39	0.000178	-7.300265E-6	0.000173	-4.364284E-5	T	29251	2017.09.19 13:43:35.017496382	0000678	
39	0.000222	-1.704536E-5	0.000211	-6.771808E-5	T	29251	2017.09.19 13:43:35.027496382	0000678	
39	0.000175	-2.099560E-5	0.000173	-6.530341E-6	T	29251	2017.09.19 13:43:35.037496382	0000678	
39	0.000197	-1.704117E-5	0.000192	-3.964040E-5	T	29251	2017.09.19 13:43:35.047496382	0000678	
39	0.000216	-1.707186E-5	0.000206	-6.369750E-5	T	29251	2017.09.19 13:43:35.057496382	0000678	
40	0.000197	-1.207447E-5	0.000192	-4.368096E-5	T	29254	2017.09.19 13:43:35.167583882	0000678	
40	0.000209	-3.993207E-5	0.000201	-3.949038E-5	T	29254	2017.09.19 13:43:35.177583882	0000678	
40	0.000211	-4.017618E-5	0.000197	-6.347278E-5	T	29254	2017.09.19 13:43:35.187583882	0000678	
40	0.000192	-3.617869E-5	0.000183	-4.344810E-5	T	29254	2017.09.19 13:43:35.197583882	0000678	
40	0.000213	-3.112969E-5	0.000201	-6.356270E-5	T	29254	2017.09.19 13:43:35.207583882	0000678	
40	0.000196	-1.204169E-5	0.000192	-3.968113E-5	T	29254	2017.09.19 13:43:35.217583882	0000678	
40	0.000199	-6.900978E-6	0.000197	-2.974303E-5	T	29254	2017.09.19 13:43:35.227583882	0000678	
40	0.000204	-3.101321E-5	0.000197	-4.354693E-5	T	29254	2017.09.19 13:43:35.237583882	0000678	
40	0.000200	-1.215642E-5	0.000192	-5.368054E-5	T	29254	2017.09.19 13:43:35.247583882	0000678	
40	0.000191	-3.581985E-5	0.000187	-5.466289E-6	T	29254	2017.09.19 13:43:35.257583882	0000678	
41	0.000208	-4.480863E-5	0.000201	-2.445028E-5	T	29253	2017.09.19 13:43:35.367671382	0000678	
41	0.000214	-1.720490E-5	0.000201	-7.267637E-5	T	29253	2017.09.19 13:43:35.377671382	0000678	
41	0.000196	1.956855E-6	0.000192	-3.979518E-5	T	29253	2017.09.19 13:43:35.387671382	0000678	
41	0.000208	-3.609465E-5	0.000197	-5.350578E-5	T	29253	2017.09.19 13:43:35.397671382	0000678	
41	0.000182	-1.716619E-5	0.000178	-3.458251E-5	T	29253	2017.09.19 13:43:35.407671382	0000678	
41	0.000179	-1.693673E-5	0.000178	-6.583677E-6	T	29253	2017.09.19 13:43:35.417671382	0000678	
41	0.000202	-3.115445E-5	0.000192	-5.352576E-5	T	29253	2017.09.19 13:43:35.427671382	0000678	
41	0.000222	-4.014323E-5	0.000206	-7.250975E-5	T	29253	2017.09.19 13:43:35.437671382	0000678	
41	0.000217	-5.508622E-5	0.000201	-5.836739E-5	T	29253	2017.09.19 13:43:35.447671382	0000678	
41	0.000191	-2.101809E-5	0.000187	-2.958748E-5	T	29253	2017.09.19 13:43:35.457671382	0000678	
42	0.000200	-2.611399E-5	0.000192	-4.856671E-5	T	29258	2017.09.19 13:43:35.567758882	0000678	
42	0.000197	-3.095777E-5	0.000192	-2.952677E-5	T	29258	2017.09.19 13:43:35.577758882	0000678	
42	0.000203	-1.701467E-5	0.000197	-4.366098E-5	T	29258	2017.09.19 13:43:35.587758882	0000678	
42	0.000216	-2.602995E-5	0.000206	-5.862439E-5	T	29258	2017.09.19 13:43:35.597758882	0000678	
42	0.000204	-3.069535E-5	0.000201	-1.056491E-5	T	29258	2017.09.19 13:43:35.607758882	0000678	
42	0.000213	-5.000479E-5	0.000201	-4.840854E-5	T	29258	2017.09.19 13:43:35.617758882	0000678	
42	0.000217	-2.084826E-5	0.000211	-4.368650E-5	T	29258	2017.09.19 13:43:35.627758882	0000678	
42	0.000188	-5.500654E-5	0.000179	-1.527374E-5	T	29258	2017.09.19 13:43:35.637758882	0000678	
42	0.000212	-2.587425E-5	0.000206	-3.962518E-5	T	29258	2017.09.19 13:43:35.647758882	0000678	
42	0.000223	-3.975423E-5	0.000216	-3.955263E-5	T	29258	2017.09.19 13:43:35.657758882	0000678	
43	0.000202	-3.016123E-6	0.000197	-4.377503E-5	T	29244	2017.09.19 13:43:35.767846382	0000678	
43	0.000198	-3.621321E-5	0.000187	-5.346428E-5	T	29244	2017.09.19 13:43:35.777846382	0000678	
43	0.000194	-3.109900E-5	0.000187	-3.950560E-5	T	29244	2017.09.19 13:43:35.787846382	0000678	
43	0.000194	-4.494184E-5	0.000187	-2.039235E-5	T	29244	2017.09.19 13:43:35.797846382	0000678	
43	0.000213	-1.716392E-5	0.000201	-6.767658E-5	T	29244	2017.09.19 13:43:35.807846382	0000678	
43	0.000214	-4.483130E-5	0.000206	-3.447061E-5	T	29244	2017.09.19 13:43:35.817846382	0000678	
43	0.000205	-2.935917E-6	0.000201	-3.979180E-5	T	29244	2017.09.19 13:43:35.827846382	0000678	
43	0.000200	-3.607198E-5	0.000192	-4.348545E-5	T	29244	2017.09.19 13:43:35.837846382	0000678	
43	0.000214	-3.032339E-6	0.000206	-5.881175E-5	T	29244	2017.09.19 13:43:35.847846382	0000678	
43	0.000191	-3.636090E-5	0.000178	-5.842672E-5	T	29244	2017.09.19 13:43:35.857846382	0000678	
44	0.000194	-1.691825E-5	0.000192	-2.464102E-5	T	29250	2017.09.19 13:43:35.967933882	0000678	
44	0.000229	-5.462329E-5	0.000221	-2.944746E-5	T	29250	2017.09.19 13:43:35.977933882	0000678	
44	0.000193	-2.886921E-6	0.000192	-2.075524E-5	T	29250	2017.09.19 13:43:35.987933882	0000678	
44	0.000187	-1.210743E-5	0.000183	-3.464399E-5	T	29250	2017.09.19 13:43:35.997933882	0000678	
44	0.000209	-2.079281E-5	0.000206	-2.966633E-5	T	29250	2017.09.19 13:43:36.007933882	0000678	
44	0.000204	-2.085210E-5	0.000201	-2.964558E-5	T	29250	2017.09.19 13:43:36.017933882	0000678	
44	0.000193	-2.072935E-5	0.000192	-1.609401E-6	T	29250	2017.09.19 13:43:36.027933882	0000678	
44	0.000179	-6.970547E-6	0.000178	-1.066497E-5	T	29250	2017.09.19 13:43:36.037933882	0000678	
44	0.000180	-2.092812E-5	0.000178	-5.551133E-6	T	29250	2017.09.19 13:43:36.047933882	0000678	
44	0.000212	-3.974987E-5	0.000206	-2.451176E-5	T	29250	2017.09.19 13:43:36.057933882	0000678	
45	0.000197	-3.095777E-5	0.000192	-2.952677E-5	T	29243	2017.09.19 13:43:36.168021382	0000678	
45	0.000198	-4.484158E-5	0.000192	-1.541330E-5	T	29243	2017.09.19 13:43:36.178021382	0000678	
45	0.000197	-3.588349E-5	0.000192	-2.048641E-5	T	29243	2017.09.19 13:43:36.188021382	0000678	
45	0.000193	-5.894684E-5	0.000184	-1.526191E-5	T	29243	2017.09.19 13:43:36.198021382	0000678	
45	0.000194	-2.613230E-5	0.000187	-4.354616E-5	T	29243	2017.09.19 13:43:36.208021382	0000678	
45	0.000193	-5.875835E-5	0.000184	7.737133E-6	T	29243	2017.09.19 13:43:36.218021382	0000678	
45	0.000194	1.103787E-5	0.000192	-2.986891E-5	T	29243	2017.09.19 13:43:36.228021382	0000678	
45	0.000213	-7.389402E-5	0.000198	-2.919723E-5	T	29243	2017.09.19 13:43:36.238021382	0000678	
45	0.000215	-6.816936E-6	0.000211	-3.980071E-5	T	29243	2017.09.19 13:43:36.248021382	0000678	
45	0.000189	-1.694475E-5	0.000187	-2.062044E-5	T	29243	2017.09.19 13:43:36.258021382	0000678	
46	0.000214	-3.987279E-5	0.000206	-3.951113E-5	T	29261	2017.09.19 13:43:36.368108882	0000678	
46	0.000192	-2.110004E-5	0.000187	-3.958706E-5	T	29261	2017.09.19 13:43:36.378108882	0000678	
46	0.000197	-7.074991E-6	0.000192	-4.372169E-5	T	29261	2017.09.19 13:43:36.388108882	0000678	
46	0.000203	-3.985657E-5	0.000197	-2.447441E-5	T	29261	2017.09.19 13:43:36.398108882	0000678	
46	0.000192	-1.213375E-5	0.000187	-4.366021E-5	T	29261	2017.09.19 13:43:36.408108882	0000678	
46	0.000210	-1.187570E-5	0.000206	-3.973923E-5	T	29261	2017.09.19 13:43:36.418108882	0000678	
46	0.000206	-8.314103E-5	0.000184	-3.906539E-5	T	29261	2017.09.19 13:43:36.428108882	0000678	
46	0.000199	-1.711493E-5	0.000192	-4.864002E-5	T	29261	2017.09.19 13:43:36.438108882	0000678	
46	0.000204	-4.532701E-5	0.000187	-6.739038E-5	T	29261	2017.09.19 13:43:36.448108882	0000678	
46	0.000207	2.319527E-6	0.000206	-1.585428E-5	T	29261	2017.09.19 13:43:36.458108882	0000678	
47	0.000205	-3.601270E-5	0.000197	-4.350620E-5	T	29252	2017.09.19 13:43:36.568196382	0000678	
47	0.000197	-3.095777E-5	0.000192	-2.952677E-5	T	29252	2017.09.19 13:43:36.578196382	0000678	
47	0.000193	-2.845946E-6	0.000192	-1.575545E-5	T	29252	2017.09.19 13:43:36.588196382	0000678	
47	0.000207	-5.489599E-5	0.000198	-2.935201E-5	T	29252	2017.09.19 13:43:36.598196382	0000678	
47	0.000215	-2.598898E-5	0.000206	-5.362460E-5	T	29252	2017.09.19 13:43:36.608196382	0000678	
47	0.000212	-2.587425E-5	0.000206	-3.962518E-5	T	29252	2017.09.19 13:43:36.618196382	0000678	
47	0.000177	-3.110929E-5	0.000173	-2.044829E-5	T	29252	2017.09.19 13:43:36.628196382	0000678	
47	0.000204	-2.105523E-5	0.000197	-4.862819E-5	T	29252	2017.09.19 13:43:36.638196382	0000678	
47	0.000219	-2.592969E-5	0.000211	-5.364535E-5	T	29252	2017.09.19 13:43:36.648196382	0000678	
47	0.000206	-1.696724E-5	0.000201	-4.367758E-5	T	29252	2017.09.19 13:43:36.658196382	0000678	
48	0.000213	-5.017514E-5	0.000197	-6.339132E-5	T	29244	2017.09.19 13:43:36.768283882	0000678	
48	0.000209	-5.005222E-5	0.000197	-4.839194E-5	T	29244	2017.09.19 13:43:36.778283882	0000678	
48	0.000198	-1.707395E-5	0.000192	-4.364023E-5	T	29244	2017.09.19 13:43:36.788283882	0000678	
48	0.000198	-4.471866E-5	0.000193	-4.139312E-7	T	29244	2017.09.19 13:43:36.798283882	0000678	
48	0.000206	-1.693446E-5	0.000201	-3.967775E-5	T	29244	2017.09.19 13:43:36.808283882	0000678	
48	0.000195	-3.084304E-5	0.000192	-1.552735E-5	T	29244	2017.09.19 13:43:36.818283882	0000678	
48	0.000194	-2.576161E-5	0.000192	-5.568502E-6	T	29244	2017.09.19 13:43:36.828283882	0000678	
48	0.000199	-5.012981E-5	0.000187	-4.335065E-5	T	29244	2017.09.19 13:43:36.838283882	0000678	
48	0.000189	-2.978984E-6	0.000187	-2.473432E-5	T	29244	2017.09.19 13:43:36.848283882	0000678	
48	0.000208	-1.700822E-5	0.000201	-4.867737E-5	T	29244	2017.09.19 13:43:36.858283882	0000678	
49	0.000188	1.563370E-5	0.000178	-5.885033E-5	T	29248	2017.09.19 13:43:36.968371382	0000678	
49	0.000193	-6.886505E-6	0.000192	-2.072266E-5	T	29248	2017.09.19 13:43:36.978371382	0000678	
49	0.000194	-5.902059E-5	0.000184	-2.426153E-5	T	29248	2017.09.19 13:43:36.988371382	0000678	
49	0.000199	-3.157356E-6	0.000192	-5.375386E-5	T	29248	2017.09.19 13:43:36.998371382	0000678	
49	0.000200	-3.603920E-5	0.000192	-3.948562E-5	T	29248	2017.09.19 13:43:37.008371382	0000678	
49	0.000199	-3.995683E-5	0.000192	-2.945345E-5	T	29248	2017.09.19 13:43:37.018371382	0000678	
49	0.000202	-1.201519E-5	0.000197	-4.370171E-5	T	29248	2017.09.19 13:43:37.028371382	0000678	
49	0.000205	-4.493801E-5	0.000197	-3.443326E-5	T	29248	2017.09.19 13:43:37.038371382	0000678	
49	0.000191	-4.506302E-5	0.000183	-2.937537E-5	T	29248	2017.09.19 13:43:37.048371382	0000678	
49	0.000208	-4.484960E-5	0.000201	-2.945007E-5	T	29248	2017.09.19 13:43:37.058371382	0000678	
50	0.000195	-4.501560E-5	0.000187	-2.939197E-5	T	29248	2017.09.19 13:43:37.168458882	0000678	
50	0.000200	-2.085855E-5	0.000197	-2.462919E-5	T	29248	2017.09.19 13:43:37.178458882	0000678	
50	0.000198	-2.786663E-6	0.000197	-1.577620E-5	T	29248	2017.09.19 13:43:37.188458882	0000678	
50	0.000201	-3.111347E-5	0.000192	-4.852597E-5	T	29248	2017.09.19 13:43:37.198458882	0000678	
50	0.000216	-5.934822E-5	0.000192	-7.729666E-5	T	29248	2017.09.19 13:43:37.208458882	0000678	
50	0.000200	-3.074278E-5	0.000197	-1.054831E-5	T	29248	2017.09.19 13:43:37.218458882	0000678	
50	0.000189	-2.577991E-5	0.000187	-5.479609E-7	T	29248	2017.09.19 13:43:37.228458882	0000678	
50	0.000203	-3.985657E-5	0.000197	-2.447441E-5	T	29248	2017.09.19 13:43:37.238458882	0000678	
50	0.000210	-4.493155E-5	0.000201	-3.944965E-5	T	29248	2017.09.19 13:43:37.248458882	0000678	
50	0.000184	-4.000809E-5	0.000178	-1.539594E-5	T	29248	2017.09.19 13:43:37.258458882	0000678	
51	0.000211	-1.213166E-5	0.000201	-6.371748E-5	T	29242	2017.09.19 13:43:37.368546382	0000678	
51	0.000211	-3.604722E-5	0.000201	-5.352238E-5	T	29242	2017.09.19 13:43:37.378546382	0000678	
51	0.000215	-3.098846E-5	0.000206	-5.358387E-5	T	29242	2017.09.19 13:43:37.388546382	0000678	
51	0.000196	-3.088401E-5	0.000192	-2.052714E-5	T	29242	2017.09.19 13:43:37.398546382	0000678	
51	0.000216	-4.490505E-5	0.000206	-4.347023E-5	T	29242	2017.09.19 13:43:37.408546382	0000678	
51	0.000188	-1.714788E-5	0.000183	-3.960305E-5	T	29242	2017.09.19 13:43:37.418546382	0000678	
51	0.000183	1.758083E-6	0.000178	-4.373691E-5	T	29242	2017.09.19 13:43:37.428546382	0000678	
51	0.000202	-5.495527E-5	0.000193	-2.933126E-5	T	29242	2017.09.19 13:43:37.438546382	0000678	
51	0.000201	-2.589900E-5	0.000197	-2.958825E-5	T	29242	2017.09.19 13:43:37.448546382	0000678	
51	0.000211	-5.526668E-5	0.000192	-6.732967E-5	T	29242	2017.09.19 13:43:37.458546382	0000678	
52	0.000212	2.508768E-5	0.000206	-4.404048E-5	T	29252	2017.09.19 13:43:37.568633882	0000678	
52	0.000194	-1.717421E-5	0.000187	-4.861927E-5	T	29252	2017.09.19 13:43:37.578633882	0000678	
52	0.000193	-2.626168E-5	0.000183	-5.352915E-5	T	29252	2017.09.19 13:43:37.588633882	0000678	
52	0.000200	-4.991482E-5	0.000193	-2.437220E-5	T	29252	2017.09.19 13:43:37.598633882	0000678	
52	0.000191	-1.206000E-5	0.000187	-3.466059E-5	T	29252	2017.09.19 13:43:37.608633882	0000678	
52	0.000206	-3.623588E-5	0.000192	-6.348462E-5	T	29252	2017.09.19 13:43:37.618633882	0000678	
52	0.000191	-4.994777E-5	0.000184	-1.533522E-5	T	29252	2017.09.19 13:43:37.628633882	0000678	
52	0.000205	-3.081008E-5	0.000201	-2.456433E-5	T	29252	2017.09.19 13:43:37.638633882	0000678	
52	0.000198	-5.009703E-5	0.000187	-3.935082E-5	T	29252	2017.09.19 13:43:37.648633882	0000678	
52	0.000216	-3.569100E-5	0.000211	-2.456510E-5	T	29252	2017.09.19 13:43:37.658633882	0000678	
53	0.000209	-3.596527E-5	0.000201	-4.352280E-5	T	29251	2017.09.19 13:43:37.768721382	0000678	
53	0.000194	-2.088505E-5	0.000192	-2.060861E-5	T	29251	2017.09.19 13:43:37.778721382	0000678	
53	0.000199	-1.685896E-5	0.000197	-2.466178E-5	T	29251	2017.09.19 13:43:37.788721382	0000678	
53	0.000193	-2.113282E-5	0.000187	-4.358690E-5	T	29251	2017.09.19 13:43:37.798721382	0000678	
53	0.000195	-4.501560E-5	0.000187	-2.939197E-5	T	29251	2017.09.19 13:43:37.808721382	0000678	
53	0.000209	-6.835244E-6	0.000206	-3.478017E-5	T	29251	2017.09.19 13:43:37.818721382	0000678	
53	0.000198	-3.991586E-5	0.000192	-2.445366E-5	T	29251	2017.09.19 13:43:37.828721382	0000678	
53	0.000194	-1.684449E-5	0.000192	-1.564140E-5	T	29251	2017.09.19 13:43:37.838721382	0000678	
53	0.000210	-2.621041E-5	0.000197	-6.758666E-5	T	29251	2017.09.19 13:43:37.848721382	0000678	
53	0.000208	-3.593249E-5	0.000201	-3.952297E-5	T	29251	2017.09.19 13:43:37.858721382	0000678	
54	0.000216	-5.504525E-5	0.000201	-5.336760E-5	T	29245	2017.09.19 13:43:37.968808882	0000678	
54	0.000201	-3.082473E-5	0.000197	-2.054789E-5	T	29245	2017.09.19 13:43:37.978808882	0000678	
54	0.000208	-3.593249E-5	0.000201	-3.952297E-5	T	29245	2017.09.19 13:43:37.988808882	0000678	
54	0.000203	-3.093946E-5	0.000197	-3.454731E-5	T	29245	2017.09.19 13:43:37.998808882	0000678	
54	0.000195	-2.617327E-5	0.000187	-4.854595E-5	T	29245	2017.09.19 13:43:38.008808882	0000678	
54	0.000201	-4.041593E-5	0.000183	-7.241430E-5	T	29245	2017.09.19 13:43:38.018808882	0000678	
54	0.000218	-3.124442E-5	0.000201	-7.756211E-5	T	29245	2017.09.19 13:43:38.028808882	0000678	
54	0.000212	-2.587425E-5	0.000206	-3.962518E-5	T	29245	2017.09.19 13:43:38.038808882	0000678	
54	0.000204	-1.227115E-5	0.000192	-6.767996E-5	T	29245	2017.09.19 13:43:38.048808882	0000678	
54	0.000207	-4.005326E-5	0.000197	-4.847341E-5	T	29245	2017.09.19 13:43:38.058808882	0000678	
55	0.000199	-3.995683E-5	0.000192	-2.945345E-5	T	29251	2017.09.19 13:43:38.168896382	0000678	
55	0.000194	-3.626064E-5	0.000183	-5.344768E-5	T	29251	2017.09.19 13:43:38.178896382	0000678	
55	0.000201	2.016137E-6	0.000197	-3.981593E-5	T	29251	2017.09.19 13:43:38.188896382	0000678	
55	0.000200	2.057112E-6	0.000197	-3.481614E-5	T	29251	2017.09.19 13:43:38.198896382	0000678	
55	0.000210	-3.600624E-5	0.000201	-4.852259E-5	T	29251	2017.09.19 13:43:38.208896382	0000678	
55	0.000215	-3.561724E-5	0.000211	-1.556547E-5	T	29251	2017.09.19 13:43:38.218896382	0000678	
55	0.000211	-2.087476E-5	0.000206	-3.966591E-5	T	29251	2017.09.19 13:43:38.228896382	0000678	
55	0.000207	-3.109516E-5	0.000197	-5.354651E-5	T	29251	2017.09.19 13:43:38.238896382	0000678	
55	0.000211	-3.120990E-5	0.000197	-6.754593E-5	T	29251	2017.09.19 13:43:38.248896382	0000678	
55	0.000173	-3.616805E-5	0.000168	-2.038681E-5	T	29251	2017.09.19 13:43:38.258896382	0000678	
56	0.000196	-4.997410E-5	0.000188	-2.435145E-5	T	29240	2017.09.19 13:43:38.368983882	0000678	
56	0.000200	-2.585803E-5	0.000197	-2.458846E-5	T	29240	2017.09.19 13:43:38.378983882	0000678	
56	0.000214	-3.061776E-5	0.000211	-1.560620E-5	T	29240	2017.09.19 13:43:38.388983882	0000678	
56	0.000209	-3.063607E-5	0.000206	-1.058566E-5	T	29240	2017.09.19 13:43:38.398983882	0000678	
56	0.000195	-2.617327E-5	0.000187	-4.854595E-5	T	29240	2017.09.19 13:43:38.408983882	0000678	
56	0.000200	-1.715590E-5	0.000192	-5.363981E-5	T	29240	2017.09.19 13:43:38.418983882	0000678	
56	0.000201	-2.615497E-5	0.000192	-5.356650E-5	T	29240	2017.09.19 13:43:38.428983882	0000678	
56	0.000204	-3.061340E-5	0.000201	-5.653299E-7	T	29240	2017.09.19 13:43:38.438983882	0000678	
56	0.000186	-1.706593E-5	0.000183	-2.960347E-5	T	29240	2017.09.19 13:43:38.448983882	0000678	
56	0.000218	-1.663369E-5	0.000216	-2.474063E-5	T	29240	2017.09.19 13:43:38.458983882	0000678	
57	0.000189	-3.132044E-5	0.000178	-5.346766E-5	T	29241	2017.09.19 13:43:38.569071382	0000678	
57	0.000195	-3.609848E-5	0.000187	-3.946487E-5	T	29241	2017.09.19 13:43:38.579071382	0000678	
57	0.000206	-3.623588E-5	0.000192	-6.348462E-5	T	29241	2017.09.19 13:43:38.589071382	0000678	
57	0.000211	-2.087476E-5	0.000206	-3.966591E-5	T	29241	2017.09.19 13:43:38.599071382	0000678	
57	0.000206	-6.968282E-6	0.000201	-4.375904E-5	T	29241	2017.09.19 13:43:38.609071382	0000678	
57	0.000199	-6.900978E-6	0.000197	-2.974303E-5	T	29241	2017.09.19 13:43:38.619071382	0000678	
57	0.000207	-6.895382E-5	0.000193	-2.921721E-5	T	29241	2017.09.19 13:43:38.629071382	0000678	
57	0.000201	-4.995579E-5	0.000192	-2.937199E-5	T	29241	2017.09.19 13:43:38.639071382	0000678	
57	0.000199	-6.900978E-6	0.000197	-2.974303E-5	T	29241	2017.09.19 13:43:38.649071382	0000678	
57	0.000210	-3.104774E-5	0.000201	-5.356311E-5	T	29241	2017.09.19 13:43:38.659071382	0000678	
58	0.000204	-2.085210E-5	0.000201	-2.964558E-5	T	29255	2017.09.19 13:43:38.769158882	0000678	
58	0.000195	-2.588453E-5	0.000192	-2.056788E-5	T	29255	2017.09.19 13:43:38.779158882	0000678	
58	0.000209	-4.509371E-5	0.000197	-5.343247E-5	T	29255	2017.09.19 13:43:38.789158882	0000678	
58	0.000207	-3.980915E-5	0.000201	-2.449101E-5	T	29255	2017.09.19 13:43:38.799158882	0000678	
58	0.000193	-4.514497E-5	0.000183	-3.937495E-5	T	29255	2017.09.19 13:43:38.809158882	0000678	
58	0.000203	-3.985657E-5	0.000197	-2.447441E-5	T	29255	2017.09.19 13:43:38.819158882	0000678	
58	0.000219	-5.912678E-5	0.000201	-6.333460E-5	T	29255	2017.09.19 13:43:38.829158882	0000678	
58	0.000185	-2.590929E-5	0.000183	-1.053094E-5	T	29255	2017.09.19 13:43:38.839158882	0000678	
58	0.000218	-6.675703E-6	0.000216	-2.982188E-5	T	29255	2017.09.19 13:43:38.849158882	0000678	
58	0.000217	-3.973156E-5	0.000211	-2.953230E-5	T	29255	2017.09.19 13:43:38.859158882	0000678	
59	0.000222	-2.601164E-5	0.000211	-6.364493E-5	T	29243	2017.09.19 13:43:38.969246382	0000678	
59	0.000199	-1.682618E-5	0.000197	-2.066194E-5	T	29243	2017.09.19 13:43:38.979246382	0000678	
59	0.000210	-2.083379E-5	0.000206	-3.466612E-5	T	29243	2017.09.19 13:43:38.989246382	0000678	
59	0.000189	-4.027853E-5	0.000178	-4.839456E-5	T	29243	2017.09.19 13:43:38.999246382	0000678	
59	0.000184	-2.620623E-5	0.000178	-3.950898E-5	T	29243	2017.09.19 13:43:39.009246382	0000678	
59	0.000186	-2.102454E-5	0.000183	-2.457109E-5	T	29243	2017.09.19 13:43:39.019246382	0000678	
59	0.000215	-1.681590E-5	0.000211	-3.971925E-5	T	29243	2017.09.19 13:43:39.029246382	0000678	
59	0.000193	-4.514497E-5	0.000183	-3.937495E-5	T	29243	2017.09.19 13:43:39.039246382	0000678	
59	0.000206	-3.577678E-5	0.000201	-2.052376E-5	T	29243	2017.09.19 13:43:39.049246382	0000678	
59	0.000186	-4.512231E-5	0.000178	-2.935462E-5	T	29243	2017.09.19 13:43:39.059246382	0000678	
60	0.000203	-2.123744E-5	0.000192	-6.360681E-5	T	29248	2017.09.19 13:43:39.169333882	0000678	
60	0.000188	-1.190429E-5	0.000187	-1.566138E-5	T	29248	2017.09.19 13:43:39.179333882	0000678	
60	0.000202	-1.698189E-5	0.000197	-3.966115E-5	T	29248	2017.09.19 13:43:39.189333882	0000678	
60	0.000206	-1.713759E-5	0.000197	-5.866035E-5	T	29248	2017.09.19 13:43:39.199333882	0000678	
60	0.000207	-3.626866E-5	0.000192	-6.748445E-5	T	29248	2017.09.19 13:43:39.209333882	0000678	
60	0.000204	-3.098043E-5	0.000197	-3.954710E-5	T	29248	2017.09.19 13:43:39.219333882	0000678	
60	0.000199	-4.517130E-5	0.000187	-4.839117E-5	T	29248	2017.09.19 13:43:39.229333882	0000678	
60	0.000198	2.212818E-6	0.000197	-1.581693E-5	T	29248	2017.09.19 13:43:39.239333882	0000678	
60	0.000200	-4.988204E-5	0.000193	-2.037236E-5	T	29248	2017.09.19 13:43:39.249333882	0000678	
60	0.000189	-4.523704E-5	0.000178	-4.335403E-5	T	29248	2017.09.19 13:43:39.259333882	0000678	
61	0.000203	-1.205616E-5	0.000197	-4.870150E-5	T	29254	2017.09.19 13:43:39.369421382	0000678	
61	0.000204	-4.482328E-5	0.000197	-2.043385E-5	T	29254	2017.09.19 13:43:39.379421382	0000678	
61	0.000220	-4.484577E-5	0.000211	-4.349098E-5	T	29254	2017.09.19 13:43:39.389421382	0000678	
61	0.000199	-3.125471E-5	0.000187	-5.850481E-5	T	29254	2017.09.19 13:43:39.399421382	0000678	
61	0.000195	-4.990035E-5	0.000188	-1.535182E-5	T	29254	2017.09.19 13:43:39.409421382	0000678	
61	0.000196	-3.134311E-5	0.000183	-6.348800E-5	T	29254	2017.09.19 13:43:39.419421382	0000678	
61	0.000187	-3.099072E-5	0.000183	-2.048979E-5	T	29254	2017.09.19 13:43:39.429421382	0000678	
61	0.000197	-1.241884E-5	0.000183	-7.264240E-5	T	29254	2017.09.19 13:43:39.439421382	0000678	
61	0.000180	-5.032230E-5	0.000168	-3.927197E-5	T	29254	2017.09.19 13:43:39.449421382	0000678	
61	0.000197	-1.207447E-5	0.000192	-4.368096E-5	T	29254	2017.09.19 13:43:39.459421382	0000678	
62	0.000204	-4.485606E-5	0.000197	-2.443368E-5	T	29247	2017.09.19 13:43:39.569508882	0000678	
62	0.000200	-2.942368E-6	0.000197	-3.477541E-5	T	29247	2017.09.19 13:43:39.579508882	0000678	
62	0.000196	1.956855E-6	0.000192	-3.979518E-5	T	29247	2017.09.19 13:43:39.589508882	0000678	
62	0.000202	-3.974184E-5	0.000197	-1.047500E-5	T	29247	2017.09.19 13:43:39.599508882	0000678	
62	0.000198	-7.115966E-6	0.000192	-4.872148E-5	T	29247	2017.09.19 13:43:39.609508882	0000678	
62	0.000203	-3.119542E-5	0.000192	-5.852556E-5	T	29247	2017.09.19 13:43:39.619508882	0000678	
62	0.000182	-2.112480E-5	0.000178	-2.955013E-5	T	29247	2017.09.19 13:43:39.629508882	0000678	
62	0.000214	-2.776376E-6	0.000211	-3.483351E-5	T	29247	2017.09.19 13:43:39.639508882	0000678	
62	0.000200	-5.017078E-5	0.000187	-4.835044E-5	T	29247	2017.09.19 13:43:39.649508882	0000678	
62	0.000198	1.883099E-6	0.000192	-4.879480E-5	T	29247	2017.09.19 13:43:39.659508882	0000678	
63	0.000197	-5.494080E-5	0.000188	-2.031088E-5	T	29246	2017.09.19 13:43:39.769596382	0000678	
63	0.000184	2.046826E-6	0.000183	-1.575883E-5	T	29246	2017.09.19 13:43:39.779596382	0000678	
63	0.000191	-3.117921E-5	0.000183	-4.348883E-5	T	29246	2017.09.19 13:43:39.789596382	0000678	
63	0.000194	-1.684449E-5	0.000192	-1.564140E-5	T	29246	2017.09.19 13:43:39.799596382	0000678	
63	0.000213	-2.735401E-6	0.000211	-2.983371E-5	T	29246	2017.09.19 13:43:39.809596382	0000678	
63	0.000207	-4.469390E-5	0.000202	-1.045086E-5	T	29246	2017.09.19 13:43:39.819596382	0000678	
63	0.000209	2.163821E-6	0.000206	-3.485349E-5	T	29246	2017.09.19 13:43:39.829596382	0000678	
63	0.000190	-4.494829E-5	0.000183	-1.537595E-5	T	29246	2017.09.19 13:43:39.839596382	0000678	
63	0.000209	-1.679323E-5	0.000206	-2.969892E-5	T	29246	2017.09.19 13:43:39.849596382	0000678	
63	0.000220	-5.857388E-5	0.000212	-1.037832E-5	T	29246	2017.09.19 13:43:39.859596382	0000678	
64	0.000210	-6.415102E-5	0.000193	-5.325694E-5	T	29253	2017.09.19 13:43:39.969683882	0000678	
64	0.000203	-1.677876E-5	0.000201	-2.067854E-5	T	29253	2017.09.19 13:43:39.979683882	0000678	
64	0.000181	-3.129777E-5	0.000173	-4.344733E-5	T	29253	2017.09.19 13:43:39.989683882	0000678	
64	0.000194	-3.109900E-5	0.000187	-3.950560E-5	T	29253	2017.09.19 13:43:39.999683882	0000678	
64	0.000194	-1.717421E-5	0.000187	-4.861927E-5	T	29253	2017.09.19 13:43:40.009683882	0000678	
64	0.000207	-3.093301E-5	0.000201	-3.956370E-5	T	29253	2017.09.19 13:43:40.019683882	0000678	
64	0.000231	-6.875121E-5	0.000217	-3.931639E-5	T	29253	2017.09.19 13:43:40.029683882	0000678	
64	0.000190	-3.090232E-5	0.000187	-1.550660E-5	T	29253	2017.09.19 13:43:40.039683882	0000678	
64	0.000230	-3.086344E-5	0.000220	-5.864176E-5	T	29253	2017.09.19 13:43:40.049683882	0000678	
64	0.000180	-2.129881E-5	0.000173	-4.352879E-5	T	29253	2017.09.19 13:43:40.059683882	0000678	
65	0.000198	-1.707395E-5	0.000192	-4.364023E-5	T	29251	2017.09.19 13:43:40.169771382	0000678	
65	0.000208	-1.700822E-5	0.000201	-4.867737E-5	T	29251	2017.09.19 13:43:40.179771382	0000678	
65	0.000196	-2.595829E-5	0.000192	-2.956750E-5	T	29251	2017.09.19 13:43:40.189771382	0000678	
65	0.000210	-2.621041E-5	0.000197	-6.758666E-5	T	29251	2017.09.19 13:43:40.199771382	0000678	
65	0.000189	-1.690377E-5	0.000187	-1.562065E-5	T	29251	2017.09.19 13:43:40.209771382	0000678	
65	0.000197	1.924075E-6	0.000192	-4.379501E-5	T	29251	2017.09.19 13:43:40.219771382	0000678	
65	0.000189	-3.606396E-5	0.000183	-2.944869E-5	T	29251	2017.09.19 13:43:40.229771382	0000678	
65	0.000190	-3.086135E-5	0.000187	-1.050681E-5	T	29251	2017.09.19 13:43:40.239771382	0000678	
65	0.000200	-1.215642E-5	0.000192	-5.368054E-5	T	29251	2017.09.19 13:43:40.249771382	0000678	
65	0.000185	-2.090981E-5	0.000183	-1.057167E-5	T	29251	2017.09.19 13:43:40.259771382	0000678	
66	0.000190	-4.498927E-5	0.000183	-2.037574E-5	T	29253	2017.09.19 13:43:40.369858882	0000678	
66	0.000212	-2.613021E-5	0.000201	-6.360343E-5	T	29253	2017.09.19 13:43:40.379858882	0000678	
66	0.000195	-2.588453E-5	0.000192	-2.056788E-5	T	29253	2017.09.19 13:43:40.389858882	0000678	
66	0.000209	-1.179375E-5	0.000206	-2.973965E-5	T	29253	2017.09.19 13:43:40.399858882	0000678	
66	0.000206	-1.196776E-5	0.000201	-4.371831E-5	T	29253	2017.09.19 13:43:40.409858882	0000678	
66	0.000185	-2.087703E-5	0.000183	-6.571842E-6	T	29253	2017.09.19 13:43:40.419858882	0000678	
66	0.000208	1.120386E-5	0.000206	-2.992701E-5	T	29253	2017.09.19 13:43:40.429858882	0000678	
66	0.000199	-1.711493E-5	0.000192	-4.864002E-5	T	29253	2017.09.19 13:43:40.439858882	0000678	
66	0.000196	-3.584252E-5	0.000192	-1.548662E-5	T	29253	2017.09.19 13:43:40.449858882	0000678	
66	0.000225	-2.591138E-5	0.000216	-5.866589E-5	T	29253	2017.09.19 13:43:40.459858882	0000678	
67	0.000189	-1.697753E-5	0.000187	-2.462027E-5	T	29254	2017.09.19 13:43:40.569946382	0000678	
67	0.000181	-1.708424E-5	0.000178	-2.458292E-5	T	29254	2017.09.19 13:43:40.579946382	0000678	
67	0.000189	-1.718066E-5	0.000183	-4.360288E-5	T	29254	2017.09.19 13:43:40.589946382	0000678	
67	0.000186	-1.232241E-5	0.000178	-5.362244E-5	T	29254	2017.09.19 13:43:40.599946382	0000678	
67	0.000196	-1.700020E-5	0.000192	-3.464061E-5	T	29254	2017.09.19 13:43:40.609946382	0000678	
67	0.000209	-3.596527E-5	0.000201	-4.352280E-5	T	29254	2017.09.19 13:43:40.619946382	0000678	
67	0.000208	-3.096579E-5	0.000201	-4.356353E-5	T	29254	2017.09.19 13:43:40.629946382	0000678	
67	0.000205	-2.626970E-5	0.000192	-6.756591E-5	T	29254	2017.09.19 13:43:40.639946382	0000678	
67	0.000210	-5.540792E-5	0.000187	-7.730850E-5	T	29254	2017.09.19 13:43:40.649946382	0000678	
67	0.000179	-4.498491E-5	0.000174	-5.334871E-6	T	29254	2017.09.19 13:43:40.659946382	0000678	
68	0.000194	-2.919701E-6	0.000192	-2.475507E-5	T	29253	2017.09.19 13:43:40.770033882	0000678	
68	0.000214	-4.539065E-5	0.000192	-8.241050E-5	T	29253	2017.09.19 13:43:40.780033882	0000678	
68	0.000198	2.139063E-6	0.000197	-2.481655E-5	T	29253	2017.09.19 13:43:40.790033882	0000678	
68	0.000201	-3.111347E-5	0.000192	-4.852597E-5	T	29253	2017.09.19 13:43:40.800033882	0000678	
68	0.000205	-1.193498E-5	0.000201	-3.971848E-5	T	29253	2017.09.19 13:43:40.810033882	0000678	
68	0.000196	-4.013085E-5	0.000187	-4.343212E-5	T	29253	2017.09.19 13:43:40.820033882	0000678	
68	0.000212	2.337834E-6	0.000211	-2.087482E-5	T	29253	2017.09.19 13:43:40.830033882	0000678	
68	0.000195	-1.695922E-5	0.000192	-2.964082E-5	T	29253	2017.09.19 13:43:40.840033882	0000678	
68	0.000215	-5.900386E-5	0.000202	-4.833523E-5	T	29253	2017.09.19 13:43:40.850033882	0000678	
68	0.000202	-1.673778E-5	0.000201	-1.567875E-5	T	29253	2017.09.19 13:43:40.860033882	0000678	
69	0.000195	-7.001236E-6	0.000192	-3.472207E-5	T	29260	2017.09.19 13:43:40.970121382	0000678	
69	0.000189	-2.094433E-5	0.000187	-2.058786E-5	T	29260	2017.09.19 13:43:40.980121382	0000678	
69	0.000204	-2.577782E-5	0.000201	-2.060523E-5	T	29260	2017.09.19 13:43:40.990121382	0000678	
69	0.000183	2.128776E-6	0.000183	-5.759248E-6	T	29260	2017.09.19 13:43:41.000121382	0000678	
69	0.000191	-4.990680E-5	0.000184	-1.033543E-5	T	29260	2017.09.19 13:43:41.010121382	0000678	
69	0.000202	-3.585699E-5	0.000197	-2.450700E-5	T	29260	2017.09.19 13:43:41.020121382	0000678	
69	0.000205	-2.935917E-6	0.000201	-3.979180E-5	T	29260	2017.09.19 13:43:41.030121382	0000678	
69	0.000207	-5.911056E-5	0.000193	-4.829788E-5	T	29260	2017.09.19 13:43:41.040121382	0000678	
69	0.000189	-4.002257E-5	0.000183	-2.441631E-5	T	29260	2017.09.19 13:43:41.050121382	0000678	
69	0.000215	-3.565822E-5	0.000211	-2.056526E-5	T	29260	2017.09.19 13:43:41.060121382	0000678	
70	0.000204	-3.098073E-6	0.000197	-5.377461E-5	T	29245	2017.09.19 13:43:41.170208882	0000678	
70	0.000191	-1.206000E-5	0.000187	-3.466059E-5	T	29245	2017.09.19 13:43:41.180208882	0000678	
70	0.000189	5.419754E-6	0.000173	-7.774732E-5	T	29245	2017.09.19 13:43:41.190208882	0000678	
70	0.000208	-7.433864E-5	0.000184	-6.313770E-5	T	29245	2017.09.19 13:43:41.200208882	0000678	
70	0.000203	-2.123744E-5	0.000192	-6.360681E-5	T	29245	2017.09.19 13:43:41.210208882	0000678	
70	0.000191	-4.998875E-5	0.000184	-2.033501E-5	T	29245	2017.09.19 13:43:41.220208882	0000678	
70	0.000203	-3.057098E-6	0.000197	-4.877482E-5	T	29245	2017.09.19 13:43:41.230208882	0000678	
70	0.000210	-4.989006E-5	0.000201	-3.440913E-5	T	29245	2017.09.19 13:43:41.240208882	0000678	
70	0.000191	-4.010452E-5	0.000183	-3.441589E-5	T	29245	2017.09.19 13:43:41.250208882	0000678	
70	0.000212	-1.694894E-5	0.000206	-4.869812E-5	T	29245	2017.09.19 13:43:41.260208882	0000678	
71	0.000180	-7.085277E-6	0.000178	-2.466439E-5	T	29264	2017.09.19 13:43:41.370296382	0000678	
71	0.000194	-4.981840E-5	0.000188	-5.352240E-6	T	29264	2017.09.19 13:43:41.380296382	0000678	
71	0.000202	-2.119646E-5	0.000192	-5.860702E-5	T	29264	2017.09.19 13:43:41.390296382	0000678	
71	0.000202	-7.015708E-6	0.000197	-4.374244E-5	T	29264	2017.09.19 13:43:41.400296382	0000678	
71	0.000195	-2.091783E-5	0.000192	-2.460844E-5	T	29264	2017.09.19 13:43:41.410296382	0000678	
71	0.000208	-1.675225E-5	0.000206	-2.469913E-5	T	29264	2017.09.19 13:43:41.420296382	0000678	
71	0.000208	-3.593249E-5	0.000201	-3.952297E-5	T	29264	2017.09.19 13:43:41.430296382	0000678	
71	0.000207	-3.109516E-5	0.000197	-5.354651E-5	T	29264	2017.09.19 13:43:41.440296382	0000678	
71	0.000208	-2.100780E-5	0.000201	-4.864479E-5	T	29264	2017.09.19 13:43:41.450296382	0000678	
71	0.000205	-3.105419E-5	0.000197	-4.854672E-5	T	29264	2017.09.19 13:43:41.460296382	0000678	
72	0.000189	-5.020374E-5	0.000178	-3.931347E-5	T	29248	2017.09.19 13:43:41.570383882	0000678	
72	0.000205	-3.081008E-5	0.000201	-2.456433E-5	T	29248	2017.09.19 13:43:41.580383882	0000678	
72	0.000191	-1.206000E-5	0.000187	-3.466059E-5	T	29248	2017.09.19 13:43:41.590383882	0000678	
72	0.000188	-6.945788E-6	0.000187	-2.070190E-5	T	29248	2017.09.19 13:43:41.600383882	0000678	
72	0.000197	-2.599926E-5	0.000192	-3.456729E-5	T	29248	2017.09.19 13:43:41.610383882	0000678	
72	0.000217	-1.688965E-5	0.000211	-4.871887E-5	T	29248	2017.09.19 13:43:41.620383882	0000678	
72	0.000198	-3.991586E-5	0.000192	-2.445366E-5	T	29248	2017.09.19 13:43:41.630383882	0000678	
72	0.000195	-3.113178E-5	0.000187	-4.350543E-5	T	29248	2017.09.19 13:43:41.640383882	0000678	
72	0.000209	-1.183472E-5	0.000206	-3.473944E-5	T	29248	2017.09.19 13:43:41.650383882	0000678	
72	0.000209	-7.395330E-5	0.000193	-2.917648E-5	T	29248	2017.09.19 13:43:41.660383882	0000678	
73	0.000206	-2.093405E-5	0.000201	-3.964516E-5	T	29255	2017.09.19 13:43:41.770471382	0000678	
73	0.000208	-4.009423E-5	0.000197	-5.347320E-5	T	29255	2017.09.19 13:43:41.780471382	0000678	
73	0.000204	-3.597992E-5	0.000197	-3.950637E-5	T	29255	2017.09.19 13:43:41.790471382	0000678	
73	0.000204	-2.105523E-5	0.000197	-4.862819E-5	T	29255	2017.09.19 13:43:41.800471382	0000678	
73	0.000204	-2.081112E-5	0.000201	-2.464579E-5	T	29255	2017.09.19 13:43:41.810471382	0000678	
73	0.000206	-4.001228E-5	0.000197	-4.347362E-5	T	29255	2017.09.19 13:43:41.820471382	0000678	
73	0.000208	-6.406907E-5	0.000193	-4.325735E-5	T	29255	2017.09.19 13:43:41.830471382	0000678	
73	0.000191	-2.101809E-5	0.000187	-2.958748E-5	T	29255	2017.09.19 13:43:41.840471382	0000678	
73	0.000193	-3.105803E-5	0.000187	-3.450581E-5	T	29255	2017.09.19 13:43:41.850471382	0000678	
73	0.000195	-1.695922E-5	0.000192	-2.964082E-5	T	29255	2017.09.19 13:43:41.860471382	0000678	
74	0.000193	-2.076213E-5	0.000192	-5.609234E-6	T	29250	2017.09.19 13:43:41.970558882	0000678	
74	0.000212	-4.517566E-5	0.000197	-6.343205E-5	T	29250	2017.09.19 13:43:41.980558882	0000678	
74	0.000203	-2.101425E-5	0.000197	-4.362840E-5	T	29250	2017.09.19 13:43:41.990558882	0000678	
74	0.000200	-1.732991E-5	0.000187	-6.761848E-5	T	29250	2017.09.19 13:43:42.000558882	0000678	
74	0.000198	-1.670326E-5	0.000197	-5.662569E-6	T	29250	2017.09.19 13:43:42.010558882	0000678	
74	0.000214	-6.900927E-5	0.000198	-4.323737E-5	T	29250	2017.09.19 13:43:42.020558882	0000678	
74	0.000189	-3.606396E-5	0.000183	-2.944869E-5	T	29250	2017.09.19 13:43:42.030558882	0000678	
74	0.000191	-2.122122E-5	0.000183	-4.857009E-5	T	29250	2017.09.19 13:43:42.040558882	0000678	
74	0.000209	-4.977533E-5	0.000202	-2.040971E-5	T	29250	2017.09.19 13:43:42.050558882	0000678	
74	0.000209	-2.617763E-5	0.000197	-6.358683E-5	T	29250	2017.09.19 13:43:42.060558882	0000678	
75	0.000204	-2.105523E-5	0.000197	-4.862819E-5	T	29242	2017.09.19 13:43:42.170646382	0000678	
75	0.000192	-2.110004E-5	0.000187	-3.958706E-5	T	29242	2017.09.19 13:43:42.180646382	0000678	
75	0.000196	-2.591731E-5	0.000192	-2.456771E-5	T	29242	2017.09.19 13:43:42.190646382	0000678	
75	0.000211	-4.496433E-5	0.000201	-4.344948E-5	T	29242	2017.09.19 13:43:42.200646382	0000678	
75	0.000205	-4.489703E-5	0.000197	-2.943347E-5	T	29242	2017.09.19 13:43:42.210646382	0000678	
75	0.000212	-3.108871E-5	0.000201	-5.856291E-5	T	29242	2017.09.19 13:43:42.220646382	0000678	
75	0.000200	-3.603920E-5	0.000192	-3.948562E-5	T	29242	2017.09.19 13:43:42.230646382	0000678	
75	0.000204	-3.597992E-5	0.000197	-3.950637E-5	T	29242	2017.09.19 13:43:42.240646382	0000678	
75	0.000193	-2.609952E-5	0.000187	-3.954633E-5	T	29242	2017.09.19 13:43:42.250646382	0000678	
75	0.000198	-3.621321E-5	0.000187	-5.346428E-5	T	29242	2017.09.19 13:43:42.260646382	0000678	
76	0.000209	-3.067705E-5	0.000206	-1.558545E-5	T	29259	2017.09.19 13:43:42.370733882	0000678	
76	0.000202	-7.015708E-6	0.000197	-4.374244E-5	T	29259	2017.09.19 13:43:42.380733882	0000678	
76	0.000203	-1.701467E-5	0.000197	-4.366098E-5	T	29259	2017.09.19 13:43:42.390733882	0000678	
76	0.000203	-2.101425E-5	0.000197	-4.362840E-5	T	29259	2017.09.19 13:43:42.400733882	0000678	
76	0.000207	-3.089203E-5	0.000201	-3.456391E-5	T	29259	2017.09.19 13:43:42.410733882	0000678	
76	0.000216	-1.184920E-5	0.000211	-4.375981E-5	T	29259	2017.09.19 13:43:42.420733882	0000678	
76	0.000192	-3.101705E-5	0.000187	-2.950602E-5	T	29259	2017.09.19 13:43:42.430733882	0000678	
76	0.000201	-4.995579E-5	0.000192	-2.937199E-5	T	29259	2017.09.19 13:43:42.440733882	0000678	
76	0.000201	-3.111347E-5	0.000192	-4.852597E-5	T	29259	2017.09.19 13:43:42.450733882	0000678	
76	0.000213	-2.553633E-5	0.000211	-5.647353E-6	T	29259	2017.09.19 13:43:42.460733882	0000678	
77	0.000208	-1.700822E-5	0.000201	-4.867737E-5	T	29254	2017.09.19 13:43:42.570821382	0000678	
77	0.000211	-1.690796E-5	0.000206	-4.369833E-5	T	29254	2017.09.19 13:43:42.580821382	0000678	
77	0.000205	-1.745284E-5	0.000187	-8.261785E-5	T	29254	2017.09.19 13:43:42.590821382	0000678	
77	0.000206	-2.589255E-5	0.000201	-3.460464E-5	T	29254	2017.09.19 13:43:42.600821382	0000678	
77	0.000212	-4.996382E-5	0.000201	-4.340875E-5	T	29254	2017.09.19 13:43:42.610821382	0000678	
77	0.000185	-1.199270E-5	0.000183	-2.064457E-5	T	29254	2017.09.19 13:43:42.620821382	0000678	
77	0.000217	-3.081444E-5	0.000211	-3.960520E-5	T	29254	2017.09.19 13:43:42.630821382	0000678	
77	0.000188	-3.602298E-5	0.000183	-2.444889E-5	T	29254	2017.09.19 13:43:42.640821382	0000678	
77	0.000198	-1.170378E-5	0.000197	-5.703301E-6	T	29254	2017.09.19 13:43:42.650821382	0000678	
77	0.000217	-4.465728E-5	0.000211	-2.049195E-5	T	29254	2017.09.19 13:43:42.660821382	0000678	
78	0.000221	-5.868861E-5	0.000212	-2.437773E-5	T	29247	2017.09.19 13:43:42.770908882	0000678	
78	0.000199	-4.488256E-5	0.000192	-2.041310E-5	T	29247	2017.09.19 13:43:42.780908882	0000678	
78	0.000204	-5.007052E-5	0.000192	-4.337140E-5	T	29247	2017.09.19 13:43:42.790908882	0000678	
78	0.000223	-3.575464E-5	0.000216	-3.958522E-5	T	29247	2017.09.19 13:43:42.800908882	0000678	
78	0.000186	-7.107945E-6	0.000183	-3.468472E-5	T	29247	2017.09.19 13:43:42.810908882	0000678	
78	0.000198	-4.484158E-5	0.000192	-1.541330E-5	T	29247	2017.09.19 13:43:42.820908882	0000678	
78	0.000183	-3.112376E-5	0.000178	-2.946867E-5	T	29247	2017.09.19 13:43:42.830908882	0000678	
78	0.000199	-1.682618E-5	0.000197	-2.066194E-5	T	29247	2017.09.19 13:43:42.840908882	0000678	
78	0.000194	-4.001612E-5	0.000187	-2.943270E-5	T	29247	2017.09.19 13:43:42.850908882	0000678	
78	0.000196	-3.088401E-5	0.000192	-2.052714E-5	T	29247	2017.09.19 13:43:42.860908882	0000678	
79	0.000202	-4.507104E-5	0.000192	-4.341213E-5	T	29246	2017.09.19 13:43:42.970996382	0000678	
79	0.000187	-1.210743E-5	0.000183	-3.464399E-5	T	29246	2017.09.19 13:43:42.980996382	0000678	
79	0.000206	-4.001228E-5	0.000197	-4.347362E-5	T	29246	2017.09.19 13:43:42.990996382	0000678	
79	0.000196	-4.505657E-5	0.000187	-3.439176E-5	T	29246	2017.09.19 13:43:43.000996382	0000678	
79	0.000199	-3.625419E-5	0.000187	-5.846407E-5	T	29246	2017.09.19 13:43:43.010996382	0000678	
79	0.000229	-1.190639E-5	0.000220	-6.379633E-5	T	29246	2017.09.19 13:43:43.020996382	0000678	
79	0.000192	-5.491447E-5	0.000184	-1.129466E-5	T	29246	2017.09.19 13:43:43.030996382	0000678	
79	0.000199	-3.995683E-5	0.000192	-2.945345E-5	T	29246	2017.09.19 13:43:43.040996382	0000678	
79	0.000196	-3.580154E-5	0.000192	-1.048683E-5	T	29246	2017.09.19 13:43:43.050996382	0000678	
79	0.000200	-3.078375E-5	0.000197	-1.554810E-5	T	29246	2017.09.19 13:43:43.060996382	0000678	
80	0.000203	-1.205616E-5	0.000197	-4.870150E-5	T	29254	2017.09.19 13:43:43.171083882	0000678	
80	0.000182	-1.216671E-5	0.000178	-3.462324E-5	T	29254	2017.09.19 13:43:43.181083882	0000678	
80	0.000207	-2.593353E-5	0.000201	-3.960443E-5	T	29254	2017.09.19 13:43:43.191083882	0000678	
80	0.000202	-7.015708E-6	0.000197	-4.374244E-5	T	29254	2017.09.19 13:43:43.201083882	0000678	
80	0.000206	-1.693446E-5	0.000201	-3.967775E-5	T	29254	2017.09.19 13:43:43.211083882	0000678	
80	0.000203	-2.569587E-5	0.000201	-1.060564E-5	T	29254	2017.09.19 13:43:43.221083882	0000678	
80	0.000205	-3.105419E-5	0.000197	-4.854672E-5	T	29254	2017.09.19 13:43:43.231083882	0000678	
80	0.000183	-5.506582E-5	0.000174	-1.525299E-5	T	29254	2017.09.19 13:43:43.241083882	0000678	
80	0.000199	-1.185948E-5	0.000197	-2.470251E-5	T	29254	2017.09.19 13:43:43.251083882	0000678	
80	0.000195	-3.113178E-5	0.000187	-4.350543E-5	T	29254	2017.09.19 13:43:43.261083882	0000678	
81	0.000209	-3.596527E-5	0.000201	-4.352280E-5	T	29255	2017.09.19 13:43:43.371171382	0000678	
81	0.000216	-6.849716E-6	0.000211	-4.380054E-5	T	29255	2017.09.19 13:43:43.381171382	0000678	
81	0.000188	-3.602298E-5	0.000183	-2.444889E-5	T	29255	2017.09.19 13:43:43.391171382	0000678	
81	0.000209	-5.023442E-5	0.000192	-6.337057E-5	T	29255	2017.09.19 13:43:43.401171382	0000678	
81	0.000204	-7.097658E-6	0.000197	-5.374203E-5	T	29255	2017.09.19 13:43:43.411171382	0000678	
81	0.000191	-7.101493E-6	0.000187	-3.970111E-5	T	29255	2017.09.19 13:43:43.421171382	0000678	
81	0.000210	-3.104774E-5	0.000201	-5.356311E-5	T	29255	2017.09.19 13:43:43.431171382	0000678	
81	0.000191	-4.994777E-5	0.000184	-1.533522E-5	T	29255	2017.09.19 13:43:43.441171382	0000678	
81	0.000208	-5.001124E-5	0.000197	-4.339215E-5	T	29255	2017.09.19 13:43:43.451171382	0000678	
81	0.000204	-2.081112E-5	0.000201	-2.464579E-5	T	29255	2017.09.19 13:43:43.461171382	0000678	
82	0.000202	-6.921623E-5	0.000184	-4.817906E-5	T	29249	2017.09.19 13:43:43.571258882	0000678	
82	0.000193	-3.105803E-5	0.000187	-3.450581E-5	T	29249	2017.09.19 13:43:43.581258882	0000678	
82	0.000222	-4.528394E-5	0.000201	-8.244785E-5	T	29249	2017.09.19 13:43:43.591258882	0000678	
82	0.000207	-4.501176E-5	0.000197	-4.343288E-5	T	29249	2017.09.19 13:43:43.601258882	0000678	
82	0.000204	-3.989755E-5	0.000197	-2.947420E-5	T	29249	2017.09.19 13:43:43.611258882	0000678	
82	0.000196	-3.613126E-5	0.000187	-4.346470E-5	T	29249	2017.09.19 13:43:43.621258882	0000678	
82	0.000200	-3.074278E-5	0.000197	-1.054831E-5	T	29249	2017.09.19 13:43:43.631258882	0000678	
82	0.000206	2.030784E-6	0.000201	-4.383236E-5	T	29249	2017.09.19 13:43:43.641258882	0000678	
82	0.000173	-4.032979E-5	0.000164	-3.433704E-5	T	29249	2017.09.19 13:43:43.651258882	0000678	
82	0.000203	-1.205616E-5	0.000197	-4.870150E-5	T	29249	2017.09.19 13:43:43.661258882	0000678	
83	0.000212	-4.004680E-5	0.000201	-5.348980E-5	T	29250	2017.09.19 13:43:43.771346382	0000678	
83	0.000175	-2.594591E-5	0.000173	-4.898603E-7	T	29250	2017.09.19 13:43:43.781346382	0000678	
83	0.000217	-3.998752E-5	0.000206	-5.351055E-5	T	29250	2017.09.19 13:43:43.791346382	0000678	
83	0.000200	-3.074278E-5	0.000197	-1.054831E-5	T	29250	2017.09.19 13:43:43.801346382	0000678	
83	0.000211	-1.213166E-5	0.000201	-6.371748E-5	T	29250	2017.09.19 13:43:43.811346382	0000678	
83	0.000218	-3.084722E-5	0.000211	-4.360503E-5	T	29250	2017.09.19 13:43:43.821346382	0000678	
83	0.000211	-3.579126E-5	0.000206	-2.954414E-5	T	29250	2017.09.19 13:43:43.831346382	0000678	
83	0.000206	-4.989651E-5	0.000197	-2.939274E-5	T	29250	2017.09.19 13:43:43.841346382	0000678	
83	0.000190	-1.201902E-5	0.000187	-2.966080E-5	T	29250	2017.09.19 13:43:43.851346382	0000678	
83	0.000201	-5.909609E-5	0.000188	-3.927750E-5	T	29250	2017.09.19 13:43:43.861346382	0000678	
84	0.000203	1.942382E-6	0.000197	-4.881555E-5	T	29254	2017.09.19 13:43:43.971433882	0000678	
84	0.000203	-4.465938E-5	0.000198	-4.346814E-7	T	29254	2017.09.19 13:43:43.981433882	0000678	
84	0.000211	-5.505170E-5	0.000197	-4.835121E-5	T	29254	2017.09.19 13:43:43.991433882	0000678	
84	0.000193	-2.609952E-5	0.000187	-3.954633E-5	T	29254	2017.09.19 13:43:44.001433882	0000678	
84	0.000205	-4.493801E-5	0.000197	-3.443326E-5	T	29254	2017.09.19 13:43:44.011433882	0000678	
84	0.000204	-3.101321E-5	0.000197	-4.354693E-5	T	29254	2017.09.19 13:43:44.021433882	0000678	
84	0.000192	-3.597556E-5	0.000187	-2.446549E-5	T	29254	2017.09.19 13:43:44.031433882	0000678	
84	0.000203	-1.681154E-5	0.000201	-2.467838E-5	T	29254	2017.09.19 13:43:44.041433882	0000678	
84	0.000222	-3.967228E-5	0.000216	-2.955305E-5	T	29254	2017.09.19 13:43:44.051433882	0000678	
84	0.000198	-1.174475E-5	0.000197	-1.070309E-5	T	29254	2017.09.19 13:43:44.061433882	0000678	
85	0.000219	-3.606989E-5	0.000206	-6.354272E-5	T	29250	2017.09.19 13:43:44.171521382	0000678	
85	0.000195	-3.076928E-5	0.000192	-6.527729E-6	T	29250	2017.09.19 13:43:44.181521382	0000678	
85	0.000207	-2.113718E-5	0.000197	-5.862777E-5	T	29250	2017.09.19 13:43:44.191521382	0000678	
85	0.000206	-2.589255E-5	0.000201	-3.460464E-5	T	29250	2017.09.19 13:43:44.201521382	0000678	
85	0.000200	-1.715590E-5	0.000192	-5.363981E-5	T	29250	2017.09.19 13:43:44.211521382	0000678	
85	0.000195	-7.216224E-6	0.000187	-5.370053E-5	T	29250	2017.09.19 13:43:44.221521382	0000678	
85	0.000227	-3.573999E-5	0.000220	-4.360165E-5	T	29250	2017.09.19 13:43:44.231521382	0000678	
85	0.000192	-2.605854E-5	0.000187	-3.454654E-5	T	29250	2017.09.19 13:43:44.241521382	0000678	
85	0.000218	2.323362E-6	0.000216	-2.989520E-5	T	29250	2017.09.19 13:43:44.251521382	0000678	
85	0.000213	-6.897649E-5	0.000198	-3.923754E-5	T	29250	2017.09.19 13:43:44.261521382	0000678	
86	0.000195	1.997830E-6	0.000192	-3.479539E-5	T	29249	2017.09.19 13:43:44.371608882	0000678	
86	0.000207	-4.040948E-5	0.000187	-7.743069E-5	T	29249	2017.09.19 13:43:44.381608882	0000678	
86	0.000201	-2.094050E-5	0.000197	-3.462877E-5	T	29249	2017.09.19 13:43:44.391608882	0000678	
86	0.000201	-3.566031E-5	0.000197	-5.079982E-7	T	29249	2017.09.19 13:43:44.401608882	0000678	
86	0.000215	-3.557627E-5	0.000211	-1.056568E-5	T	29249	2017.09.19 13:43:44.411608882	0000678	
86	0.000200	-2.089952E-5	0.000197	-2.962898E-5	T	29249	2017.09.19 13:43:44.421608882	0000678	
86	0.000184	-2.620623E-5	0.000178	-3.950898E-5	T	29249	2017.09.19 13:43:44.431608882	0000678	
86	0.000214	-3.553529E-5	0.000211	-5.565890E-6	T	29249	2017.09.19 13:43:44.441608882	0000678	
86	0.000214	-3.612917E-5	0.000201	-6.352197E-5	T	29249	2017.09.19 13:43:44.451608882	0000678	
86	0.000195	-1.195974E-5	0.000192	-2.968155E-5	T	29249	2017.09.19 13:43:44.461608882	0000678	
87	0.000212	-2.694426E-6	0.000211	-2.483392E-5	T	29249	2017.09.19 13:43:44.571696382	0000678	
87	0.000225	-1.195381E-5	0.000216	-6.377973E-5	T	29249	2017.09.19 13:43:44.581696382	0000678	
87	0.000198	-4.480880E-5	0.000192	-1.141347E-5	T	29249	2017.09.19 13:43:44.591696382	0000678	
87	0.000208	-3.593249E-5	0.000201	-3.952297E-5	T	29249	2017.09.19 13:43:44.601696382	0000678	
87	0.000210	-6.876219E-6	0.000206	-3.977996E-5	T	29249	2017.09.19 13:43:44.611696382	0000678	
87	0.000201	-5.484054E-5	0.000193	-1.533184E-5	T	29249	2017.09.19 13:43:44.621696382	0000678	
87	0.000198	-1.678521E-5	0.000197	-1.566215E-5	T	29249	2017.09.19 13:43:44.631696382	0000678	
87	0.000205	-1.689349E-5	0.000201	-3.467796E-5	T	29249	2017.09.19 13:43:44.641696382	0000678	
87	0.000196	-2.595829E-5	0.000192	-2.956750E-5	T	29249	2017.09.19 13:43:44.651696382	0000678	
87	0.000207	-3.109516E-5	0.000197	-5.354651E-5	T	29249	2017.09.19 13:43:44.661696382	0000678	
88	0.000181	-2.605052E-5	0.000178	-2.050977E-5	T	29252	2017.09.19 13:43:44.771783882	0000678	
88	0.000202	-3.089848E-5	0.000197	-2.954752E-5	T	29252	2017.09.19 13:43:44.781783882	0000678	
88	0.000203	-3.119542E-5	0.000192	-5.852556E-5	T	29252	2017.09.19 13:43:44.791783882	0000678	
88	0.000192	-3.140239E-5	0.000178	-6.346725E-5	T	29252	2017.09.19 13:43:44.801783882	0000678	
88	0.000197	-3.095777E-5	0.000192	-2.952677E-5	T	29252	2017.09.19 13:43:44.811783882	0000678	
88	0.000201	-3.578324E-5	0.000197	-1.550737E-5	T	29252	2017.09.19 13:43:44.821783882	0000678	
88	0.000215	-2.598898E-5	0.000206	-5.362460E-5	T	29252	2017.09.19 13:43:44.831783882	0000678	
88	0.000197	-3.617224E-5	0.000187	-4.846449E-5	T	29252	2017.09.19 13:43:44.841783882	0000678	
88	0.000203	-2.853967E-6	0.000201	-2.979221E-5	T	29252	2017.09.19 13:43:44.851783882	0000678	
88	0.000204	-2.085210E-5	0.000201	-2.964558E-5	T	29252	2017.09.19 13:43:44.861783882	0000678	
89	0.000209	-1.183472E-5	0.000206	-3.473944E-5	T	29246	2017.09.19 13:43:44.971871382	0000678	
89	0.000226	-5.471169E-5	0.000217	-3.443065E-5	T	29246	2017.09.19 13:43:44.981871382	0000678	
89	0.000198	-3.595725E-5	0.000192	-2.948604E-5	T	29246	2017.09.19 13:43:44.991871382	0000678	
89	0.000207	-2.593353E-5	0.000201	-3.960443E-5	T	29246	2017.09.19 13:43:45.001871382	0000678	
89	0.000197	1.924075E-6	0.000192	-4.379501E-5	T	29246	2017.09.19 13:43:45.011871382	0000678	
89	0.000208	-3.593249E-5	0.000201	-3.952297E-5	T	29246	2017.09.19 13:43:45.021871382	0000678	
89	0.000206	-1.696724E-5	0.000201	-4.367758E-5	T	29246	2017.09.19 13:43:45.031871382	0000678	
89	0.000215	-3.990557E-5	0.000206	-4.351097E-5	T	29246	2017.09.19 13:43:45.041871382	0000678	
89	0.000206	-3.085106E-5	0.000201	-2.956412E-5	T	29246	2017.09.19 13:43:45.051871382	0000678	
89	0.000201	6.015722E-6	0.000197	-3.984851E-5	T	29246	2017.09.19 13:43:45.061871382	0000678	
90	0.000211	-2.583327E-5	0.000206	-3.462539E-5	T	29259	2017.09.19 13:43:45.171958882	0000678	
90	0.000203	-2.573685E-5	0.000201	-1.560543E-5	T	29259	2017.09.19 13:43:45.181958882	0000678	
90	0.000227	-7.376900E-5	0.000212	-3.425512E-5	T	29259	2017.09.19 13:43:45.191958882	0000678	
90	0.000217	-6.913219E-5	0.000198	-5.823675E-5	T	29259	2017.09.19 13:43:45.201958882	0000678	
90	0.000201	-1.719688E-5	0.000192	-5.863960E-5	T	29259	2017.09.19 13:43:45.211958882	0000678	
90	0.000204	-3.597992E-5	0.000197	-3.950637E-5	T	29259	2017.09.19 13:43:45.221958882	0000678	
90	0.000213	-1.173447E-5	0.000211	-2.976040E-5	T	29259	2017.09.19 13:43:45.231958882	0000678	
90	0.000206	-5.511098E-5	0.000192	-4.833046E-5	T	29259	2017.09.19 13:43:45.241958882	0000678	
90	0.000195	-2.091783E-5	0.000192	-2.460844E-5	T	29259	2017.09.19 13:43:45.251958882	0000678	
90	0.000205	-1.689349E-5	0.000201	-3.467796E-5	T	29259	2017.09.19 13:43:45.261958882	0000678	
91	0.000188	-4.520426E-5	0.000178	-3.935420E-5	T	29250	2017.09.19 13:43:45.372046382	0000678	
91	0.000204	-3.101321E-5	0.000197	-4.354693E-5	T	29250	2017.09.19 13:43:45.382046382	0000678	
91	0.000203	-6.812576E-6	0.000201	-2.475984E-5	T	29250	2017.09.19 13:43:45.392046382	0000678	
91	0.000203	-3.589797E-5	0.000197	-2.950679E-5	T	29250	2017.09.19 13:43:45.402046382	0000678	
91	0.000211	-2.087476E-5	0.000206	-3.966591E-5	T	29250	2017.09.19 13:43:45.412046382	0000678	
91	0.000223	-2.710642E-6	0.000220	-3.987065E-5	T	29250	2017.09.19 13:43:45.422046382	0000678	
91	0.000207	-4.993749E-5	0.000197	-3.439253E-5	T	29250	2017.09.19 13:43:45.432046382	0000678	
91	0.000175	-2.098740E-5	0.000173	-5.530383E-6	T	29250	2017.09.19 13:43:45.442046382	0000678	
91	0.000205	-5.925180E-5	0.000187	-5.827671E-5	T	29250	2017.09.19 13:43:45.452046382	0000678	
91	0.000198	-5.501456E-5	0.000188	-2.931051E-5	T	29250	2017.09.19 13:43:45.462046382	0000678	
92	0.000192	-3.981944E-5	0.000187	-5.433704E-6	T	29245	2017.09.19 13:43:45.572133882	0000678	
92	0.000215	-1.703089E-5	0.000206	-5.869770E-5	T	29245	2017.09.19 13:43:45.582133882	0000678	
92	0.000219	-6.917317E-5	0.000198	-6.323654E-5	T	29245	2017.09.19 13:43:45.592133882	0000678	
92	0.000197	-3.591627E-5	0.000192	-2.448624E-5	T	29245	2017.09.19 13:43:45.602133882	0000678	
92	0.000184	-2.620623E-5	0.000178	-3.950898E-5	T	29245	2017.09.19 13:43:45.612133882	0000678	
92	0.000214	-7.335313E-6	0.000197	-8.274081E-5	T	29245	2017.09.19 13:43:45.622133882	0000678	
92	0.000191	-1.206000E-5	0.000187	-3.466059E-5	T	29245	2017.09.19 13:43:45.632133882	0000678	
92	0.000214	1.967141E-6	0.000206	-5.885248E-5	T	29245	2017.09.19 13:43:45.642133882	0000678	
92	0.000210	-2.083379E-5	0.000206	-3.466612E-5	T	29245	2017.09.19 13:43:45.652133882	0000678	
92	0.000192	-3.101705E-5	0.000187	-2.950602E-5	T	29245	2017.09.19 13:43:45.662133882	0000678	
93	0.000203	-3.593894E-5	0.000197	-3.450658E-5	T	29247	2017.09.19 13:43:45.772221382	0000678	
93	0.000212	-2.590703E-5	0.000206	-4.362501E-5	T	29247	2017.09.19 13:43:45.782221382	0000678	
93	0.000222	-3.075516E-5	0.000216	-3.962595E-5	T	29247	2017.09.19 13:43:45.792221382	0000678	
93	0.000198	-7.115966E-6	0.000192	-4.872148E-5	T	29247	2017.09.19 13:43:45.802221382	0000678	
93	0.000192	-2.126220E-5	0.000183	-5.356988E-5	T	29247	2017.09.19 13:43:45.812221382	0000678	
93	0.000189	-1.718066E-5	0.000183	-4.360288E-5	T	29247	2017.09.19 13:43:45.822221382	0000678	
93	0.000198	6.138647E-6	0.000197	-2.484914E-5	T	29247	2017.09.19 13:43:45.832221382	0000678	
93	0.000210	-7.425024E-5	0.000188	-5.815451E-5	T	29247	2017.09.19 13:43:45.842221382	0000678	
93	0.000206	-1.693446E-5	0.000201	-3.967775E-5	T	29247	2017.09.19 13:43:45.852221382	0000678	
93	0.000202	2.260244E-6	0.000201	-1.583353E-5	T	29247	2017.09.19 13:43:45.862221382	0000678	
94	0.000187	-3.099072E-5	0.000183	-2.048979E-5	T	29242	2017.09.19 13:43:45.972308882	0000678	
94	0.000200	-3.078375E-5	0.000197	-1.554810E-5	T	29242	2017.09.19 13:43:45.982308882	0000678	
94	0.000196	-3.584252E-5	0.000192	-1.548662E-5	T	29242	2017.09.19 13:43:45.992308882	0000678	
94	0.000209	-2.600728E-5	0.000201	-4.860406E-5	T	29242	2017.09.19 13:43:46.002308882	0000678	
94	0.000214	-5.896288E-5	0.000202	-4.333544E-5	T	29242	2017.09.19 13:43:46.012308882	0000678	
94	0.000199	-4.975911E-5	0.000193	-5.372991E-6	T	29242	2017.09.19 13:43:46.022308882	0000678	
94	0.000215	-3.565822E-5	0.000211	-2.056526E-5	T	29242	2017.09.19 13:43:46.032308882	0000678	
94	0.000191	-3.586083E-5	0.000187	-1.046608E-5	T	29242	2017.09.19 13:43:46.042308882	0000678	
94	0.000218	-1.693063E-5	0.000211	-5.371866E-5	T	29242	2017.09.19 13:43:46.052308882	0000678	
94	0.000207	-3.585054E-5	0.000201	-2.952339E-5	T	29242	2017.09.19 13:43:46.062308882	0000678	
95	0.000200	-2.585803E-5	0.000197	-2.458846E-5	T	29252	2017.09.19 13:43:46.172396382	0000678	
95	0.000200	-3.074278E-5	0.000197	-1.054831E-5	T	29252	2017.09.19 13:43:46.182396382	0000678	
95	0.000202	-3.611295E-5	0.000192	-4.848524E-5	T	29252	2017.09.19 13:43:46.192396382	0000678	
95	0.000194	-3.109900E-5	0.000187	-3.950560E-5	T	29252	2017.09.19 13:43:46.202396382	0000678	
95	0.000202	-2.593998E-5	0.000197	-3.458804E-5	T	29252	2017.09.19 13:43:46.212396382	0000678	
95	0.000222	-6.368809E-5	0.000212	-2.433700E-5	T	29252	2017.09.19 13:43:46.222396382	0000678	
95	0.000186	-1.702496E-5	0.000183	-2.460367E-5	T	29252	2017.09.19 13:43:46.232396382	0000678	
95	0.000196	-3.257614E-6	0.000187	-5.873290E-5	T	29252	2017.09.19 13:43:46.242396382	0000678	
95	0.000203	-5.521124E-5	0.000187	-5.330950E-5	T	29252	2017.09.19 13:43:46.252396382	0000678	
95	0.000188	-3.594923E-5	0.000183	-1.544927E-5	T	29252	2017.09.19 13:43:46.262396382	0000678	
96	0.000204	-3.101321E-5	0.000197	-4.354693E-5	T	29253	2017.09.19 13:43:46.372483882	0000678	
96	0.000201	-3.111347E-5	0.000192	-4.852597E-5	T	29253	2017.09.19 13:43:46.382483882	0000678	
96	0.000207	-3.980915E-5	0.000201	-2.449101E-5	T	29253	2017.09.19 13:43:46.392483882	0000678	
96	0.000207	-4.040948E-5	0.000187	-7.743069E-5	T	29253	2017.09.19 13:43:46.402483882	0000678	
96	0.000194	-2.919701E-6	0.000192	-2.475507E-5	T	29253	2017.09.19 13:43:46.412483882	0000678	
96	0.000209	-3.613562E-5	0.000197	-5.850557E-5	T	29253	2017.09.19 13:43:46.422483882	0000678	
96	0.000205	-5.011150E-5	0.000192	-4.837119E-5	T	29253	2017.09.19 13:43:46.432483882	0000678	
96	0.000192	-2.126220E-5	0.000183	-5.356988E-5	T	29253	2017.09.19 13:43:46.442483882	0000678	
96	0.000198	-5.894039E-5	0.000188	-2.027830E-5	T	29253	2017.09.19 13:43:46.452483882	0000678	
96	0.000191	-1.206000E-5	0.000187	-3.466059E-5	T	29253	2017.09.19 13:43:46.462483882	0000678	
97	0.000202	-2.593998E-5	0.000197	-3.458804E-5	T	29255	2017.09.19 13:43:46.572571382	0000678	
97	0.000200	-3.607198E-5	0.000192	-4.348545E-5	T	29255	2017.09.19 13:43:46.582571382	0000678	
97	0.000204	1.901407E-6	0.000197	-5.381534E-5	T	29255	2017.09.19 13:43:46.592571382	0000678	
97	0.000181	-3.626447E-5	0.000173	-3.940677E-5	T	29255	2017.09.19 13:43:46.602571382	0000678	
97	0.000204	-2.105523E-5	0.000197	-4.862819E-5	T	29255	2017.09.19 13:43:46.612571382	0000678	
97	0.000203	-3.615393E-5	0.000192	-5.348503E-5	T	29255	2017.09.19 13:43:46.622571382	0000678	
97	0.000200	-6.941953E-6	0.000197	-3.474282E-5	T	29255	2017.09.19 13:43:46.632571382	0000678	
97	0.000209	-3.993207E-5	0.000201	-3.949038E-5	T	29255	2017.09.19 13:43:46.642571382	0000678	
97	0.000201	-3.970087E-5	0.000197	-5.475204E-6	T	29255	2017.09.19 13:43:46.652571382	0000678	
97	0.000206	-6.605783E-6	0.000206	-6.781341E-6	T	29255	2017.09.19 13:43:46.662571382	0000678	
98	0.000203	-3.093946E-5	0.000197	-3.454731E-5	T	29246	2017.09.19 13:43:46.772658882	0000678	
98	0.000207	-3.985012E-5	0.000201	-2.949080E-5	T	29246	2017.09.19 13:43:46.782658882	0000678	
98	0.000183	-3.996712E-5	0.000178	-1.039614E-5	T	29246	2017.09.19 13:43:46.792658882	0000678	
98	0.000207	-3.093301E-5	0.000201	-3.956370E-5	T	29246	2017.09.19 13:43:46.802658882	0000678	
98	0.000206	-1.696724E-5	0.000201	-4.367758E-5	T	29246	2017.09.19 13:43:46.812658882	0000678	
98	0.000193	-2.609952E-5	0.000187	-3.954633E-5	T	29246	2017.09.19 13:43:46.822658882	0000678	
98	0.000186	-3.086780E-5	0.000183	-5.490420E-6	T	29246	2017.09.19 13:43:46.832658882	0000678	
98	0.000207	-3.180024E-6	0.000197	-6.377419E-5	T	29246	2017.09.19 13:43:46.842658882	0000678	
98	0.000184	-2.620623E-5	0.000178	-3.950898E-5	T	29246	2017.09.19 13:43:46.852658882	0000678	
98	0.000204	-4.485606E-5	0.000197	-2.443368E-5	T	29246	2017.09.19 13:43:46.862658882	0000678	
99	0.000207	-3.093301E-5	0.000201	-3.956370E-5	T	29254	2017.09.19 13:43:46.972746382	0000678	
99	0.000209	-4.526772E-5	0.000192	-6.741113E-5	T	29254	2017.09.19 13:43:46.982746382	0000678	
99	0.000196	-4.013085E-5	0.000187	-4.343212E-5	T	29254	2017.09.19 13:43:46.992746382	0000678	
99	0.000205	-3.077730E-5	0.000201	-2.056449E-5	T	29254	2017.09.19 13:43:47.002746382	0000678	
99	0.000220	-6.878783E-5	0.000207	-2.927531E-5	T	29254	2017.09.19 13:43:47.012746382	0000678	
99	0.000211	-4.017618E-5	0.000197	-6.347278E-5	T	29254	2017.09.19 13:43:47.022746382	0000678	
99	0.000205	-5.529319E-5	0.000187	-6.330908E-5	T	29254	2017.09.19 13:43:47.032746382	0000678	
99	0.000236	-5.506408E-5	0.000216	-7.742885E-5	T	29254	2017.09.19 13:43:47.042746382	0000678	
99	0.000205	-4.493801E-5	0.000197	-3.443326E-5	T	29254	2017.09.19 13:43:47.052746382	0000678	
99	0.000184	-3.612324E-5	0.000178	-2.942794E-5	T	29254	2017.09.19 13:43:47.062746382	0000678	
100	0.000204	-2.601373E-5	0.000197	-4.358766E-5	T	29261	2017.09.19 13:43:47.172833882	0000678	
100	0.000220	-4.524296E-5	0.000201	-7.744806E-5	T	29261	2017.09.19 13:43:47.182833882	0000678	
100	0.000207	-3.109516E-5	0.000197	-5.354651E-5	T	29261	2017.09.19 13:43:47.192833882	0000678	
100	0.000200	-6.941953E-6	0.000197	-3.474282E-5	T	29261	2017.09.19 13:43:47.202833882	0000678	
100	0.000211	-1.713114E-5	0.000201	-6.367675E-5	T	29261	2017.09.19 13:43:47.212833882	0000678	
100	0.000198	2.171843E-6	0.000197	-2.081672E-5	T	29261	2017.09.19 13:43:47.222833882	0000678	
100	0.000205	-3.601270E-5	0.000197	-4.350620E-5	T	29261	2017.09.19 13:43:47.232833882	0000678	
100	0.000188	-3.602298E-5	0.000183	-2.444889E-5	T	29261	2017.09.19 13:43:47.242833882	0000678	
100	0.000211	-6.908999E-6	0.000206	-4.377979E-5	T	29261	2017.09.19 13:43:47.252833882	0000678	
100	0.000197	-5.882566E-5	0.000188	-6.278882E-6	T	29261	2017.09.19 13:43:47.262833882	0000678	
101	0.000207	-4.005326E-5	0.000197	-4.847341E-5	T	29261	2017.09.19 13:43:47.372921382	0000678	
101	0.000202	-6.779796E-6	0.000201	-2.076001E-5	T	29261	2017.09.19 13:43:47.382921382	0000678	
101	0.000199	-2.111451E-5	0.000192	-4.860744E-5	T	29261	2017.09.19 13:43:47.392921382	0000678	
101	0.000203	-2.561392E-5	0.000201	-6.060615E-7	T	29261	2017.09.19 13:43:47.402921382	0000678	
101	0.000201	-1.694091E-5	0.000197	-3.466136E-5	T	29261	2017.09.19 13:43:47.412921382	0000678	
101	0.000206	-2.647174E-6	0.000206	-1.181372E-5	T	29261	2017.09.19 13:43:47.422921382	0000678	
101	0.000209	-4.980811E-5	0.000202	-2.440955E-5	T	29261	2017.09.19 13:43:47.432921382	0000678	
101	0.000183	-4.526354E-5	0.000173	-3.933345E-5	T	29261	2017.09.19 13:43:47.442921382	0000678	
101	0.000193	-2.113282E-5	0.000187	-4.358690E-5	T	29261	2017.09.19 13:43:47.452921382	0000678	
101	0.000216	-1.707186E-5	0.000206	-6.369750E-5	T	29261	2017.09.19 13:43:47.462921382	0000678	
102	0.000214	-2.069256E-5	0.000211	-2.468729E-5	T	29244	2017.09.19 13:43:47.573008882	0000678	
102	0.000198	-1.178573E-5	0.000197	-1.570288E-5	T	29244	2017.09.19 13:43:47.583008882	0000678	
102	0.000205	-3.965344E-5	0.000201	-5.491804E-6	T	29244	2017.09.19 13:43:47.593008882	0000678	
102	0.000194	-2.084408E-5	0.000192	-1.560882E-5	T	29244	2017.09.19 13:43:47.603008882	0000678	
102	0.000196	-2.095881E-5	0.000192	-2.960823E-5	T	29244	2017.09.19 13:43:47.613008882	0000678	
102	0.000206	-5.482224E-5	0.000198	-2.035238E-5	T	29244	2017.09.19 13:43:47.623008882	0000678	
102	0.000201	-1.161538E-5	0.000201	-7.201098E-7	T	29244	2017.09.19 13:43:47.633008882	0000678	
102	0.000201	-5.912887E-5	0.000188	-4.327734E-5	T	29244	2017.09.19 13:43:47.643008882	0000678	
102	0.000188	-3.994881E-5	0.000183	-1.541669E-5	T	29244	2017.09.19 13:43:47.653008882	0000678	
102	0.000207	-3.093301E-5	0.000201	-3.956370E-5	T	29244	2017.09.19 13:43:47.663008882	0000678	
103	0.000196	-3.091679E-5	0.000192	-2.452698E-5	T	29248	2017.09.19 13:43:47.773096382	0000678	
103	0.000196	-2.591731E-5	0.000192	-2.456771E-5	T	29248	2017.09.19 13:43:47.783096382	0000678	
103	0.000200	-2.582525E-5	0.000197	-2.058863E-5	T	29248	2017.09.19 13:43:47.793096382	0000678	
103	0.000200	-2.085855E-5	0.000197	-2.462919E-5	T	29248	2017.09.19 13:43:47.803096382	0000678	
103	0.000202	-4.555664E-5	0.000178	-8.235240E-5	T	29248	2017.09.19 13:43:47.813096382	0000678	
103	0.000206	-4.519397E-5	0.000192	-5.841151E-5	T	29248	2017.09.19 13:43:47.823096382	0000678	
103	0.000216	-3.120344E-5	0.000201	-7.256232E-5	T	29248	2017.09.19 13:43:47.833096382	0000678	
103	0.000201	-4.007156E-5	0.000192	-4.345287E-5	T	29248	2017.09.19 13:43:47.843096382	0000678	
103	0.000216	-2.577399E-5	0.000211	-3.464614E-5	T	29248	2017.09.19 13:43:47.853096382	0000678	
103	0.000214	-6.923245E-5	0.000193	-6.321579E-5	T	29248	2017.09.19 13:43:47.863096382	0000678	
