Block	B	Bx	By	Bz	Units	Temperature	Timestamp	Serial No.	Comment
0	0.000422	-0.000408	-0.000104	-2.523089E-5	T	29188	2017.09.19 13:31:46.957877632	0000678	
0	0.000442	-0.000428	-9.914143E-5	-4.909585E-5	T	29188	2017.09.19 13:31:46.967877632	0000678	
0	0.000421	-0.000400	-0.000110	-7.328145E-5	T	29188	2017.09.19 13:31:46.977877632	0000678	
0	0.000421	-0.000404	-0.000109	-4.425007E-5	T	29188	2017.09.19 13:31:46.987877632	0000678	
0	0.000427	-0.000414	-9.925115E-5	-3.521049E-5	T	29188	2017.09.19 13:31:46.997877632	0000678	
0	0.000422	-0.000408	-0.000104	-1.123147E-5	T	29188	2017.09.19 13:31:47.007877632	0000678	
0	0.000441	-0.000428	-9.514175E-5	-4.911245E-5	T	29188	2017.09.19 13:31:47.017877632	0000678	
0	0.000422	-0.000408	-0.000104	-1.623126E-5	T	29188	2017.09.19 13:31:47.027877632	0000678	
0	0.000427	-0.000414	-9.530821E-5	-4.922650E-5	T	29188	2017.09.19 13:31:47.037877632	0000678	
0	0.000412	-0.000395	-0.000118	-1.628721E-5	T	29188	2017.09.19 13:31:47.047877632	0000678	
1	0.000406	-0.000394	-9.540037E-5	-1.638266E-5	T	29191	2017.09.19 13:31:47.157965132	0000678	
1	0.000445	-0.000428	-0.000118	-3.901742E-5	T	29191	2017.09.19 13:31:47.167965132	0000678	
1	0.000442	-0.000428	-0.000109	-2.505536E-5	T	29191	2017.09.19 13:31:47.177965132	0000678	
1	0.000418	-0.000403	-0.000109	-1.125145E-5	T	29191	2017.09.19 13:31:47.187965132	0000678	
1	0.000446	-0.000433	-0.000104	-3.503496E-5	T	29191	2017.09.19 13:31:47.197965132	0000678	
1	0.000403	-0.000389	-9.555304E-5	-3.942243E-5	T	29191	2017.09.19 13:31:47.207965132	0000678	
1	0.000439	-0.000419	-0.000123	-4.406978E-5	T	29191	2017.09.19 13:31:47.217965132	0000678	
1	0.000410	-0.000395	-0.000109	-2.032439E-5	T	29191	2017.09.19 13:31:47.227965132	0000678	
1	0.000474	-0.000456	-0.000123	-4.376836E-5	T	29191	2017.09.19 13:31:47.237965132	0000678	
1	0.000411	-0.000395	-0.000113	-1.630796E-5	T	29191	2017.09.19 13:31:47.247965132	0000678	
2	0.000405	-0.000390	-9.957299E-5	-4.440562E-5	T	29187	2017.09.19 13:31:47.358052632	0000678	
2	0.000433	-0.000419	-0.000104	-3.514900E-5	T	29187	2017.09.19 13:31:47.368052632	0000678	
2	0.000454	-0.000438	-0.000104	-5.899322E-5	T	29187	2017.09.19 13:31:47.378052632	0000678	
2	0.000436	-0.000419	-0.000109	-5.412746E-5	T	29187	2017.09.19 13:31:47.388052632	0000678	
2	0.000425	-0.000409	-0.000109	-4.420934E-5	T	29187	2017.09.19 13:31:47.398052632	0000678	
2	0.000431	-0.000419	-9.024915E-5	-4.920652E-5	T	29187	2017.09.19 13:31:47.408052632	0000678	
2	0.000451	-0.000437	-0.000109	-1.097448E-5	T	29187	2017.09.19 13:31:47.418052632	0000678	
2	0.000433	-0.000419	-0.000104	-3.914884E-5	T	29187	2017.09.19 13:31:47.428052632	0000678	
2	0.000436	-0.000419	-0.000118	-3.009111E-5	T	29187	2017.09.19 13:31:47.438052632	0000678	
2	0.000397	-0.000376	-0.000114	-5.946094E-5	T	29187	2017.09.19 13:31:47.448052632	0000678	
3	0.000446	-0.000437	-8.986923E-5	-1.105333E-5	T	29185	2017.09.19 13:31:47.558140132	0000678	
3	0.000424	-0.000404	-0.000123	-3.919218E-5	T	29185	2017.09.19 13:31:47.568140132	0000678	
3	0.000418	-0.000403	-0.000109	-1.625124E-5	T	29185	2017.09.19 13:31:47.578140132	0000678	
3	0.000435	-0.000422	-0.000104	-1.117840E-6	T	29185	2017.09.19 13:31:47.588140132	0000678	
3	0.000413	-0.000395	-0.000110	-4.932318E-5	T	29185	2017.09.19 13:31:47.598140132	0000678	
3	0.000407	-0.000394	-9.051425E-5	-4.440224E-5	T	29185	2017.09.19 13:31:47.608140132	0000678	
3	0.000452	-0.000438	-0.000109	-3.497347E-5	T	29185	2017.09.19 13:31:47.618140132	0000678	
3	0.000401	-0.000389	-9.545982E-5	-1.642339E-5	T	29185	2017.09.19 13:31:47.628140132	0000678	
3	0.000438	-0.000423	-0.000104	-4.411604E-5	T	29185	2017.09.19 13:31:47.638140132	0000678	
3	0.000422	-0.000408	-0.000104	-2.023109E-5	T	29185	2017.09.19 13:31:47.648140132	0000678	
4	0.000430	-0.000418	-9.515149E-5	-2.518677E-5	T	29180	2017.09.19 13:31:47.758227632	0000678	
4	0.000450	-0.000433	-0.000109	-5.401341E-5	T	29180	2017.09.19 13:31:47.768227632	0000678	
4	0.000439	-0.000427	-9.504447E-5	-2.511346E-5	T	29180	2017.09.19 13:31:47.778227632	0000678	
4	0.000439	-0.000423	-0.000113	-3.007928E-5	T	29180	2017.09.19 13:31:47.788227632	0000678	
4	0.000422	-0.000409	-9.931060E-5	-3.525122E-5	T	29180	2017.09.19 13:31:47.798227632	0000678	
4	0.000426	-0.000409	-0.000118	-1.617316E-5	T	29180	2017.09.19 13:31:47.808227632	0000678	
4	0.000416	-0.000400	-0.000109	-3.928287E-5	T	29180	2017.09.19 13:31:47.818227632	0000678	
4	0.000428	-0.000414	-0.000109	-2.516940E-5	T	29180	2017.09.19 13:31:47.828227632	0000678	
4	0.000459	-0.000446	-0.000104	-2.492133E-5	T	29180	2017.09.19 13:31:47.838227632	0000678	
4	0.000420	-0.000404	-0.000109	-3.525045E-5	T	29180	2017.09.19 13:31:47.848227632	0000678	
5	0.000412	-0.000399	-9.541793E-5	-3.534113E-5	T	29182	2017.09.19 13:31:47.958315132	0000678	
5	0.000434	-0.000419	-0.000109	-3.512825E-5	T	29182	2017.09.19 13:31:47.968315132	0000678	
5	0.000453	-0.000438	-0.000113	-2.495729E-5	T	29182	2017.09.19 13:31:47.978315132	0000678	
5	0.000432	-0.000419	-9.919170E-5	-3.516975E-5	T	29182	2017.09.19 13:31:47.988315132	0000678	
5	0.000441	-0.000428	-9.018267E-5	-5.913279E-5	T	29182	2017.09.19 13:31:47.998315132	0000678	
5	0.000436	-0.000422	-0.000104	-2.011705E-5	T	29182	2017.09.19 13:31:48.008315132	0000678	
5	0.000434	-0.000422	-9.512419E-5	-3.015398E-5	T	29182	2017.09.19 13:31:48.018315132	0000678	
5	0.000436	-0.000419	-0.000113	-3.911149E-5	T	29182	2017.09.19 13:31:48.028315132	0000678	
5	0.000468	-0.000456	-8.486636E-5	-6.292527E-5	T	29182	2017.09.19 13:31:48.038315132	0000678	
5	0.000444	-0.000428	-0.000118	-2.001821E-5	T	29182	2017.09.19 13:31:48.048315132	0000678	
6	0.000421	-0.000400	-0.000119	-5.924468E-5	T	29186	2017.09.19 13:31:48.158402632	0000678	
6	0.000434	-0.000419	-0.000104	-4.914842E-5	T	29186	2017.09.19 13:31:48.168402632	0000678	
6	0.000433	-0.000419	-0.000109	-2.512867E-5	T	29186	2017.09.19 13:31:48.178402632	0000678	
6	0.000422	-0.000409	-9.932681E-5	-3.925105E-5	T	29186	2017.09.19 13:31:48.188402632	0000678	
6	0.000461	-0.000442	-0.000123	-4.388241E-5	T	29186	2017.09.19 13:31:48.198402632	0000678	
6	0.000404	-0.000390	-9.955272E-5	-3.940583E-5	T	29186	2017.09.19 13:31:48.208402632	0000678	
6	0.000471	-0.000456	-0.000118	-2.478991E-5	T	29186	2017.09.19 13:31:48.218402632	0000678	
6	0.000414	-0.000403	-8.538737E-5	-3.934988E-5	T	29186	2017.09.19 13:31:48.228402632	0000678	
6	0.000423	-0.000409	-0.000104	-3.523047E-5	T	29186	2017.09.19 13:31:48.238402632	0000678	
6	0.000425	-0.000413	-9.913361E-5	-6.211698E-6	T	29186	2017.09.19 13:31:48.248402632	0000678	
7	0.000449	-0.000433	-9.915899E-5	-6.805433E-5	T	29186	2017.09.19 13:31:48.358490132	0000678	
7	0.000438	-0.000423	-0.000109	-3.909550E-5	T	29186	2017.09.19 13:31:48.368490132	0000678	
7	0.000432	-0.000419	-9.026942E-5	-5.420631E-5	T	29186	2017.09.19 13:31:48.378490132	0000678	
7	0.000404	-0.000390	-9.557331E-5	-4.442222E-5	T	29186	2017.09.19 13:31:48.388490132	0000678	
7	0.000406	-0.000385	-0.000114	-5.938763E-5	T	29186	2017.09.19 13:31:48.398490132	0000678	
7	0.000442	-0.000428	-0.000109	-3.005515E-5	T	29186	2017.09.19 13:31:48.408490132	0000678	
7	0.000425	-0.000413	-9.025186E-5	-3.524784E-5	T	29186	2017.09.19 13:31:48.418490132	0000678	
7	0.000421	-0.000408	-0.000104	-1.231889E-6	T	29186	2017.09.19 13:31:48.428490132	0000678	
7	0.000398	-0.000384	-9.559628E-5	-3.546333E-5	T	29186	2017.09.19 13:31:48.438490132	0000678	
7	0.000442	-0.000423	-0.000123	-3.503757E-5	T	29186	2017.09.19 13:31:48.448490132	0000678	
8	0.000441	-0.000423	-0.000113	-5.407827E-5	T	29198	2017.09.19 13:31:48.558577632	0000678	
8	0.000422	-0.000408	-0.000104	-1.623126E-5	T	29198	2017.09.19 13:31:48.568577632	0000678	
8	0.000448	-0.000433	-0.000109	-3.901404E-5	T	29198	2017.09.19 13:31:48.578577632	0000678	
8	0.000421	-0.000404	-0.000104	-5.927020E-5	T	29198	2017.09.19 13:31:48.588577632	0000678	
8	0.000413	-0.000399	-9.939735E-5	-3.032474E-5	T	29198	2017.09.19 13:31:48.598577632	0000678	
8	0.000411	-0.000395	-0.000105	-4.934393E-5	T	29198	2017.09.19 13:31:48.608577632	0000678	
8	0.000436	-0.000422	-0.000109	-6.096881E-6	T	29198	2017.09.19 13:31:48.618577632	0000678	
8	0.000428	-0.000418	-9.009514E-5	-1.120811E-5	T	29198	2017.09.19 13:31:48.628577632	0000678	
8	0.000459	-0.000442	-0.000118	-3.890337E-5	T	29198	2017.09.19 13:31:48.638577632	0000678	
8	0.000419	-0.000404	-0.000104	-3.927103E-5	T	29198	2017.09.19 13:31:48.648577632	0000678	
9	0.000427	-0.000409	-9.946462E-5	-7.324963E-5	T	29182	2017.09.19 13:31:48.758665132	0000678	
9	0.000448	-0.000433	-0.000113	-1.999823E-5	T	29182	2017.09.19 13:31:48.768665132	0000678	
9	0.000436	-0.000423	-9.916035E-5	-3.913700E-5	T	29182	2017.09.19 13:31:48.778665132	0000678	
9	0.000416	-0.000403	-9.538658E-5	-3.930838E-5	T	29182	2017.09.19 13:31:48.788665132	0000678	
9	0.000426	-0.000413	-9.919036E-5	-2.021111E-5	T	29182	2017.09.19 13:31:48.798665132	0000678	
9	0.000412	-0.000399	-9.935682E-5	-2.032516E-5	T	29182	2017.09.19 13:31:48.808665132	0000678	
9	0.000435	-0.000422	-9.912387E-5	-3.013738E-5	T	29182	2017.09.19 13:31:48.818665132	0000678	
9	0.000446	-0.000433	-0.000104	-3.503496E-5	T	29182	2017.09.19 13:31:48.828665132	0000678	
9	0.000444	-0.000428	-0.000118	-2.501801E-5	T	29182	2017.09.19 13:31:48.838665132	0000678	
9	0.000410	-0.000399	-8.541872E-5	-3.538264E-5	T	29182	2017.09.19 13:31:48.848665132	0000678	
10	0.000437	-0.000419	-0.000113	-4.911107E-5	T	29186	2017.09.19 13:31:48.958752632	0000678	
10	0.000435	-0.000422	-9.912387E-5	-3.013738E-5	T	29186	2017.09.19 13:31:48.968752632	0000678	
10	0.000420	-0.000404	-0.000109	-3.525045E-5	T	29186	2017.09.19 13:31:48.978752632	0000678	
10	0.000444	-0.000432	-8.012401E-5	-5.913355E-5	T	29186	2017.09.19 13:31:48.988752632	0000678	
10	0.000438	-0.000427	-9.008540E-5	-3.513379E-5	T	29186	2017.09.19 13:31:48.998752632	0000678	
10	0.000417	-0.000404	-8.548464E-5	-6.334888E-5	T	29186	2017.09.19 13:31:49.008752632	0000678	
10	0.000415	-0.000400	-0.000109	-2.528345E-5	T	29186	2017.09.19 13:31:49.018752632	0000678	
10	0.000414	-0.000399	-0.000109	-1.128404E-5	T	29186	2017.09.19 13:31:49.028752632	0000678	
10	0.000413	-0.000403	-9.027349E-5	-1.133030E-5	T	29186	2017.09.19 13:31:49.038752632	0000678	
10	0.000436	-0.000422	-0.000109	-1.097090E-6	T	29186	2017.09.19 13:31:49.048752632	0000678	
11	0.000437	-0.000423	-0.000109	-3.009588E-5	T	29194	2017.09.19 13:31:49.158840132	0000678	
11	0.000430	-0.000414	-0.000104	-5.418894E-5	T	29194	2017.09.19 13:31:49.168840132	0000678	
11	0.000460	-0.000446	-0.000109	-1.590095E-5	T	29194	2017.09.19 13:31:49.178840132	0000678	
11	0.000432	-0.000414	-0.000104	-6.818836E-5	T	29194	2017.09.19 13:31:49.188840132	0000678	
11	0.000416	-0.000403	-9.538658E-5	-3.930838E-5	T	29194	2017.09.19 13:31:49.198840132	0000678	
11	0.000420	-0.000404	-9.550412E-5	-6.830717E-5	T	29194	2017.09.19 13:31:49.208840132	0000678	
11	0.000424	-0.000408	-0.000113	-1.119412E-5	T	29194	2017.09.19 13:31:49.218840132	0000678	
11	0.000437	-0.000423	-9.920088E-5	-4.913658E-5	T	29194	2017.09.19 13:31:49.228840132	0000678	
11	0.000444	-0.000432	-9.898471E-5	-2.505612E-5	T	29194	2017.09.19 13:31:49.238840132	0000678	
11	0.000432	-0.000419	-9.919170E-5	-3.516975E-5	T	29194	2017.09.19 13:31:49.248840132	0000678	
12	0.000437	-0.000423	-9.524173E-5	-5.915277E-5	T	29193	2017.09.19 13:31:49.358927632	0000678	
12	0.000428	-0.000418	-8.517254E-5	-3.022806E-5	T	29193	2017.09.19 13:31:49.368927632	0000678	
12	0.000435	-0.000422	-0.000104	-1.611721E-5	T	29193	2017.09.19 13:31:49.378927632	0000678	
12	0.000423	-0.000404	-0.000109	-6.324928E-5	T	29193	2017.09.19 13:31:49.388927632	0000678	
12	0.000455	-0.000442	-9.499555E-5	-5.399820E-5	T	29193	2017.09.19 13:31:49.398927632	0000678	
12	0.000424	-0.000409	-0.000113	-1.619391E-5	T	29193	2017.09.19 13:31:49.408927632	0000678	
12	0.000427	-0.000413	-0.000104	-2.019036E-5	T	29193	2017.09.19 13:31:49.418927632	0000678	
12	0.000421	-0.000409	-9.036805E-5	-4.928798E-5	T	29193	2017.09.19 13:31:49.428927632	0000678	
12	0.000459	-0.000442	-0.000118	-4.390316E-5	T	29193	2017.09.19 13:31:49.438927632	0000678	
12	0.000405	-0.000394	-9.043724E-5	-2.540303E-5	T	29193	2017.09.19 13:31:49.448927632	0000678	
13	0.000438	-0.000423	-0.000113	-2.007970E-5	T	29195	2017.09.19 13:31:49.559015132	0000678	
13	0.000415	-0.000400	-0.000104	-3.930362E-5	T	29195	2017.09.19 13:31:49.569015132	0000678	
13	0.000460	-0.000447	-0.000109	-2.490058E-5	T	29195	2017.09.19 13:31:49.579015132	0000678	
13	0.000432	-0.000414	-0.000104	-6.818836E-5	T	29195	2017.09.19 13:31:49.589015132	0000678	
13	0.000457	-0.000433	-0.000123	-7.795431E-5	T	29195	2017.09.19 13:31:49.599015132	0000678	
13	0.000442	-0.000428	-0.000104	-4.407531E-5	T	29195	2017.09.19 13:31:49.609015132	0000678	
13	0.000407	-0.000390	-9.963378E-5	-5.940499E-5	T	29195	2017.09.19 13:31:49.619015132	0000678	
13	0.000424	-0.000408	-0.000113	-6.194329E-6	T	29195	2017.09.19 13:31:49.629015132	0000678	
13	0.000434	-0.000422	-9.514446E-5	-3.515377E-5	T	29195	2017.09.19 13:31:49.639015132	0000678	
13	0.000444	-0.000428	-0.000118	-2.001821E-5	T	29195	2017.09.19 13:31:49.649015132	0000678	
14	0.000428	-0.000409	-0.000118	-4.417199E-5	T	29190	2017.09.19 13:31:49.759102632	0000678	
14	0.000428	-0.000413	-0.000109	-1.116999E-5	T	29190	2017.09.19 13:31:49.769102632	0000678	
14	0.000429	-0.000414	-9.932816E-5	-5.420969E-5	T	29190	2017.09.19 13:31:49.779102632	0000678	
14	0.000456	-0.000442	-0.000104	-4.396126E-5	T	29190	2017.09.19 13:31:49.789102632	0000678	
14	0.000450	-0.000437	-0.000104	-5.995437E-6	T	29190	2017.09.19 13:31:49.799102632	0000678	
14	0.000405	-0.000390	-0.000105	-3.938508E-5	T	29190	2017.09.19 13:31:49.809102632	0000678	
14	0.000478	-0.000461	-9.490339E-5	-8.684204E-5	T	29190	2017.09.19 13:31:49.819102632	0000678	
14	0.000434	-0.000422	-9.906713E-5	-1.613796E-5	T	29190	2017.09.19 13:31:49.829102632	0000678	
14	0.000440	-0.000428	-9.908469E-5	-3.509644E-5	T	29190	2017.09.19 13:31:49.839102632	0000678	
14	0.000434	-0.000419	-0.000113	-1.611245E-5	T	29190	2017.09.19 13:31:49.849102632	0000678	
15	0.000439	-0.000427	-9.508500E-5	-3.511304E-5	T	29179	2017.09.19 13:31:49.959190132	0000678	
15	0.000385	-0.000371	-9.579922E-5	-4.457700E-5	T	29179	2017.09.19 13:31:49.969190132	0000678	
15	0.000415	-0.000403	-9.530957E-5	-2.030918E-5	T	29179	2017.09.19 13:31:49.979190132	0000678	
15	0.000410	-0.000395	-0.000109	-2.532418E-5	T	29179	2017.09.19 13:31:49.989190132	0000678	
15	0.000412	-0.000399	-9.935682E-5	-2.032516E-5	T	29179	2017.09.19 13:31:49.999190132	0000678	
15	0.000419	-0.000404	-0.000109	-2.025108E-5	T	29179	2017.09.19 13:31:50.009190132	0000678	
15	0.000397	-0.000384	-9.553548E-5	-2.046396E-5	T	29179	2017.09.19 13:31:50.019190132	0000678	
15	0.000429	-0.000414	-0.000109	-3.016919E-5	T	29179	2017.09.19 13:31:50.029190132	0000678	
15	0.000423	-0.000408	-0.000109	2.788694E-6	T	29179	2017.09.19 13:31:50.039190132	0000678	
15	0.000431	-0.000418	-9.519202E-5	-3.518635E-5	T	29179	2017.09.19 13:31:50.049190132	0000678	
16	0.000419	-0.000404	-0.000109	-2.525087E-5	T	29190	2017.09.19 13:31:50.159277632	0000678	
16	0.000427	-0.000418	-8.511580E-5	-1.622865E-5	T	29190	2017.09.19 13:31:50.169277632	0000678	
16	0.000415	-0.000403	-9.530957E-5	-2.030918E-5	T	29190	2017.09.19 13:31:50.179277632	0000678	
16	0.000455	-0.000438	-0.000113	-4.895629E-5	T	29190	2017.09.19 13:31:50.189277632	0000678	
16	0.000470	-0.000447	-0.000123	-7.784026E-5	T	29190	2017.09.19 13:31:50.199277632	0000678	
16	0.000451	-0.000441	-8.491933E-5	-3.504049E-5	T	29190	2017.09.19 13:31:50.209277632	0000678	
16	0.000467	-0.000452	-0.000118	-2.482249E-5	T	29190	2017.09.19 13:31:50.219277632	0000678	
16	0.000417	-0.000400	-0.000104	-5.430299E-5	T	29190	2017.09.19 13:31:50.229277632	0000678	
16	0.000433	-0.000419	-0.000109	-2.012888E-5	T	29190	2017.09.19 13:31:50.239277632	0000678	
16	0.000410	-0.000399	-9.034131E-5	-1.636268E-5	T	29190	2017.09.19 13:31:50.249277632	0000678	
17	0.000424	-0.000409	-0.000104	-3.923030E-5	T	29185	2017.09.19 13:31:50.359365132	0000678	
17	0.000422	-0.000409	-9.931060E-5	-3.525122E-5	T	29185	2017.09.19 13:31:50.369365132	0000678	
17	0.000429	-0.000414	-0.000104	-4.918915E-5	T	29185	2017.09.19 13:31:50.379365132	0000678	
17	0.000436	-0.000419	-0.000113	-3.911149E-5	T	29185	2017.09.19 13:31:50.389365132	0000678	
17	0.000432	-0.000419	-9.919170E-5	-3.516975E-5	T	29185	2017.09.19 13:31:50.399365132	0000678	
17	0.000420	-0.000404	-0.000109	-3.925028E-5	T	29185	2017.09.19 13:31:50.409365132	0000678	
17	0.000435	-0.000419	-0.000118	-1.609170E-5	T	29185	2017.09.19 13:31:50.419365132	0000678	
17	0.000413	-0.000400	-9.545440E-5	-4.434076E-5	T	29185	2017.09.19 13:31:50.429365132	0000678	
17	0.000417	-0.000400	-0.000113	-3.026664E-5	T	29185	2017.09.19 13:31:50.439365132	0000678	
17	0.000437	-0.000419	-0.000109	-6.312708E-5	T	29185	2017.09.19 13:31:50.449365132	0000678	
18	0.000394	-0.000376	-0.000114	-3.546195E-5	T	29189	2017.09.19 13:31:50.559452632	0000678	
18	0.000437	-0.000423	-9.522146E-5	-5.415298E-5	T	29189	2017.09.19 13:31:50.569452632	0000678	
18	0.000425	-0.000409	-0.000109	-3.920955E-5	T	29189	2017.09.19 13:31:50.579452632	0000678	
18	0.000434	-0.000422	-9.898607E-5	3.861201E-6	T	29189	2017.09.19 13:31:50.589452632	0000678	
18	0.000434	-0.000419	-0.000104	-4.414863E-5	T	29189	2017.09.19 13:31:50.599452632	0000678	
18	0.000421	-0.000404	-0.000109	-4.924986E-5	T	29189	2017.09.19 13:31:50.609452632	0000678	
18	0.000462	-0.000447	-0.000113	-2.988377E-5	T	29189	2017.09.19 13:31:50.619452632	0000678	
18	0.000427	-0.000418	-8.513201E-5	-2.022848E-5	T	29189	2017.09.19 13:31:50.629452632	0000678	
18	0.000407	-0.000394	-9.051425E-5	-4.440224E-5	T	29189	2017.09.19 13:31:50.639452632	0000678	
18	0.000457	-0.000446	-9.878177E-5	-1.594245E-5	T	29189	2017.09.19 13:31:50.649452632	0000678	
19	0.000437	-0.000419	-0.000113	-5.411086E-5	T	29177	2017.09.19 13:31:50.759540132	0000678	
19	0.000456	-0.000438	-0.000123	-3.891521E-5	T	29177	2017.09.19 13:31:50.769540132	0000678	
19	0.000398	-0.000384	-0.000104	-1.427400E-6	T	29177	2017.09.19 13:31:50.779540132	0000678	
19	0.000437	-0.000423	-9.522146E-5	-5.415298E-5	T	29177	2017.09.19 13:31:50.789540132	0000678	
19	0.000427	-0.000409	-0.000118	-3.917220E-5	T	29177	2017.09.19 13:31:50.799540132	0000678	
19	0.000459	-0.000442	-0.000123	-1.588358E-5	T	29177	2017.09.19 13:31:50.809540132	0000678	
19	0.000429	-0.000414	-0.000104	-4.418936E-5	T	29177	2017.09.19 13:31:50.819540132	0000678	
19	0.000417	-0.000404	-9.938626E-5	-3.929178E-5	T	29177	2017.09.19 13:31:50.829540132	0000678	
19	0.000404	-0.000389	-0.000104	-2.538567E-5	T	29177	2017.09.19 13:31:50.839540132	0000678	
19	0.000461	-0.000447	-0.000109	-2.990037E-5	T	29177	2017.09.19 13:31:50.849540132	0000678	
20	0.000415	-0.000400	-0.000104	-4.430341E-5	T	29186	2017.09.19 13:31:50.959627632	0000678	
20	0.000442	-0.000428	-0.000109	-2.505536E-5	T	29186	2017.09.19 13:31:50.969627632	0000678	
20	0.000434	-0.000419	-0.000109	-3.912809E-5	T	29186	2017.09.19 13:31:50.979627632	0000678	
20	0.000466	-0.000455	-9.865449E-5	-1.086934E-5	T	29186	2017.09.19 13:31:50.989627632	0000678	
20	0.000445	-0.000428	-0.000109	-5.405414E-5	T	29186	2017.09.19 13:31:50.999627632	0000678	
20	0.000421	-0.000404	-9.948354E-5	-6.329078E-5	T	29186	2017.09.19 13:31:51.009627632	0000678	
20	0.000405	-0.000390	-0.000105	-3.538525E-5	T	29186	2017.09.19 13:31:51.019627632	0000678	
20	0.000453	-0.000441	-9.889796E-5	-2.998260E-5	T	29186	2017.09.19 13:31:51.029627632	0000678	
20	0.000423	-0.000413	-9.019107E-5	-2.024846E-5	T	29186	2017.09.19 13:31:51.039627632	0000678	
20	0.000448	-0.000433	-0.000118	-1.097786E-5	T	29186	2017.09.19 13:31:51.049627632	0000678	
21	0.000431	-0.000414	-0.000109	-5.416819E-5	T	29182	2017.09.19 13:31:51.159715132	0000678	
21	0.000415	-0.000403	-9.925251E-5	-6.293161E-6	T	29182	2017.09.19 13:31:51.169715132	0000678	
21	0.000409	-0.000390	-0.000110	-5.436370E-5	T	29182	2017.09.19 13:31:51.179715132	0000678	
21	0.000471	-0.000460	-9.469263E-5	-3.484421E-5	T	29182	2017.09.19 13:31:51.189715132	0000678	
21	0.000406	-0.000394	-9.535984E-5	-6.383078E-6	T	29182	2017.09.19 13:31:51.199715132	0000678	
21	0.000458	-0.000442	-0.000113	-4.392391E-5	T	29182	2017.09.19 13:31:51.209715132	0000678	
21	0.000442	-0.000427	-0.000113	-1.039758E-6	T	29182	2017.09.19 13:31:51.219715132	0000678	
21	0.000411	-0.000399	-9.534092E-5	-1.634193E-5	T	29182	2017.09.19 13:31:51.229715132	0000678	
21	0.000424	-0.000413	-9.021133E-5	-2.524825E-5	T	29182	2017.09.19 13:31:51.239715132	0000678	
21	0.000469	-0.000455	-0.000113	-8.116616E-7	T	29182	2017.09.19 13:31:51.249715132	0000678	
22	0.000402	-0.000385	-0.000110	-3.940506E-5	T	29180	2017.09.19 13:31:51.359802632	0000678	
22	0.000414	-0.000395	-0.000105	-6.834314E-5	T	29180	2017.09.19 13:31:51.369802632	0000678	
22	0.000438	-0.000423	-0.000113	-2.007970E-5	T	29180	2017.09.19 13:31:51.379802632	0000678	
22	0.000384	-0.000370	-9.968542E-5	-1.656157E-5	T	29180	2017.09.19 13:31:51.389802632	0000678	
22	0.000435	-0.000422	-9.912387E-5	-3.013738E-5	T	29180	2017.09.19 13:31:51.399802632	0000678	
22	0.000446	-0.000432	-0.000109	-6.015418E-6	T	29180	2017.09.19 13:31:51.409802632	0000678	
22	0.000420	-0.000404	-0.000104	-4.927061E-5	T	29180	2017.09.19 13:31:51.419802632	0000678	
22	0.000455	-0.000438	-0.000118	-3.893596E-5	T	29180	2017.09.19 13:31:51.429802632	0000678	
22	0.000411	-0.000399	-9.930007E-5	-6.325747E-6	T	29180	2017.09.19 13:31:51.439802632	0000678	
22	0.000470	-0.000456	-0.000109	-3.482684E-5	T	29180	2017.09.19 13:31:51.449802632	0000678	
23	0.000412	-0.000399	-9.539766E-5	-3.034134E-5	T	29188	2017.09.19 13:31:51.559890132	0000678	
23	0.000416	-0.000400	-0.000113	-2.026706E-5	T	29188	2017.09.19 13:31:51.569890132	0000678	
23	0.000421	-0.000404	-0.000109	-4.425007E-5	T	29188	2017.09.19 13:31:51.579890132	0000678	
23	0.000409	-0.000395	-0.000104	-3.034472E-5	T	29188	2017.09.19 13:31:51.589890132	0000678	
23	0.000426	-0.000413	-9.919036E-5	-2.021111E-5	T	29188	2017.09.19 13:31:51.599890132	0000678	
23	0.000446	-0.000432	-0.000109	-6.015418E-6	T	29188	2017.09.19 13:31:51.609890132	0000678	
23	0.000412	-0.000399	-9.539766E-5	-3.034134E-5	T	29188	2017.09.19 13:31:51.619890132	0000678	
23	0.000432	-0.000414	-0.000123	-7.112055E-6	T	29188	2017.09.19 13:31:51.629890132	0000678	
23	0.000427	-0.000414	-9.032887E-5	-5.424704E-5	T	29188	2017.09.19 13:31:51.639890132	0000678	
23	0.000421	-0.000408	-0.000104	2.767944E-6	T	29188	2017.09.19 13:31:51.649890132	0000678	
24	0.000406	-0.000390	-0.000110	-3.036471E-5	T	29187	2017.09.19 13:31:51.759977632	0000678	
24	0.000435	-0.000419	-0.000109	-4.412788E-5	T	29187	2017.09.19 13:31:51.769977632	0000678	
24	0.000441	-0.000428	-0.000104	-3.007590E-5	T	29187	2017.09.19 13:31:51.779977632	0000678	
24	0.000401	-0.000385	-0.000105	-3.942581E-5	T	29187	2017.09.19 13:31:51.789977632	0000678	
24	0.000438	-0.000423	-0.000113	-2.507949E-5	T	29187	2017.09.19 13:31:51.799977632	0000678	
24	0.000445	-0.000428	-0.000118	-3.501759E-5	T	29187	2017.09.19 13:31:51.809977632	0000678	
24	0.000421	-0.000404	-0.000118	-2.021373E-5	T	29187	2017.09.19 13:31:51.819977632	0000678	
24	0.000406	-0.000390	-0.000105	-4.938466E-5	T	29187	2017.09.19 13:31:51.829977632	0000678	
24	0.000448	-0.000433	-0.000113	-2.499802E-5	T	29187	2017.09.19 13:31:51.839977632	0000678	
24	0.000418	-0.000400	-0.000118	-3.524568E-5	T	29187	2017.09.19 13:31:51.849977632	0000678	
25	0.000398	-0.000381	-0.000105	-4.945798E-5	T	29191	2017.09.19 13:31:51.960065132	0000678	
25	0.000441	-0.000427	-0.000104	-2.507611E-5	T	29191	2017.09.19 13:31:51.970065132	0000678	
25	0.000400	-0.000385	-9.567329E-5	-5.446254E-5	T	29191	2017.09.19 13:31:51.980065132	0000678	
25	0.000451	-0.000433	-0.000118	-4.897627E-5	T	29191	2017.09.19 13:31:51.990065132	0000678	
25	0.000439	-0.000414	-0.000132	-5.907253E-5	T	29191	2017.09.19 13:31:52.000065132	0000678	
25	0.000429	-0.000414	-0.000113	-1.615318E-5	T	29191	2017.09.19 13:31:52.010065132	0000678	
25	0.000453	-0.000438	-0.000118	-1.093713E-5	T	29191	2017.09.19 13:31:52.020065132	0000678	
25	0.000437	-0.000423	-0.000109	-2.509609E-5	T	29191	2017.09.19 13:31:52.030065132	0000678	
25	0.000414	-0.000403	-8.040803E-5	-4.437042E-5	T	29191	2017.09.19 13:31:52.040065132	0000678	
25	0.000432	-0.000414	-0.000118	-3.513164E-5	T	29191	2017.09.19 13:31:52.050065132	0000678	
26	0.000421	-0.000408	-9.532713E-5	-3.926765E-5	T	29179	2017.09.19 13:31:52.160152632	0000678	
26	0.000433	-0.000422	-9.506745E-5	-1.615456E-5	T	29179	2017.09.19 13:31:52.170152632	0000678	
26	0.000422	-0.000409	-9.931060E-5	-3.525122E-5	T	29179	2017.09.19 13:31:52.180152632	0000678	
26	0.000421	-0.000408	-9.923359E-5	-1.625201E-5	T	29179	2017.09.19 13:31:52.190152632	0000678	
26	0.000436	-0.000423	-9.520120E-5	-4.915318E-5	T	29179	2017.09.19 13:31:52.200152632	0000678	
26	0.000439	-0.000419	-0.000118	-5.409011E-5	T	29179	2017.09.19 13:31:52.210152632	0000678	
26	0.000466	-0.000455	-8.976869E-5	-3.890552E-5	T	29179	2017.09.19 13:31:52.220152632	0000678	
26	0.000430	-0.000418	-9.909443E-5	-1.117076E-5	T	29179	2017.09.19 13:31:52.230152632	0000678	
26	0.000417	-0.000403	-0.000104	-1.627199E-5	T	29179	2017.09.19 13:31:52.240152632	0000678	
26	0.000450	-0.000437	-0.000104	-1.999485E-5	T	29179	2017.09.19 13:31:52.250152632	0000678	
27	0.000434	-0.000422	-9.016106E-5	-3.917435E-5	T	29181	2017.09.19 13:31:52.360240132	0000678	
27	0.000434	-0.000419	-0.000113	-2.011228E-5	T	29181	2017.09.19 13:31:52.370240132	0000678	
27	0.000399	-0.000381	-0.000110	-4.943723E-5	T	29181	2017.09.19 13:31:52.380240132	0000678	
27	0.000419	-0.000404	-0.000109	-2.525087E-5	T	29181	2017.09.19 13:31:52.390240132	0000678	
27	0.000420	-0.000408	-9.031131E-5	-3.528857E-5	T	29181	2017.09.19 13:31:52.400240132	0000678	
27	0.000410	-0.000395	-0.000104	-3.934435E-5	T	29181	2017.09.19 13:31:52.410240132	0000678	
27	0.000379	-0.000365	-9.970839E-5	-7.602679E-6	T	29181	2017.09.19 13:31:52.420240132	0000678	
27	0.000449	-0.000433	-0.000118	-2.997706E-5	T	29181	2017.09.19 13:31:52.430240132	0000678	
27	0.000432	-0.000422	-9.008405E-5	-2.017515E-5	T	29181	2017.09.19 13:31:52.440240132	0000678	
27	0.000398	-0.000389	-7.651806E-5	-3.050166E-5	T	29181	2017.09.19 13:31:52.450240132	0000678	
28	0.000430	-0.000418	-9.020862E-5	-3.920694E-5	T	29183	2017.09.19 13:31:52.560327632	0000678	
28	0.000456	-0.000442	-0.000113	-2.492471E-5	T	29183	2017.09.19 13:31:52.570327632	0000678	
28	0.000427	-0.000414	-9.530821E-5	-4.922650E-5	T	29183	2017.09.19 13:31:52.580327632	0000678	
28	0.000439	-0.000423	-0.000109	-4.409529E-5	T	29183	2017.09.19 13:31:52.590327632	0000678	
28	0.000411	-0.000399	-9.535713E-5	-2.034176E-5	T	29183	2017.09.19 13:31:52.600327632	0000678	
28	0.000415	-0.000400	-9.947435E-5	-4.932395E-5	T	29183	2017.09.19 13:31:52.610327632	0000678	
28	0.000443	-0.000428	-0.000113	-3.003855E-5	T	29183	2017.09.19 13:31:52.620327632	0000678	
28	0.000410	-0.000394	-0.000109	-1.632456E-5	T	29183	2017.09.19 13:31:52.630327632	0000678	
28	0.000436	-0.000419	-0.000109	-5.412746E-5	T	29183	2017.09.19 13:31:52.640327632	0000678	
28	0.000434	-0.000419	-0.000113	-2.511207E-5	T	29183	2017.09.19 13:31:52.650327632	0000678	
29	0.000424	-0.000413	-9.023160E-5	-3.024805E-5	T	29190	2017.09.19 13:31:52.760415132	0000678	
29	0.000440	-0.000427	-9.510122E-5	-3.911287E-5	T	29190	2017.09.19 13:31:52.770415132	0000678	
29	0.000418	-0.000403	-0.000104	-2.527162E-5	T	29190	2017.09.19 13:31:52.780415132	0000678	
29	0.000403	-0.000385	-0.000110	-4.940464E-5	T	29190	2017.09.19 13:31:52.790415132	0000678	
29	0.000447	-0.000433	-0.000104	-4.403458E-5	T	29190	2017.09.19 13:31:52.800415132	0000678	
29	0.000423	-0.000409	-9.040858E-5	-5.928757E-5	T	29190	2017.09.19 13:31:52.810415132	0000678	
29	0.000467	-0.000456	-9.875177E-5	-3.486834E-5	T	29190	2017.09.19 13:31:52.820415132	0000678	
29	0.000424	-0.000409	-9.938761E-5	-5.425042E-5	T	29190	2017.09.19 13:31:52.830415132	0000678	
29	0.000462	-0.000447	-0.000109	-4.389978E-5	T	29190	2017.09.19 13:31:52.840415132	0000678	
29	0.000435	-0.000419	-0.000118	-2.009153E-5	T	29190	2017.09.19 13:31:52.850415132	0000678	
30	0.000413	-0.000399	-0.000104	-1.630458E-5	T	29186	2017.09.19 13:31:52.960502632	0000678	
30	0.000407	-0.000390	-9.965000E-5	-6.340483E-5	T	29186	2017.09.19 13:31:52.970502632	0000678	
30	0.000421	-0.000409	-9.036805E-5	-4.928798E-5	T	29186	2017.09.19 13:31:52.980502632	0000678	
30	0.000445	-0.000432	-9.900497E-5	-3.005592E-5	T	29186	2017.09.19 13:31:52.990502632	0000678	
30	0.000427	-0.000414	-9.528794E-5	-4.422671E-5	T	29186	2017.09.19 13:31:53.000502632	0000678	
30	0.000398	-0.000381	-9.974080E-5	-5.947831E-5	T	29186	2017.09.19 13:31:53.010502632	0000678	
30	0.000432	-0.000414	-0.000123	-2.511130E-5	T	29186	2017.09.19 13:31:53.020502632	0000678	
30	0.000440	-0.000427	-9.510122E-5	-3.911287E-5	T	29186	2017.09.19 13:31:53.030502632	0000678	
30	0.000428	-0.000409	-0.000113	-5.419232E-5	T	29186	2017.09.19 13:31:53.040502632	0000678	
30	0.000417	-0.000403	-9.934979E-5	-3.029216E-5	T	29186	2017.09.19 13:31:53.050502632	0000678	
31	0.000458	-0.000446	-9.883851E-5	-2.994187E-5	T	29185	2017.09.19 13:31:53.160590132	0000678	
31	0.000456	-0.000438	-0.000118	-4.893554E-5	T	29185	2017.09.19 13:31:53.170590132	0000678	
31	0.000461	-0.000442	-0.000113	-6.792291E-5	T	29185	2017.09.19 13:31:53.180590132	0000678	
31	0.000415	-0.000400	-9.949462E-5	-5.432374E-5	T	29185	2017.09.19 13:31:53.190590132	0000678	
31	0.000408	-0.000390	-9.569084E-5	-7.342101E-5	T	29185	2017.09.19 13:31:53.200590132	0000678	
31	0.000452	-0.000438	-9.506338E-5	-5.903057E-5	T	29185	2017.09.19 13:31:53.210590132	0000678	
31	0.000450	-0.000438	-9.896579E-5	-3.501497E-5	T	29185	2017.09.19 13:31:53.220590132	0000678	
31	0.000394	-0.000380	-9.564384E-5	-3.549591E-5	T	29185	2017.09.19 13:31:53.230590132	0000678	
31	0.000404	-0.000385	-0.000124	-1.634792E-5	T	29185	2017.09.19 13:31:53.240590132	0000678	
31	0.000400	-0.000385	-9.963244E-5	-4.444635E-5	T	29185	2017.09.19 13:31:53.250590132	0000678	
32	0.000432	-0.000419	-0.000104	-3.014921E-5	T	29192	2017.09.19 13:31:53.360677632	0000678	
32	0.000428	-0.000414	-0.000104	-3.918957E-5	T	29192	2017.09.19 13:31:53.370677632	0000678	
32	0.000430	-0.000418	-9.907822E-5	-7.170925E-6	T	29192	2017.09.19 13:31:53.380677632	0000678	
32	0.000440	-0.000427	-0.000104	-2.007631E-5	T	29192	2017.09.19 13:31:53.390677632	0000678	
32	0.000448	-0.000437	-9.886852E-5	-1.101598E-5	T	29192	2017.09.19 13:31:53.400677632	0000678	
32	0.000431	-0.000418	-9.915117E-5	-2.517017E-5	T	29192	2017.09.19 13:31:53.410677632	0000678	
32	0.000391	-0.000376	-9.080096E-5	-5.955639E-5	T	29192	2017.09.19 13:31:53.420677632	0000678	
32	0.000422	-0.000404	-9.952407E-5	-7.329036E-5	T	29192	2017.09.19 13:31:53.430677632	0000678	
32	0.000421	-0.000404	-0.000109	-4.425007E-5	T	29192	2017.09.19 13:31:53.440677632	0000678	
32	0.000431	-0.000418	-9.519202E-5	-3.518635E-5	T	29192	2017.09.19 13:31:53.450677632	0000678	
33	0.000412	-0.000395	-0.000113	-3.530717E-5	T	29177	2017.09.19 13:31:53.560765132	0000678	
33	0.000428	-0.000414	-0.000109	-2.016961E-5	T	29177	2017.09.19 13:31:53.570765132	0000678	
33	0.000414	-0.000400	-9.945409E-5	-4.432416E-5	T	29177	2017.09.19 13:31:53.580765132	0000678	
33	0.000452	-0.000441	-9.489828E-5	-2.999920E-5	T	29177	2017.09.19 13:31:53.590765132	0000678	
33	0.000435	-0.000422	-9.912387E-5	-3.013738E-5	T	29177	2017.09.19 13:31:53.600765132	0000678	
33	0.000436	-0.000419	-0.000118	-3.009111E-5	T	29177	2017.09.19 13:31:53.610765132	0000678	
33	0.000434	-0.000419	-0.000104	-4.414863E-5	T	29177	2017.09.19 13:31:53.620765132	0000678	
33	0.000422	-0.000409	-8.540898E-5	-5.930832E-5	T	29177	2017.09.19 13:31:53.630765132	0000678	
33	0.000451	-0.000441	-8.984193E-5	-1.602053E-5	T	29177	2017.09.19 13:31:53.640765132	0000678	
33	0.000434	-0.000422	-9.906713E-5	-1.613796E-5	T	29177	2017.09.19 13:31:53.650765132	0000678	
34	0.000429	-0.000409	-0.000123	-3.915145E-5	T	29189	2017.09.19 13:31:53.760852632	0000678	
34	0.000428	-0.000418	-8.519280E-5	-3.522786E-5	T	29189	2017.09.19 13:31:53.770852632	0000678	
34	0.000429	-0.000414	-0.000113	-2.015301E-5	T	29189	2017.09.19 13:31:53.780852632	0000678	
34	0.000418	-0.000400	-0.000109	-5.428224E-5	T	29189	2017.09.19 13:31:53.790852632	0000678	
34	0.000398	-0.000384	-0.000104	-6.427191E-6	T	29189	2017.09.19 13:31:53.800852632	0000678	
34	0.000429	-0.000418	-9.501774E-5	7.811848E-6	T	29189	2017.09.19 13:31:53.810852632	0000678	
34	0.000407	-0.000390	-0.000110	-3.936433E-5	T	29189	2017.09.19 13:31:53.820852632	0000678	
34	0.000453	-0.000438	-0.000113	-2.995708E-5	T	29189	2017.09.19 13:31:53.830852632	0000678	
34	0.000424	-0.000413	-9.513393E-5	-6.228298E-6	T	29189	2017.09.19 13:31:53.840852632	0000678	
34	0.000460	-0.000447	-0.000104	-3.492091E-5	T	29189	2017.09.19 13:31:53.850852632	0000678	
35	0.000413	-0.000399	-9.939735E-5	-3.032474E-5	T	29180	2017.09.19 13:31:53.960940132	0000678	
35	0.000455	-0.000442	-0.000104	-3.896147E-5	T	29180	2017.09.19 13:31:53.970940132	0000678	
35	0.000401	-0.000385	-0.000105	-3.942581E-5	T	29180	2017.09.19 13:31:53.980940132	0000678	
35	0.000452	-0.000438	-0.000109	-2.497389E-5	T	29180	2017.09.19 13:31:53.990940132	0000678	
35	0.000428	-0.000413	-0.000109	-6.170198E-6	T	29180	2017.09.19 13:31:54.000940132	0000678	
35	0.000401	-0.000389	-9.051696E-5	-3.044356E-5	T	29180	2017.09.19 13:31:54.010940132	0000678	
35	0.000440	-0.000419	-0.000128	-3.904924E-5	T	29180	2017.09.19 13:31:54.020940132	0000678	
35	0.000436	-0.000422	-0.000109	-1.109667E-5	T	29180	2017.09.19 13:31:54.030940132	0000678	
35	0.000403	-0.000389	-9.951625E-5	-3.040621E-5	T	29180	2017.09.19 13:31:54.040940132	0000678	
35	0.000432	-0.000419	-9.524876E-5	-4.918577E-5	T	29180	2017.09.19 13:31:54.050940132	0000678	
36	0.000408	-0.000395	-9.947706E-5	-3.536527E-5	T	29190	2017.09.19 13:31:54.161027632	0000678	
36	0.000428	-0.000414	-0.000104	-3.018995E-5	T	29190	2017.09.19 13:31:54.171027632	0000678	
36	0.000409	-0.000395	-0.000104	-3.034472E-5	T	29190	2017.09.19 13:31:54.181027632	0000678	
36	0.000440	-0.000428	-9.908469E-5	-3.509644E-5	T	29190	2017.09.19 13:31:54.191027632	0000678	
36	0.000444	-0.000428	-0.000109	-4.905435E-5	T	29190	2017.09.19 13:31:54.201027632	0000678	
36	0.000442	-0.000428	-0.000113	-1.603913E-5	T	29190	2017.09.19 13:31:54.211027632	0000678	
36	0.000432	-0.000419	-9.922818E-5	-4.416938E-5	T	29190	2017.09.19 13:31:54.221027632	0000678	
36	0.000448	-0.000433	-0.000113	-2.499802E-5	T	29190	2017.09.19 13:31:54.231027632	0000678	
36	0.000397	-0.000384	-9.951896E-5	-1.644752E-5	T	29190	2017.09.19 13:31:54.241027632	0000678	
36	0.000430	-0.000414	-0.000109	-4.416861E-5	T	29190	2017.09.19 13:31:54.251027632	0000678	
37	0.000422	-0.000409	-9.931060E-5	-3.525122E-5	T	29194	2017.09.19 13:31:54.361115132	0000678	
37	0.000408	-0.000395	-9.551385E-5	-4.438149E-5	T	29194	2017.09.19 13:31:54.371115132	0000678	
37	0.000437	-0.000414	-0.000123	-6.310972E-5	T	29194	2017.09.19 13:31:54.381115132	0000678	
37	0.000433	-0.000419	-9.528929E-5	-5.918535E-5	T	29194	2017.09.19 13:31:54.391115132	0000678	
37	0.000413	-0.000399	-0.000104	-6.304996E-6	T	29194	2017.09.19 13:31:54.401115132	0000678	
37	0.000419	-0.000408	-9.027078E-5	-2.528899E-5	T	29194	2017.09.19 13:31:54.411115132	0000678	
37	0.000427	-0.000409	-0.000113	-4.919253E-5	T	29194	2017.09.19 13:31:54.421115132	0000678	
37	0.000421	-0.000404	-8.058231E-5	-8.736863E-5	T	29194	2017.09.19 13:31:54.431115132	0000678	
37	0.000420	-0.000404	-0.000109	-3.525045E-5	T	29194	2017.09.19 13:31:54.441115132	0000678	
37	0.000454	-0.000442	-9.893444E-5	-3.898222E-5	T	29194	2017.09.19 13:31:54.451115132	0000678	
38	0.000425	-0.000413	-9.025186E-5	-3.524784E-5	T	29189	2017.09.19 13:31:54.561202632	0000678	
38	0.000417	-0.000403	-0.000104	-2.027183E-5	T	29189	2017.09.19 13:31:54.571202632	0000678	
38	0.000406	-0.000390	-0.000105	-4.438487E-5	T	29189	2017.09.19 13:31:54.581202632	0000678	
38	0.000419	-0.000408	-9.029105E-5	-3.028878E-5	T	29189	2017.09.19 13:31:54.591202632	0000678	
38	0.000435	-0.000419	-0.000109	-4.412788E-5	T	29189	2017.09.19 13:31:54.601202632	0000678	
38	0.000426	-0.000413	-9.028834E-5	-4.424746E-5	T	29189	2017.09.19 13:31:54.611202632	0000678	
38	0.000451	-0.000433	-0.000123	-2.495652E-5	T	29189	2017.09.19 13:31:54.621202632	0000678	
38	0.000399	-0.000385	-9.563276E-5	-4.446295E-5	T	29189	2017.09.19 13:31:54.631202632	0000678	
38	0.000428	-0.000413	-0.000109	-1.170407E-6	T	29189	2017.09.19 13:31:54.641202632	0000678	
38	0.000457	-0.000442	-0.000109	-3.894072E-5	T	29189	2017.09.19 13:31:54.651202632	0000678	
39	0.000473	-0.000461	-0.000104	-2.980707E-5	T	29186	2017.09.19 13:31:54.761290132	0000678	
39	0.000420	-0.000404	-0.000113	-2.023448E-5	T	29186	2017.09.19 13:31:54.771290132	0000678	
39	0.000460	-0.000447	-0.000104	-3.492091E-5	T	29186	2017.09.19 13:31:54.781290132	0000678	
39	0.000423	-0.000409	-0.000109	-2.021034E-5	T	29186	2017.09.19 13:31:54.791290132	0000678	
39	0.000436	-0.000423	-9.918062E-5	-4.413679E-5	T	29186	2017.09.19 13:31:54.801290132	0000678	
39	0.000455	-0.000442	-0.000104	-2.996185E-5	T	29186	2017.09.19 13:31:54.811290132	0000678	
39	0.000432	-0.000418	-0.000104	-2.514942E-5	T	29186	2017.09.19 13:31:54.821290132	0000678	
39	0.000416	-0.000403	-9.537037E-5	-3.530855E-5	T	29186	2017.09.19 13:31:54.831290132	0000678	
39	0.000427	-0.000409	-0.000123	-1.615241E-5	T	29186	2017.09.19 13:31:54.841290132	0000678	
39	0.000390	-0.000375	-9.968271E-5	-3.052025E-5	T	29186	2017.09.19 13:31:54.851290132	0000678	
40	0.000416	-0.000403	-9.932952E-5	-2.529237E-5	T	29184	2017.09.19 13:31:54.961377632	0000678	
40	0.000435	-0.000419	-0.000113	-3.011186E-5	T	29184	2017.09.19 13:31:54.971377632	0000678	
40	0.000414	-0.000400	-9.945409E-5	-4.432416E-5	T	29184	2017.09.19 13:31:54.981377632	0000678	
40	0.000444	-0.000432	-9.898471E-5	-2.505612E-5	T	29184	2017.09.19 13:31:54.991377632	0000678	
40	0.000422	-0.000409	-9.931060E-5	-3.525122E-5	T	29184	2017.09.19 13:31:55.001377632	0000678	
40	0.000396	-0.000371	-0.000138	-6.404288E-6	T	29184	2017.09.19 13:31:55.011377632	0000678	
40	0.000437	-0.000427	-8.010240E-5	-3.917512E-5	T	29184	2017.09.19 13:31:55.021377632	0000678	
40	0.000414	-0.000399	-0.000109	7.715169E-6	T	29184	2017.09.19 13:31:55.031377632	0000678	
40	0.000406	-0.000394	-9.538010E-5	-1.138287E-5	T	29184	2017.09.19 13:31:55.041377632	0000678	
40	0.000435	-0.000418	-0.000118	-6.092116E-6	T	29184	2017.09.19 13:31:55.051377632	0000678	
41	0.000429	-0.000414	-9.932816E-5	-5.420969E-5	T	29180	2017.09.19 13:31:55.161465132	0000678	
41	0.000400	-0.000381	-0.000114	-4.442084E-5	T	29180	2017.09.19 13:31:55.171465132	0000678	
41	0.000427	-0.000409	-0.000109	-5.420892E-5	T	29180	2017.09.19 13:31:55.181465132	0000678	
41	0.000414	-0.000399	-0.000104	-2.530420E-5	T	29180	2017.09.19 13:31:55.191465132	0000678	
41	0.000439	-0.000427	-9.900768E-5	-1.609723E-5	T	29180	2017.09.19 13:31:55.201465132	0000678	
41	0.000434	-0.000419	-0.000109	-3.012846E-5	T	29180	2017.09.19 13:31:55.211465132	0000678	
41	0.000427	-0.000418	-8.509553E-5	-1.122886E-5	T	29180	2017.09.19 13:31:55.221465132	0000678	
41	0.000403	-0.000385	-0.000119	-2.536830E-5	T	29180	2017.09.19 13:31:55.231465132	0000678	
41	0.000386	-0.000371	-0.000105	-3.054024E-5	T	29180	2017.09.19 13:31:55.241465132	0000678	
41	0.000460	-0.000447	-0.000109	-2.490058E-5	T	29180	2017.09.19 13:31:55.251465132	0000678	
42	0.000439	-0.000423	-0.000109	-4.909508E-5	T	29189	2017.09.19 13:31:55.361552632	0000678	
42	0.000423	-0.000409	-0.000104	-3.023068E-5	T	29189	2017.09.19 13:31:55.371552632	0000678	
42	0.000431	-0.000418	-0.000104	-6.150216E-6	T	29189	2017.09.19 13:31:55.381552632	0000678	
42	0.000429	-0.000409	-0.000109	-6.820834E-5	T	29189	2017.09.19 13:31:55.391552632	0000678	
42	0.000465	-0.000452	-9.885607E-5	-4.890034E-5	T	29189	2017.09.19 13:31:55.401552632	0000678	
42	0.000426	-0.000409	-0.000113	-3.919295E-5	T	29189	2017.09.19 13:31:55.411552632	0000678	
42	0.000428	-0.000414	-0.000109	-2.016961E-5	T	29189	2017.09.19 13:31:55.421552632	0000678	
42	0.000410	-0.000395	-0.000104	-3.534452E-5	T	29189	2017.09.19 13:31:55.431552632	0000678	
42	0.000428	-0.000414	-0.000104	-3.018995E-5	T	29189	2017.09.19 13:31:55.441552632	0000678	
42	0.000441	-0.000423	-0.000104	-6.811504E-5	T	29189	2017.09.19 13:31:55.451552632	0000678	
43	0.000446	-0.000433	-0.000104	-3.503496E-5	T	29182	2017.09.19 13:31:55.561640132	0000678	
43	0.000416	-0.000400	-9.553141E-5	-6.333996E-5	T	29182	2017.09.19 13:31:55.571640132	0000678	
43	0.000427	-0.000409	-0.000118	-3.917220E-5	T	29182	2017.09.19 13:31:55.581640132	0000678	
43	0.000422	-0.000408	-0.000104	-2.023109E-5	T	29182	2017.09.19 13:31:55.591640132	0000678	
43	0.000417	-0.000403	-0.000104	-1.627199E-5	T	29182	2017.09.19 13:31:55.601640132	0000678	
43	0.000462	-0.000447	-0.000113	-2.988377E-5	T	29182	2017.09.19 13:31:55.611640132	0000678	
43	0.000417	-0.000400	-0.000109	-4.428266E-5	T	29182	2017.09.19 13:31:55.621640132	0000678	
43	0.000415	-0.000400	-9.947435E-5	-4.932395E-5	T	29182	2017.09.19 13:31:55.631640132	0000678	
43	0.000443	-0.000427	-0.000118	-1.019008E-6	T	29182	2017.09.19 13:31:55.641640132	0000678	
43	0.000421	-0.000409	-9.036805E-5	-4.928798E-5	T	29182	2017.09.19 13:31:55.651640132	0000678	
44	0.000435	-0.000422	-9.912387E-5	-3.013738E-5	T	29184	2017.09.19 13:31:55.761727632	0000678	
44	0.000428	-0.000414	-0.000104	-3.518974E-5	T	29184	2017.09.19 13:31:55.771727632	0000678	
44	0.000423	-0.000408	-0.000109	-1.211138E-6	T	29184	2017.09.19 13:31:55.781727632	0000678	
44	0.000407	-0.000390	-0.000105	-5.438445E-5	T	29184	2017.09.19 13:31:55.791727632	0000678	
44	0.000411	-0.000395	-9.955407E-5	-5.436447E-5	T	29184	2017.09.19 13:31:55.801727632	0000678	
44	0.000412	-0.000399	-9.539766E-5	-3.034134E-5	T	29184	2017.09.19 13:31:55.811727632	0000678	
44	0.000446	-0.000433	-0.000104	-3.003517E-5	T	29184	2017.09.19 13:31:55.821727632	0000678	
44	0.000379	-0.000365	-9.970434E-5	-6.602721E-6	T	29184	2017.09.19 13:31:55.831727632	0000678	
44	0.000440	-0.000423	-0.000113	-4.907848E-5	T	29184	2017.09.19 13:31:55.841727632	0000678	
44	0.000401	-0.000389	-9.542334E-5	-7.423768E-6	T	29184	2017.09.19 13:31:55.851727632	0000678	
45	0.000439	-0.000427	-9.508500E-5	-3.511304E-5	T	29194	2017.09.19 13:31:55.961815132	0000678	
45	0.000419	-0.000404	-0.000104	-3.927103E-5	T	29194	2017.09.19 13:31:55.971815132	0000678	
45	0.000417	-0.000404	-9.938626E-5	-3.929178E-5	T	29194	2017.09.19 13:31:55.981815132	0000678	
45	0.000433	-0.000419	-9.924844E-5	-4.916917E-5	T	29194	2017.09.19 13:31:55.991815132	0000678	
45	0.000430	-0.000418	-9.022889E-5	-4.420673E-5	T	29194	2017.09.19 13:31:56.001815132	0000678	
45	0.000441	-0.000423	-0.000109	-5.909467E-5	T	29194	2017.09.19 13:31:56.011815132	0000678	
45	0.000421	-0.000408	-9.532713E-5	-3.926765E-5	T	29194	2017.09.19 13:31:56.021815132	0000678	
45	0.000427	-0.000409	-0.000123	-1.153038E-6	T	29194	2017.09.19 13:31:56.031815132	0000678	
45	0.000454	-0.000438	-9.512012E-5	-7.302999E-5	T	29194	2017.09.19 13:31:56.041815132	0000678	
45	0.000432	-0.000422	-9.004758E-5	-1.117552E-5	T	29194	2017.09.19 13:31:56.051815132	0000678	
46	0.000423	-0.000408	-0.000109	-1.211138E-6	T	29194	2017.09.19 13:31:56.161902632	0000678	
46	0.000465	-0.000451	-0.000113	-1.084383E-5	T	29194	2017.09.19 13:31:56.171902632	0000678	
46	0.000440	-0.000428	-9.908469E-5	-3.509644E-5	T	29194	2017.09.19 13:31:56.181902632	0000678	
46	0.000446	-0.000432	-0.000104	-2.503537E-5	T	29194	2017.09.19 13:31:56.191902632	0000678	
46	0.000429	-0.000414	-0.000113	-2.015301E-5	T	29194	2017.09.19 13:31:56.201902632	0000678	
46	0.000438	-0.000427	-9.502421E-5	-2.011366E-5	T	29194	2017.09.19 13:31:56.211902632	0000678	
46	0.000435	-0.000419	-0.000113	-3.011186E-5	T	29194	2017.09.19 13:31:56.221902632	0000678	
46	0.000417	-0.000404	-9.937005E-5	-3.529195E-5	T	29194	2017.09.19 13:31:56.231902632	0000678	
46	0.000401	-0.000389	-9.049669E-5	-2.544377E-5	T	29194	2017.09.19 13:31:56.241902632	0000678	
46	0.000440	-0.000427	-9.906442E-5	-3.009665E-5	T	29194	2017.09.19 13:31:56.251902632	0000678	
47	0.000427	-0.000414	-9.925115E-5	-3.521049E-5	T	29184	2017.09.19 13:31:56.361990132	0000678	
47	0.000417	-0.000403	-9.934979E-5	-3.029216E-5	T	29184	2017.09.19 13:31:56.371990132	0000678	
47	0.000438	-0.000423	-0.000113	-2.507949E-5	T	29184	2017.09.19 13:31:56.381990132	0000678	
47	0.000434	-0.000422	-9.514446E-5	-3.515377E-5	T	29184	2017.09.19 13:31:56.391990132	0000678	
47	0.000450	-0.000438	-9.896579E-5	-3.501497E-5	T	29184	2017.09.19 13:31:56.401990132	0000678	
47	0.000439	-0.000427	-9.504447E-5	-2.511346E-5	T	29184	2017.09.19 13:31:56.411990132	0000678	
47	0.000435	-0.000422	-9.516067E-5	-3.915360E-5	T	29184	2017.09.19 13:31:56.421990132	0000678	
47	0.000401	-0.000385	-0.000114	-2.038926E-5	T	29184	2017.09.19 13:31:56.431990132	0000678	
47	0.000420	-0.000400	-0.000128	-2.020481E-5	T	29184	2017.09.19 13:31:56.441990132	0000678	
47	0.000429	-0.000414	-0.000104	-4.918915E-5	T	29184	2017.09.19 13:31:56.451990132	0000678	
48	0.000411	-0.000390	-0.000114	-6.334673E-5	T	29191	2017.09.19 13:31:56.562077632	0000678	
48	0.000435	-0.000414	-0.000113	-7.315080E-5	T	29191	2017.09.19 13:31:56.572077632	0000678	
48	0.000411	-0.000395	-0.000105	-4.434414E-5	T	29191	2017.09.19 13:31:56.582077632	0000678	
48	0.000425	-0.000413	-9.915388E-5	-1.121149E-5	T	29191	2017.09.19 13:31:56.592077632	0000678	
48	0.000419	-0.000404	-0.000104	-4.427082E-5	T	29191	2017.09.19 13:31:56.602077632	0000678	
48	0.000441	-0.000427	-0.000109	3.943433E-6	T	29191	2017.09.19 13:31:56.612077632	0000678	
48	0.000419	-0.000400	-0.000110	-5.928203E-5	T	29191	2017.09.19 13:31:56.622077632	0000678	
48	0.000426	-0.000413	-9.028834E-5	-4.424746E-5	T	29191	2017.09.19 13:31:56.632077632	0000678	
48	0.000447	-0.000432	-0.000113	-1.099861E-5	T	29191	2017.09.19 13:31:56.642077632	0000678	
48	0.000444	-0.000432	-9.500529E-5	-3.007252E-5	T	29191	2017.09.19 13:31:56.652077632	0000678	
49	0.000431	-0.000418	-9.519202E-5	-3.518635E-5	T	29186	2017.09.19 13:31:56.762165132	0000678	
49	0.000444	-0.000427	-0.000118	-6.018799E-6	T	29186	2017.09.19 13:31:56.772165132	0000678	
49	0.000400	-0.000381	-0.000124	-1.138072E-5	T	29186	2017.09.19 13:31:56.782165132	0000678	
49	0.000430	-0.000414	-0.000109	-3.916882E-5	T	29186	2017.09.19 13:31:56.792165132	0000678	
49	0.000422	-0.000408	-0.000104	-2.523089E-5	T	29186	2017.09.19 13:31:56.802165132	0000678	
49	0.000450	-0.000438	-9.896579E-5	-3.501497E-5	T	29186	2017.09.19 13:31:56.812165132	0000678	
49	0.000401	-0.000389	-9.541929E-5	-6.423810E-6	T	29186	2017.09.19 13:31:56.822165132	0000678	
49	0.000425	-0.000409	-0.000104	-5.422967E-5	T	29186	2017.09.19 13:31:56.832165132	0000678	
49	0.000392	-0.000380	-9.556683E-5	-1.649671E-5	T	29186	2017.09.19 13:31:56.842165132	0000678	
49	0.000415	-0.000400	-9.949462E-5	-5.432374E-5	T	29186	2017.09.19 13:31:56.852165132	0000678	
50	0.000415	-0.000400	-0.000109	-3.028324E-5	T	29181	2017.09.19 13:31:56.962252632	0000678	
50	0.000439	-0.000423	-0.000109	-4.409529E-5	T	29181	2017.09.19 13:31:56.972252632	0000678	
50	0.000422	-0.000404	-0.000109	-5.424965E-5	T	29181	2017.09.19 13:31:56.982252632	0000678	
50	0.000437	-0.000427	-9.002460E-5	-2.013442E-5	T	29181	2017.09.19 13:31:56.992252632	0000678	
50	0.000411	-0.000399	-9.041832E-5	-3.536188E-5	T	29181	2017.09.19 13:31:57.002252632	0000678	
50	0.000437	-0.000427	-8.508579E-5	-3.515454E-5	T	29181	2017.09.19 13:31:57.012252632	0000678	
50	0.000431	-0.000414	-0.000118	-2.513205E-5	T	29181	2017.09.19 13:31:57.022252632	0000678	
50	0.000425	-0.000413	-9.523120E-5	-3.022730E-5	T	29181	2017.09.19 13:31:57.032252632	0000678	
50	0.000416	-0.000400	-0.000109	-3.928287E-5	T	29181	2017.09.19 13:31:57.042252632	0000678	
50	0.000439	-0.000427	-9.902389E-5	-2.009706E-5	T	29181	2017.09.19 13:31:57.052252632	0000678	
51	0.000451	-0.000438	-0.000104	-2.999443E-5	T	29191	2017.09.19 13:31:57.162340132	0000678	
51	0.000430	-0.000414	-0.000104	-5.418894E-5	T	29191	2017.09.19 13:31:57.172340132	0000678	
51	0.000436	-0.000419	-0.000113	-4.411128E-5	T	29191	2017.09.19 13:31:57.182340132	0000678	
51	0.000415	-0.000400	-9.053181E-5	-6.336071E-5	T	29191	2017.09.19 13:31:57.192340132	0000678	
51	0.000415	-0.000403	-9.038697E-5	-3.932913E-5	T	29191	2017.09.19 13:31:57.202340132	0000678	
51	0.000434	-0.000422	-9.018133E-5	-4.417414E-5	T	29191	2017.09.19 13:31:57.212340132	0000678	
51	0.000457	-0.000446	-9.874124E-5	-5.942870E-6	T	29191	2017.09.19 13:31:57.222340132	0000678	
51	0.000428	-0.000418	-9.011540E-5	-1.620790E-5	T	29191	2017.09.19 13:31:57.232340132	0000678	
51	0.000458	-0.000442	-0.000113	-3.892412E-5	T	29191	2017.09.19 13:31:57.242340132	0000678	
51	0.000421	-0.000404	-0.000113	-3.523385E-5	T	29191	2017.09.19 13:31:57.252340132	0000678	
52	0.000442	-0.000428	-0.000109	-3.005515E-5	T	29185	2017.09.19 13:31:57.362427632	0000678	
52	0.000426	-0.000413	-9.921062E-5	-2.521090E-5	T	29185	2017.09.19 13:31:57.372427632	0000678	
52	0.000404	-0.000384	-0.000123	3.651242E-6	T	29185	2017.09.19 13:31:57.382427632	0000678	
52	0.000425	-0.000409	-0.000113	-3.019333E-5	T	29185	2017.09.19 13:31:57.392427632	0000678	
52	0.000432	-0.000418	-0.000104	-2.514942E-5	T	29185	2017.09.19 13:31:57.402427632	0000678	
52	0.000421	-0.000400	-0.000128	-2.520460E-5	T	29185	2017.09.19 13:31:57.412427632	0000678	
52	0.000448	-0.000428	-0.000128	-3.497609E-5	T	29185	2017.09.19 13:31:57.422427632	0000678	
52	0.000399	-0.000385	-9.959596E-5	-3.544673E-5	T	29185	2017.09.19 13:31:57.432427632	0000678	
52	0.000422	-0.000404	-0.000109	-5.424965E-5	T	29185	2017.09.19 13:31:57.442427632	0000678	
52	0.000420	-0.000408	-9.919306E-5	-6.252430E-6	T	29185	2017.09.19 13:31:57.452427632	0000678	
53	0.000411	-0.000395	-0.000113	-2.530758E-5	T	29193	2017.09.19 13:31:57.562515132	0000678	
53	0.000453	-0.000441	-9.889796E-5	-2.998260E-5	T	29193	2017.09.19 13:31:57.572515132	0000678	
53	0.000435	-0.000414	-0.000123	-4.911030E-5	T	29193	2017.09.19 13:31:57.582515132	0000678	
53	0.000429	-0.000414	-0.000104	-4.418936E-5	T	29193	2017.09.19 13:31:57.592515132	0000678	
53	0.000417	-0.000403	-0.000104	-6.272411E-6	T	29193	2017.09.19 13:31:57.602515132	0000678	
53	0.000408	-0.000394	-9.549359E-5	-3.938170E-5	T	29193	2017.09.19 13:31:57.612515132	0000678	
53	0.000405	-0.000385	-0.000124	-2.034776E-5	T	29193	2017.09.19 13:31:57.622515132	0000678	
53	0.000411	-0.000399	-8.545519E-5	-4.438226E-5	T	29193	2017.09.19 13:31:57.632515132	0000678	
53	0.000429	-0.000413	-0.000113	-1.115339E-5	T	29193	2017.09.19 13:31:57.642515132	0000678	
53	0.000423	-0.000409	-9.040858E-5	-5.928757E-5	T	29193	2017.09.19 13:31:57.652515132	0000678	
54	0.000428	-0.000414	-0.000104	-3.018995E-5	T	29191	2017.09.19 13:31:57.762602632	0000678	
54	0.000410	-0.000390	-0.000110	-6.336333E-5	T	29191	2017.09.19 13:31:57.772602632	0000678	
54	0.000424	-0.000409	-0.000104	-4.423009E-5	T	29191	2017.09.19 13:31:57.782602632	0000678	
54	0.000406	-0.000385	-0.000114	-6.338746E-5	T	29191	2017.09.19 13:31:57.792602632	0000678	
54	0.000414	-0.000403	-9.030997E-5	-2.032993E-5	T	29191	2017.09.19 13:31:57.802602632	0000678	
54	0.000418	-0.000403	-0.000109	3.747921E-6	T	29191	2017.09.19 13:31:57.812602632	0000678	
54	0.000417	-0.000404	-9.938626E-5	-3.929178E-5	T	29191	2017.09.19 13:31:57.822602632	0000678	
54	0.000412	-0.000395	-0.000118	-1.628721E-5	T	29191	2017.09.19 13:31:57.832602632	0000678	
54	0.000418	-0.000400	-0.000113	-4.426606E-5	T	29191	2017.09.19 13:31:57.842602632	0000678	
54	0.000437	-0.000419	-0.000123	-2.507057E-5	T	29191	2017.09.19 13:31:57.852602632	0000678	
55	0.000423	-0.000404	-0.000118	-3.921293E-5	T	29178	2017.09.19 13:31:57.962690132	0000678	
55	0.000446	-0.000432	-0.000109	-1.101521E-5	T	29178	2017.09.19 13:31:57.972690132	0000678	
55	0.000429	-0.000414	-0.000113	-1.615318E-5	T	29178	2017.09.19 13:31:57.982690132	0000678	
55	0.000428	-0.000414	-0.000104	-3.518974E-5	T	29178	2017.09.19 13:31:57.992690132	0000678	
55	0.000423	-0.000409	-9.934708E-5	-4.425084E-5	T	29178	2017.09.19 13:31:58.002690132	0000678	
55	0.000434	-0.000422	-9.018133E-5	-4.417414E-5	T	29178	2017.09.19 13:31:58.012690132	0000678	
55	0.000421	-0.000404	-0.000104	-5.427041E-5	T	29178	2017.09.19 13:31:58.022690132	0000678	
55	0.000447	-0.000437	-8.496689E-5	-3.507308E-5	T	29178	2017.09.19 13:31:58.032690132	0000678	
55	0.000393	-0.000376	-0.000110	-3.947838E-5	T	29178	2017.09.19 13:31:58.042690132	0000678	
55	0.000439	-0.000427	-9.904416E-5	-2.509686E-5	T	29178	2017.09.19 13:31:58.052690132	0000678	
56	0.000438	-0.000423	-0.000109	-3.509567E-5	T	29193	2017.09.19 13:31:58.162777632	0000678	
56	0.000388	-0.000375	-9.564249E-5	-2.053727E-5	T	29193	2017.09.19 13:31:58.172777632	0000678	
56	0.000435	-0.000419	-0.000113	-3.511165E-5	T	29193	2017.09.19 13:31:58.182777632	0000678	
56	0.000397	-0.000384	-9.557601E-5	-3.046354E-5	T	29193	2017.09.19 13:31:58.192777632	0000678	
56	0.000433	-0.000419	-0.000109	-2.512867E-5	T	29193	2017.09.19 13:31:58.202777632	0000678	
56	0.000414	-0.000403	-9.033023E-5	-2.532972E-5	T	29193	2017.09.19 13:31:58.212777632	0000678	
56	0.000425	-0.000409	-0.000109	-4.420934E-5	T	29193	2017.09.19 13:31:58.222777632	0000678	
56	0.000409	-0.000394	-0.000109	-6.324978E-6	T	29193	2017.09.19 13:31:58.232777632	0000678	
56	0.000445	-0.000428	-0.000118	-3.001780E-5	T	29193	2017.09.19 13:31:58.242777632	0000678	
56	0.000421	-0.000408	-9.927007E-5	-2.525164E-5	T	29193	2017.09.19 13:31:58.252777632	0000678	
57	0.000436	-0.000419	-0.000113	-4.411128E-5	T	29186	2017.09.19 13:31:58.362865132	0000678	
57	0.000443	-0.000428	-0.000113	-3.003855E-5	T	29186	2017.09.19 13:31:58.372865132	0000678	
57	0.000426	-0.000413	-9.923089E-5	-3.021070E-5	T	29186	2017.09.19 13:31:58.382865132	0000678	
57	0.000394	-0.000380	-9.958273E-5	-2.047994E-5	T	29186	2017.09.19 13:31:58.392865132	0000678	
57	0.000426	-0.000413	-9.525147E-5	-3.522709E-5	T	29186	2017.09.19 13:31:58.402865132	0000678	
57	0.000420	-0.000400	-0.000118	-4.924510E-5	T	29186	2017.09.19 13:31:58.412865132	0000678	
57	0.000426	-0.000413	-9.919036E-5	-2.021111E-5	T	29186	2017.09.19 13:31:58.422865132	0000678	
57	0.000434	-0.000419	-0.000109	-3.012846E-5	T	29186	2017.09.19 13:31:58.432865132	0000678	
57	0.000439	-0.000423	-0.000113	-3.007928E-5	T	29186	2017.09.19 13:31:58.442865132	0000678	
57	0.000463	-0.000447	-0.000113	-4.388318E-5	T	29186	2017.09.19 13:31:58.452865132	0000678	
58	0.000435	-0.000423	-9.518093E-5	-4.415339E-5	T	29183	2017.09.19 13:31:58.562952632	0000678	
58	0.000408	-0.000390	-0.000114	-4.434752E-5	T	29183	2017.09.19 13:31:58.572952632	0000678	
58	0.000424	-0.000409	-0.000104	-3.923030E-5	T	29183	2017.09.19 13:31:58.582952632	0000678	
58	0.000422	-0.000404	-0.000113	-4.923326E-5	T	29183	2017.09.19 13:31:58.592952632	0000678	
58	0.000439	-0.000423	-0.000104	-5.911542E-5	T	29183	2017.09.19 13:31:58.602952632	0000678	
58	0.000427	-0.000409	-0.000109	-5.420892E-5	T	29183	2017.09.19 13:31:58.612952632	0000678	
58	0.000440	-0.000423	-0.000113	-4.407869E-5	T	29183	2017.09.19 13:31:58.622952632	0000678	
58	0.000391	-0.000376	-9.973945E-5	-4.451967E-5	T	29183	2017.09.19 13:31:58.632952632	0000678	
58	0.000451	-0.000433	-0.000113	-5.399681E-5	T	29183	2017.09.19 13:31:58.642952632	0000678	
58	0.000424	-0.000413	-7.632997E-5	-5.430514E-5	T	29183	2017.09.19 13:31:58.652952632	0000678	
59	0.000444	-0.000437	-7.590681E-5	-2.011105E-5	T	29191	2017.09.19 13:31:58.763040132	0000678	
59	0.000479	-0.000466	-0.000109	-2.474580E-5	T	29191	2017.09.19 13:31:58.773040132	0000678	
59	0.000429	-0.000414	-0.000104	-4.918915E-5	T	29191	2017.09.19 13:31:58.783040132	0000678	
59	0.000413	-0.000395	-0.000114	-4.430679E-5	T	29191	2017.09.19 13:31:58.793040132	0000678	
59	0.000445	-0.000428	-0.000118	-3.501759E-5	T	29191	2017.09.19 13:31:58.803040132	0000678	
59	0.000438	-0.000423	-9.924141E-5	-5.913617E-5	T	29191	2017.09.19 13:31:58.813040132	0000678	
59	0.000432	-0.000418	-0.000109	-6.129466E-6	T	29191	2017.09.19 13:31:58.823040132	0000678	
59	0.000398	-0.000381	-0.000105	-4.945798E-5	T	29191	2017.09.19 13:31:58.833040132	0000678	
59	0.000411	-0.000399	-9.043453E-5	-3.936172E-5	T	29191	2017.09.19 13:31:58.843040132	0000678	
59	0.000435	-0.000422	-0.000104	3.881951E-6	T	29191	2017.09.19 13:31:58.853040132	0000678	
60	0.000415	-0.000403	-9.532984E-5	-2.530897E-5	T	29189	2017.09.19 13:31:58.963127632	0000678	
60	0.000417	-0.000395	-0.000132	-2.022894E-5	T	29189	2017.09.19 13:31:58.973127632	0000678	
60	0.000432	-0.000414	-0.000113	-4.915180E-5	T	29189	2017.09.19 13:31:58.983127632	0000678	
60	0.000379	-0.000365	-9.968407E-5	-1.602930E-6	T	29189	2017.09.19 13:31:58.993127632	0000678	
60	0.000422	-0.000404	-0.000109	-5.424965E-5	T	29189	2017.09.19 13:31:59.003127632	0000678	
60	0.000421	-0.000404	-9.950380E-5	-6.829057E-5	T	29189	2017.09.19 13:31:59.013127632	0000678	
60	0.000437	-0.000419	-0.000118	-3.909074E-5	T	29189	2017.09.19 13:31:59.023127632	0000678	
60	0.000396	-0.000384	-9.551927E-5	-1.646412E-5	T	29189	2017.09.19 13:31:59.033127632	0000678	
60	0.000445	-0.000428	-0.000113	-4.903775E-5	T	29189	2017.09.19 13:31:59.043127632	0000678	
60	0.000456	-0.000442	-0.000109	-3.494089E-5	T	29189	2017.09.19 13:31:59.053127632	0000678	
61	0.000412	-0.000395	-0.000113	-3.530717E-5	T	29187	2017.09.19 13:31:59.163215132	0000678	
61	0.000425	-0.000409	-0.000109	-3.920955E-5	T	29187	2017.09.19 13:31:59.173215132	0000678	
61	0.000419	-0.000403	-0.000113	-1.235270E-6	T	29187	2017.09.19 13:31:59.183215132	0000678	
61	0.000430	-0.000414	-0.000113	-3.515239E-5	T	29187	2017.09.19 13:31:59.193215132	0000678	
61	0.000446	-0.000433	-9.510256E-5	-5.407151E-5	T	29187	2017.09.19 13:31:59.203215132	0000678	
61	0.000416	-0.000403	-9.930926E-5	-2.029258E-5	T	29187	2017.09.19 13:31:59.213215132	0000678	
61	0.000425	-0.000413	-9.915388E-5	-1.121149E-5	T	29187	2017.09.19 13:31:59.223215132	0000678	
61	0.000424	-0.000408	-0.000113	3.805253E-6	T	29187	2017.09.19 13:31:59.233215132	0000678	
61	0.000447	-0.000433	-9.512283E-5	-5.907130E-5	T	29187	2017.09.19 13:31:59.243215132	0000678	
61	0.000443	-0.000423	-0.000104	-7.811462E-5	T	29187	2017.09.19 13:31:59.253215132	0000678	
62	0.000406	-0.000390	-0.000105	-4.938466E-5	T	29186	2017.09.19 13:31:59.363302632	0000678	
62	0.000428	-0.000414	-0.000104	-3.018995E-5	T	29186	2017.09.19 13:31:59.373302632	0000678	
62	0.000392	-0.000376	-0.000110	-3.047875E-5	T	29186	2017.09.19 13:31:59.383302632	0000678	
62	0.000426	-0.000413	-0.000104	-1.119074E-5	T	29186	2017.09.19 13:31:59.393302632	0000678	
62	0.000426	-0.000413	-9.923089E-5	-3.021070E-5	T	29186	2017.09.19 13:31:59.403302632	0000678	
62	0.000424	-0.000409	-0.000109	-2.521014E-5	T	29186	2017.09.19 13:31:59.413302632	0000678	
62	0.000436	-0.000422	-0.000109	-6.096881E-6	T	29186	2017.09.19 13:31:59.423302632	0000678	
62	0.000429	-0.000414	-0.000113	-2.015301E-5	T	29186	2017.09.19 13:31:59.433302632	0000678	
62	0.000434	-0.000419	-0.000109	-3.512825E-5	T	29186	2017.09.19 13:31:59.443302632	0000678	
62	0.000410	-0.000390	-0.000105	-7.338366E-5	T	29186	2017.09.19 13:31:59.453302632	0000678	
63	0.000391	-0.000371	-0.000105	-6.353886E-5	T	29182	2017.09.19 13:31:59.563390132	0000678	
63	0.000419	-0.000404	-0.000104	-4.427082E-5	T	29182	2017.09.19 13:31:59.573390132	0000678	
63	0.000450	-0.000437	-9.894552E-5	-3.001518E-5	T	29182	2017.09.19 13:31:59.583390132	0000678	
63	0.000401	-0.000385	-0.000110	-3.040544E-5	T	29182	2017.09.19 13:31:59.593390132	0000678	
63	0.000437	-0.000423	-9.522146E-5	-5.415298E-5	T	29182	2017.09.19 13:31:59.603390132	0000678	
63	0.000436	-0.000419	-0.000113	-3.911149E-5	T	29182	2017.09.19 13:31:59.613390132	0000678	
63	0.000399	-0.000381	-0.000119	-6.401676E-6	T	29182	2017.09.19 13:31:59.623390132	0000678	
63	0.000422	-0.000404	-0.000113	-4.923326E-5	T	29182	2017.09.19 13:31:59.633390132	0000678	
63	0.000446	-0.000437	-8.982870E-5	-1.053746E-6	T	29182	2017.09.19 13:31:59.643390132	0000678	
63	0.000434	-0.000422	-9.510393E-5	-2.515419E-5	T	29182	2017.09.19 13:31:59.653390132	0000678	
64	0.000434	-0.000419	-0.000113	-1.611245E-5	T	29181	2017.09.19 13:31:59.763477632	0000678	
64	0.000439	-0.000427	-9.902389E-5	-2.009706E-5	T	29181	2017.09.19 13:31:59.773477632	0000678	
64	0.000415	-0.000403	-9.037076E-5	-3.532930E-5	T	29181	2017.09.19 13:31:59.783477632	0000678	
64	0.000434	-0.000419	-9.926871E-5	-5.416896E-5	T	29181	2017.09.19 13:31:59.793477632	0000678	
64	0.000441	-0.000428	-9.912117E-5	-4.409606E-5	T	29181	2017.09.19 13:31:59.803477632	0000678	
64	0.000450	-0.000438	-9.500258E-5	-4.403120E-5	T	29181	2017.09.19 13:31:59.813477632	0000678	
64	0.000416	-0.000400	-8.559300E-5	-7.838084E-5	T	29181	2017.09.19 13:31:59.823477632	0000678	
64	0.000436	-0.000419	-0.000123	-6.071366E-6	T	29181	2017.09.19 13:31:59.833477632	0000678	
64	0.000418	-0.000403	-0.000104	-2.527162E-5	T	29181	2017.09.19 13:31:59.843477632	0000678	
64	0.000386	-0.000371	-9.979890E-5	-4.456040E-5	T	29181	2017.09.19 13:31:59.853477632	0000678	
65	0.000439	-0.000419	-0.000118	-5.908990E-5	T	29191	2017.09.19 13:31:59.963565132	0000678	
65	0.000439	-0.000419	-0.000113	-6.311048E-5	T	29191	2017.09.19 13:31:59.973565132	0000678	
65	0.000444	-0.000432	-9.894823E-5	-1.605650E-5	T	29191	2017.09.19 13:31:59.983565132	0000678	
65	0.000417	-0.000403	-0.000104	-2.027183E-5	T	29191	2017.09.19 13:31:59.993565132	0000678	
65	0.000438	-0.000423	-0.000113	-1.607986E-5	T	29191	2017.09.19 13:32:00.003565132	0000678	
65	0.000437	-0.000423	-0.000104	-3.511642E-5	T	29191	2017.09.19 13:32:00.013565132	0000678	
65	0.000424	-0.000409	-0.000104	-4.423009E-5	T	29191	2017.09.19 13:32:00.023565132	0000678	
65	0.000424	-0.000413	-8.526847E-5	-3.926842E-5	T	29191	2017.09.19 13:32:00.033565132	0000678	
65	0.000439	-0.000419	-0.000118	-5.409011E-5	T	29191	2017.09.19 13:32:00.043565132	0000678	
65	0.000415	-0.000408	-7.615435E-5	3.651701E-6	T	29191	2017.09.19 13:32:00.053565132	0000678	
66	0.000401	-0.000389	-9.053722E-5	-3.544335E-5	T	29185	2017.09.19 13:32:00.163652632	0000678	
66	0.000452	-0.000438	-0.000109	-2.497389E-5	T	29185	2017.09.19 13:32:00.173652632	0000678	
66	0.000453	-0.000433	-0.000113	-6.799623E-5	T	29185	2017.09.19 13:32:00.183652632	0000678	
66	0.000432	-0.000419	-9.522849E-5	-4.418598E-5	T	29185	2017.09.19 13:32:00.193652632	0000678	
66	0.000448	-0.000437	-8.502364E-5	-4.907249E-5	T	29185	2017.09.19 13:32:00.203652632	0000678	
66	0.000451	-0.000438	-0.000104	-2.999443E-5	T	29185	2017.09.19 13:32:00.213652632	0000678	
66	0.000433	-0.000418	-0.000113	-6.112866E-6	T	29185	2017.09.19 13:32:00.223652632	0000678	
66	0.000458	-0.000438	-0.000128	-4.389425E-5	T	29185	2017.09.19 13:32:00.233652632	0000678	
66	0.000414	-0.000400	-9.549493E-5	-5.434034E-5	T	29185	2017.09.19 13:32:00.243652632	0000678	
66	0.000437	-0.000423	-0.000104	-3.511642E-5	T	29185	2017.09.19 13:32:00.253652632	0000678	
67	0.000423	-0.000409	-9.934708E-5	-4.425084E-5	T	29199	2017.09.19 13:32:00.363740132	0000678	
67	0.000442	-0.000427	-0.000113	2.960075E-6	T	29199	2017.09.19 13:32:00.373740132	0000678	
67	0.000436	-0.000423	-9.916035E-5	-3.913700E-5	T	29199	2017.09.19 13:32:00.383740132	0000678	
67	0.000433	-0.000422	-9.508366E-5	-2.015440E-5	T	29199	2017.09.19 13:32:00.393740132	0000678	
67	0.000450	-0.000438	-9.500258E-5	-4.403120E-5	T	29199	2017.09.19 13:32:00.403740132	0000678	
67	0.000450	-0.000433	-0.000118	-3.497686E-5	T	29199	2017.09.19 13:32:00.413740132	0000678	
67	0.000441	-0.000428	-9.514175E-5	-4.911245E-5	T	29199	2017.09.19 13:32:00.423740132	0000678	
67	0.000423	-0.000413	-9.011406E-5	-1.249258E-6	T	29199	2017.09.19 13:32:00.433740132	0000678	
67	0.000487	-0.000471	-0.000122	-1.564734E-5	T	29199	2017.09.19 13:32:00.443740132	0000678	
67	0.000413	-0.000399	-0.000104	-2.030441E-5	T	29199	2017.09.19 13:32:00.453740132	0000678	
68	0.000451	-0.000433	-0.000118	-4.897627E-5	T	29187	2017.09.19 13:32:00.563827632	0000678	
68	0.000431	-0.000418	-9.915117E-5	-2.517017E-5	T	29187	2017.09.19 13:32:00.573827632	0000678	
68	0.000432	-0.000419	-9.919170E-5	-3.516975E-5	T	29187	2017.09.19 13:32:00.583827632	0000678	
68	0.000429	-0.000414	-0.000113	-2.015301E-5	T	29187	2017.09.19 13:32:00.593827632	0000678	
68	0.000453	-0.000438	-0.000113	-2.995708E-5	T	29187	2017.09.19 13:32:00.603827632	0000678	
68	0.000433	-0.000422	-9.502692E-5	-6.154982E-6	T	29187	2017.09.19 13:32:00.613827632	0000678	
68	0.000406	-0.000394	-9.538010E-5	-1.138287E-5	T	29187	2017.09.19 13:32:00.623827632	0000678	
68	0.000448	-0.000433	-0.000113	-2.999781E-5	T	29187	2017.09.19 13:32:00.633827632	0000678	
68	0.000458	-0.000442	-0.000109	-5.394010E-5	T	29187	2017.09.19 13:32:00.643827632	0000678	
68	0.000436	-0.000423	-0.000104	-3.011663E-5	T	29187	2017.09.19 13:32:00.653827632	0000678	
69	0.000459	-0.000442	-0.000118	-3.490354E-5	T	29188	2017.09.19 13:32:00.763915132	0000678	
69	0.000457	-0.000442	-0.000113	-3.492429E-5	T	29188	2017.09.19 13:32:00.773915132	0000678	
69	0.000460	-0.000451	-8.478017E-5	-2.995924E-5	T	29188	2017.09.19 13:32:00.783915132	0000678	
69	0.000431	-0.000414	-0.000109	-4.916840E-5	T	29188	2017.09.19 13:32:00.793915132	0000678	
69	0.000447	-0.000433	-0.000104	-4.403458E-5	T	29188	2017.09.19 13:32:00.803915132	0000678	
69	0.000428	-0.000413	-0.000109	-1.616978E-5	T	29188	2017.09.19 13:32:00.813915132	0000678	
69	0.000434	-0.000422	-9.514446E-5	-3.515377E-5	T	29188	2017.09.19 13:32:00.823915132	0000678	
69	0.000412	-0.000395	-0.000113	-3.030737E-5	T	29188	2017.09.19 13:32:00.833915132	0000678	
69	0.000426	-0.000413	-0.000104	-1.119074E-5	T	29188	2017.09.19 13:32:00.843915132	0000678	
69	0.000460	-0.000447	-9.889526E-5	-4.394128E-5	T	29188	2017.09.19 13:32:00.853915132	0000678	
70	0.000418	-0.000404	-9.542711E-5	-4.930796E-5	T	29191	2017.09.19 13:32:00.964002632	0000678	
70	0.000432	-0.000418	-0.000104	-2.014963E-5	T	29191	2017.09.19 13:32:00.974002632	0000678	
70	0.000432	-0.000414	-0.000118	-3.513164E-5	T	29191	2017.09.19 13:32:00.984002632	0000678	
70	0.000417	-0.000400	-0.000113	-3.026664E-5	T	29191	2017.09.19 13:32:00.994002632	0000678	
70	0.000457	-0.000446	-9.878177E-5	-1.594245E-5	T	29191	2017.09.19 13:32:01.004002632	0000678	
70	0.000433	-0.000418	-0.000109	-1.612905E-5	T	29191	2017.09.19 13:32:01.014002632	0000678	
70	0.000439	-0.000419	-0.000118	-5.409011E-5	T	29191	2017.09.19 13:32:01.024002632	0000678	
70	0.000428	-0.000414	-0.000104	-3.518974E-5	T	29191	2017.09.19 13:32:01.034002632	0000678	
70	0.000442	-0.000427	-0.000113	-1.103934E-5	T	29191	2017.09.19 13:32:01.044002632	0000678	
70	0.000452	-0.000441	-9.484154E-5	-1.599978E-5	T	29191	2017.09.19 13:32:01.054002632	0000678	
71	0.000434	-0.000414	-0.000128	-2.509055E-5	T	29184	2017.09.19 13:32:01.164090132	0000678	
71	0.000397	-0.000384	-9.555575E-5	-2.546375E-5	T	29184	2017.09.19 13:32:01.174090132	0000678	
71	0.000434	-0.000419	-0.000104	-4.414863E-5	T	29184	2017.09.19 13:32:01.184090132	0000678	
71	0.000401	-0.000389	-9.049669E-5	-2.544377E-5	T	29184	2017.09.19 13:32:01.194090132	0000678	
71	0.000429	-0.000414	-0.000104	-4.418936E-5	T	29184	2017.09.19 13:32:01.204090132	0000678	
71	0.000444	-0.000428	-0.000104	-5.407489E-5	T	29184	2017.09.19 13:32:01.214090132	0000678	
71	0.000429	-0.000414	-9.536495E-5	-6.322592E-5	T	29184	2017.09.19 13:32:01.224090132	0000678	
71	0.000444	-0.000428	-0.000113	-3.503834E-5	T	29184	2017.09.19 13:32:01.234090132	0000678	
71	0.000415	-0.000400	-0.000109	-3.028324E-5	T	29184	2017.09.19 13:32:01.244090132	0000678	
71	0.000455	-0.000442	-0.000109	-2.494131E-5	T	29184	2017.09.19 13:32:01.254090132	0000678	
72	0.000447	-0.000433	-0.000104	-4.403458E-5	T	29175	2017.09.19 13:32:01.364177632	0000678	
72	0.000431	-0.000414	-0.000104	-5.918873E-5	T	29175	2017.09.19 13:32:01.374177632	0000678	
72	0.000443	-0.000428	-9.519849E-5	-6.311187E-5	T	29175	2017.09.19 13:32:01.384177632	0000678	
72	0.000448	-0.000433	-0.000109	-3.501421E-5	T	29175	2017.09.19 13:32:01.394177632	0000678	
72	0.000425	-0.000409	-0.000113	-3.019333E-5	T	29175	2017.09.19 13:32:01.404177632	0000678	
72	0.000421	-0.000408	-9.924981E-5	-2.025184E-5	T	29175	2017.09.19 13:32:01.414177632	0000678	
72	0.000430	-0.000414	-0.000113	-3.515239E-5	T	29175	2017.09.19 13:32:01.424177632	0000678	
72	0.000448	-0.000433	-9.912251E-5	-5.905470E-5	T	29175	2017.09.19 13:32:01.434177632	0000678	
72	0.000435	-0.000418	-0.000118	3.907466E-6	T	29175	2017.09.19 13:32:01.444177632	0000678	
72	0.000451	-0.000438	-0.000104	-2.999443E-5	T	29175	2017.09.19 13:32:01.454177632	0000678	
73	0.000431	-0.000414	-0.000109	-5.416819E-5	T	29187	2017.09.19 13:32:01.564265132	0000678	
73	0.000442	-0.000428	-0.000109	-3.005515E-5	T	29187	2017.09.19 13:32:01.574265132	0000678	
73	0.000426	-0.000409	-0.000118	-2.017299E-5	T	29187	2017.09.19 13:32:01.584265132	0000678	
73	0.000417	-0.000404	-9.937005E-5	-3.529195E-5	T	29187	2017.09.19 13:32:01.594265132	0000678	
73	0.000426	-0.000409	-0.000113	-4.419274E-5	T	29187	2017.09.19 13:32:01.604265132	0000678	
73	0.000423	-0.000409	-0.000104	-3.023068E-5	T	29187	2017.09.19 13:32:01.614265132	0000678	
73	0.000429	-0.000414	-9.534874E-5	-5.922608E-5	T	29187	2017.09.19 13:32:01.624265132	0000678	
73	0.000421	-0.000408	-9.532713E-5	-3.926765E-5	T	29187	2017.09.19 13:32:01.634265132	0000678	
73	0.000422	-0.000409	-9.536766E-5	-4.926723E-5	T	29187	2017.09.19 13:32:01.644265132	0000678	
73	0.000414	-0.000399	-0.000109	-6.284246E-6	T	29187	2017.09.19 13:32:01.654265132	0000678	
74	0.000423	-0.000409	-9.934708E-5	-4.425084E-5	T	29196	2017.09.19 13:32:01.764352632	0000678	
74	0.000416	-0.000403	-9.535010E-5	-3.030876E-5	T	29196	2017.09.19 13:32:01.774352632	0000678	
74	0.000413	-0.000403	-8.531036E-5	-2.035068E-5	T	29196	2017.09.19 13:32:01.784352632	0000678	
74	0.000432	-0.000414	-0.000118	-3.513164E-5	T	29196	2017.09.19 13:32:01.794352632	0000678	
74	0.000397	-0.000381	-9.970027E-5	-4.947873E-5	T	29196	2017.09.19 13:32:01.804352632	0000678	
74	0.000430	-0.000418	-9.517175E-5	-3.018656E-5	T	29196	2017.09.19 13:32:01.814352632	0000678	
74	0.000423	-0.000413	-8.028913E-5	-4.428896E-5	T	29196	2017.09.19 13:32:01.824352632	0000678	
74	0.000450	-0.000437	-0.000104	-1.599502E-5	T	29196	2017.09.19 13:32:01.834352632	0000678	
74	0.000425	-0.000413	-9.521094E-5	-2.522750E-5	T	29196	2017.09.19 13:32:01.844352632	0000678	
74	0.000401	-0.000385	-0.000110	-2.540565E-5	T	29196	2017.09.19 13:32:01.854352632	0000678	
75	0.000410	-0.000395	-0.000109	-2.532418E-5	T	29176	2017.09.19 13:32:01.964440132	0000678	
75	0.000456	-0.000442	-0.000113	-1.992492E-5	T	29176	2017.09.19 13:32:01.974440132	0000678	
75	0.000450	-0.000433	-0.000109	-5.401341E-5	T	29176	2017.09.19 13:32:01.984440132	0000678	
75	0.000427	-0.000404	-0.000119	-6.821172E-5	T	29176	2017.09.19 13:32:01.994440132	0000678	
75	0.000426	-0.000413	-9.923089E-5	-3.021070E-5	T	29176	2017.09.19 13:32:02.004440132	0000678	
75	0.000443	-0.000428	-0.000113	-3.003855E-5	T	29176	2017.09.19 13:32:02.014440132	0000678	
75	0.000421	-0.000404	-0.000118	-2.021373E-5	T	29176	2017.09.19 13:32:02.024440132	0000678	
75	0.000439	-0.000423	-0.000118	-1.105932E-5	T	29176	2017.09.19 13:32:02.034440132	0000678	
75	0.000460	-0.000446	-0.000113	4.114813E-6	T	29176	2017.09.19 13:32:02.044440132	0000678	
75	0.000425	-0.000413	-9.523120E-5	-3.022730E-5	T	29176	2017.09.19 13:32:02.054440132	0000678	
76	0.000424	-0.000409	-0.000109	-3.020993E-5	T	29183	2017.09.19 13:32:02.164527632	0000678	
76	0.000415	-0.000400	-9.947435E-5	-4.932395E-5	T	29183	2017.09.19 13:32:02.174527632	0000678	
76	0.000426	-0.000409	-0.000118	-2.517278E-5	T	29183	2017.09.19 13:32:02.184527632	0000678	
76	0.000421	-0.000408	-9.923359E-5	-1.625201E-5	T	29183	2017.09.19 13:32:02.194527632	0000678	
76	0.000431	-0.000414	-0.000109	-5.416819E-5	T	29183	2017.09.19 13:32:02.204527632	0000678	
76	0.000430	-0.000422	-8.008484E-5	-2.021665E-5	T	29183	2017.09.19 13:32:02.214527632	0000678	
76	0.000436	-0.000419	-0.000109	-4.912767E-5	T	29183	2017.09.19 13:32:02.224527632	0000678	
76	0.000408	-0.000395	-9.947706E-5	-3.536527E-5	T	29183	2017.09.19 13:32:02.234527632	0000678	
76	0.000416	-0.000403	-9.040724E-5	-4.432892E-5	T	29183	2017.09.19 13:32:02.244527632	0000678	
76	0.000418	-0.000400	-0.000113	-4.926585E-5	T	29183	2017.09.19 13:32:02.254527632	0000678	
77	0.000392	-0.000380	-8.568110E-5	-4.453704E-5	T	29181	2017.09.19 13:32:02.364615132	0000678	
77	0.000425	-0.000413	-9.913361E-5	-6.211698E-6	T	29181	2017.09.19 13:32:02.374615132	0000678	
77	0.000447	-0.000433	-0.000109	-2.501462E-5	T	29181	2017.09.19 13:32:02.384615132	0000678	
77	0.000430	-0.000418	-9.515149E-5	-2.518677E-5	T	29181	2017.09.19 13:32:02.394615132	0000678	
77	0.000432	-0.000414	-0.000104	-6.818836E-5	T	29181	2017.09.19 13:32:02.404615132	0000678	
77	0.000430	-0.000414	-0.000113	-3.015259E-5	T	29181	2017.09.19 13:32:02.414615132	0000678	
77	0.000396	-0.000384	-9.055614E-5	-2.548450E-5	T	29181	2017.09.19 13:32:02.424615132	0000678	
77	0.000466	-0.000455	-9.861396E-5	-8.697622E-7	T	29181	2017.09.19 13:32:02.434615132	0000678	
77	0.000465	-0.000452	-9.887633E-5	-5.390013E-5	T	29181	2017.09.19 13:32:02.444615132	0000678	
77	0.000453	-0.000438	-0.000118	-1.593692E-5	T	29181	2017.09.19 13:32:02.454615132	0000678	
78	0.000436	-0.000419	-0.000109	-5.412746E-5	T	29184	2017.09.19 13:32:02.564702632	0000678	
78	0.000412	-0.000399	-9.937708E-5	-2.532495E-5	T	29184	2017.09.19 13:32:02.574702632	0000678	
78	0.000436	-0.000423	-9.520120E-5	-4.915318E-5	T	29184	2017.09.19 13:32:02.584702632	0000678	
78	0.000425	-0.000413	-9.913361E-5	-6.211698E-6	T	29184	2017.09.19 13:32:02.594702632	0000678	
78	0.000431	-0.000418	-0.000104	-1.115001E-5	T	29184	2017.09.19 13:32:02.604702632	0000678	
78	0.000430	-0.000418	-9.909443E-5	-1.117076E-5	T	29184	2017.09.19 13:32:02.614702632	0000678	
78	0.000435	-0.000422	-0.000104	-1.111742E-5	T	29184	2017.09.19 13:32:02.624702632	0000678	
78	0.000434	-0.000419	-0.000104	-4.414863E-5	T	29184	2017.09.19 13:32:02.634702632	0000678	
78	0.000447	-0.000433	-0.000113	-1.599840E-5	T	29184	2017.09.19 13:32:02.644702632	0000678	
78	0.000415	-0.000400	-0.000109	-3.028324E-5	T	29184	2017.09.19 13:32:02.654702632	0000678	
79	0.000423	-0.000409	-0.000109	-2.021034E-5	T	29187	2017.09.19 13:32:02.764790132	0000678	
79	0.000435	-0.000422	-9.910361E-5	-2.513759E-5	T	29187	2017.09.19 13:32:02.774790132	0000678	
79	0.000422	-0.000408	-0.000104	-2.023109E-5	T	29187	2017.09.19 13:32:02.784790132	0000678	
79	0.000417	-0.000404	-9.540684E-5	-4.430817E-5	T	29187	2017.09.19 13:32:02.794790132	0000678	
79	0.000419	-0.000404	-0.000109	-3.025066E-5	T	29187	2017.09.19 13:32:02.804790132	0000678	
79	0.000443	-0.000428	-0.000104	-4.907510E-5	T	29187	2017.09.19 13:32:02.814790132	0000678	
79	0.000452	-0.000437	-0.000113	-9.582952E-7	T	29187	2017.09.19 13:32:02.824790132	0000678	
79	0.000444	-0.000428	-0.000104	-5.907468E-5	T	29187	2017.09.19 13:32:02.834790132	0000678	
79	0.000413	-0.000400	-9.545440E-5	-4.434076E-5	T	29187	2017.09.19 13:32:02.844790132	0000678	
79	0.000473	-0.000461	-0.000104	-3.480686E-5	T	29187	2017.09.19 13:32:02.854790132	0000678	
80	0.000419	-0.000408	-9.027078E-5	-2.528899E-5	T	29187	2017.09.19 13:32:02.964877632	0000678	
80	0.000451	-0.000438	-0.000104	-3.899406E-5	T	29187	2017.09.19 13:32:02.974877632	0000678	
80	0.000409	-0.000394	-0.000104	-2.534493E-5	T	29187	2017.09.19 13:32:02.984877632	0000678	
80	0.000417	-0.000404	-9.938626E-5	-3.929178E-5	T	29187	2017.09.19 13:32:02.994877632	0000678	
80	0.000431	-0.000414	-0.000113	-4.415201E-5	T	29187	2017.09.19 13:32:03.004877632	0000678	
80	0.000443	-0.000428	-0.000113	-2.003896E-5	T	29187	2017.09.19 13:32:03.014877632	0000678	
80	0.000450	-0.000438	-9.502285E-5	-4.903099E-5	T	29187	2017.09.19 13:32:03.024877632	0000678	
80	0.000449	-0.000437	-9.496610E-5	-3.503157E-5	T	29187	2017.09.19 13:32:03.034877632	0000678	
80	0.000424	-0.000409	-0.000104	-3.923030E-5	T	29187	2017.09.19 13:32:03.044877632	0000678	
80	0.000422	-0.000404	-0.000123	-1.119335E-5	T	29187	2017.09.19 13:32:03.054877632	0000678	
81	0.000455	-0.000438	-0.000109	-5.897247E-5	T	29181	2017.09.19 13:32:03.164965132	0000678	
81	0.000457	-0.000442	-0.000104	-5.396085E-5	T	29181	2017.09.19 13:32:03.174965132	0000678	
81	0.000455	-0.000442	-9.897497E-5	-4.898180E-5	T	29181	2017.09.19 13:32:03.184965132	0000678	
81	0.000433	-0.000419	-9.526902E-5	-5.418556E-5	T	29181	2017.09.19 13:32:03.194965132	0000678	
81	0.000418	-0.000400	-0.000113	-4.426606E-5	T	29181	2017.09.19 13:32:03.204965132	0000678	
81	0.000423	-0.000404	-0.000109	-6.324928E-5	T	29181	2017.09.19 13:32:03.214965132	0000678	
81	0.000430	-0.000418	-9.022889E-5	-4.420673E-5	T	29181	2017.09.19 13:32:03.224965132	0000678	
81	0.000446	-0.000432	-0.000109	3.984164E-6	T	29181	2017.09.19 13:32:03.234965132	0000678	
81	0.000417	-0.000404	-9.938626E-5	-3.929178E-5	T	29181	2017.09.19 13:32:03.244965132	0000678	
81	0.000433	-0.000414	-0.000128	-1.109114E-5	T	29181	2017.09.19 13:32:03.254965132	0000678	
82	0.000405	-0.000390	-9.957299E-5	-4.440562E-5	T	29184	2017.09.19 13:32:03.365052632	0000678	
82	0.000420	-0.000408	-9.529065E-5	-3.026803E-5	T	29184	2017.09.19 13:32:03.375052632	0000678	
82	0.000431	-0.000418	-0.000104	-1.614980E-5	T	29184	2017.09.19 13:32:03.385052632	0000678	
82	0.000451	-0.000433	-0.000123	-2.995631E-5	T	29184	2017.09.19 13:32:03.395052632	0000678	
82	0.000458	-0.000442	-0.000104	-5.896064E-5	T	29184	2017.09.19 13:32:03.405052632	0000678	
82	0.000439	-0.000427	-9.506474E-5	-3.011325E-5	T	29184	2017.09.19 13:32:03.415052632	0000678	
82	0.000429	-0.000413	-0.000113	-7.153556E-6	T	29184	2017.09.19 13:32:03.425052632	0000678	
82	0.000442	-0.000428	-0.000109	-2.505536E-5	T	29184	2017.09.19 13:32:03.435052632	0000678	
82	0.000454	-0.000441	-0.000104	-1.996227E-5	T	29184	2017.09.19 13:32:03.445052632	0000678	
82	0.000410	-0.000394	-0.000113	3.691205E-6	T	29184	2017.09.19 13:32:03.455052632	0000678	
83	0.000419	-0.000404	-0.000104	-3.927103E-5	T	29186	2017.09.19 13:32:03.565140132	0000678	
83	0.000429	-0.000414	-0.000109	-3.516899E-5	T	29186	2017.09.19 13:32:03.575140132	0000678	
83	0.000414	-0.000403	-8.538737E-5	-3.934988E-5	T	29186	2017.09.19 13:32:03.585140132	0000678	
83	0.000399	-0.000384	-0.000105	-2.042661E-5	T	29186	2017.09.19 13:32:03.595140132	0000678	
83	0.000443	-0.000432	-9.002595E-5	-3.509306E-5	T	29186	2017.09.19 13:32:03.605140132	0000678	
83	0.000438	-0.000419	-0.000109	-6.812688E-5	T	29186	2017.09.19 13:32:03.615140132	0000678	
83	0.000423	-0.000409	-0.000109	-2.021034E-5	T	29186	2017.09.19 13:32:03.625140132	0000678	
83	0.000408	-0.000395	-9.947706E-5	-3.536527E-5	T	29186	2017.09.19 13:32:03.635140132	0000678	
83	0.000445	-0.000432	-0.000104	-6.036168E-6	T	29186	2017.09.19 13:32:03.645140132	0000678	
83	0.000454	-0.000441	-0.000104	-1.596243E-5	T	29186	2017.09.19 13:32:03.655140132	0000678	
84	0.000449	-0.000437	-9.494584E-5	-3.003178E-5	T	29186	2017.09.19 13:32:03.765227632	0000678	
84	0.000409	-0.000395	-9.949327E-5	-3.936510E-5	T	29186	2017.09.19 13:32:03.775227632	0000678	
84	0.000458	-0.000442	-9.905198E-5	-6.798101E-5	T	29186	2017.09.19 13:32:03.785227632	0000678	
84	0.000418	-0.000404	-0.000104	-3.527120E-5	T	29186	2017.09.19 13:32:03.795227632	0000678	
84	0.000439	-0.000427	-9.012188E-5	-4.413341E-5	T	29186	2017.09.19 13:32:03.805227632	0000678	
84	0.000424	-0.000413	-9.513393E-5	-6.228298E-6	T	29186	2017.09.19 13:32:03.815227632	0000678	
84	0.000420	-0.000404	-0.000104	-4.927061E-5	T	29186	2017.09.19 13:32:03.825227632	0000678	
84	0.000441	-0.000423	-0.000123	-2.003820E-5	T	29186	2017.09.19 13:32:03.835227632	0000678	
84	0.000446	-0.000433	-9.508230E-5	-4.907172E-5	T	29186	2017.09.19 13:32:03.845227632	0000678	
84	0.000412	-0.000395	-0.000118	-1.128742E-5	T	29186	2017.09.19 13:32:03.855227632	0000678	
85	0.000448	-0.000433	-0.000104	-5.403416E-5	T	29181	2017.09.19 13:32:03.965315132	0000678	
85	0.000427	-0.000409	-0.000104	-6.822909E-5	T	29181	2017.09.19 13:32:03.975315132	0000678	
85	0.000426	-0.000413	-9.028834E-5	-4.424746E-5	T	29181	2017.09.19 13:32:03.985315132	0000678	
85	0.000425	-0.000413	-9.913361E-5	-6.211698E-6	T	29181	2017.09.19 13:32:03.995315132	0000678	
85	0.000414	-0.000399	-0.000109	-1.628383E-5	T	29181	2017.09.19 13:32:04.005315132	0000678	
85	0.000449	-0.000433	-0.000118	-1.597765E-5	T	29181	2017.09.19 13:32:04.015315132	0000678	
85	0.000411	-0.000395	-9.955407E-5	-5.436447E-5	T	29181	2017.09.19 13:32:04.025315132	0000678	
85	0.000428	-0.000414	-0.000104	-3.018995E-5	T	29181	2017.09.19 13:32:04.035315132	0000678	
85	0.000440	-0.000423	-0.000118	-2.505874E-5	T	29181	2017.09.19 13:32:04.045315132	0000678	
85	0.000421	-0.000408	-9.929034E-5	-3.025143E-5	T	29181	2017.09.19 13:32:04.055315132	0000678	
86	0.000427	-0.000414	-9.530821E-5	-4.922650E-5	T	29187	2017.09.19 13:32:04.165402632	0000678	
86	0.000439	-0.000423	-0.000113	-3.507907E-5	T	29187	2017.09.19 13:32:04.175402632	0000678	
86	0.000435	-0.000423	-9.914414E-5	-3.513717E-5	T	29187	2017.09.19 13:32:04.185402632	0000678	
86	0.000463	-0.000447	-0.000113	-4.888297E-5	T	29187	2017.09.19 13:32:04.195402632	0000678	
86	0.000422	-0.000408	-0.000104	-2.023109E-5	T	29187	2017.09.19 13:32:04.205402632	0000678	
86	0.000416	-0.000403	-9.932952E-5	-2.529237E-5	T	29187	2017.09.19 13:32:04.215402632	0000678	
86	0.000431	-0.000418	-0.000104	-6.150216E-6	T	29187	2017.09.19 13:32:04.225402632	0000678	
86	0.000411	-0.000395	-0.000109	-3.032397E-5	T	29187	2017.09.19 13:32:04.235402632	0000678	
86	0.000463	-0.000447	-0.000118	-2.486323E-5	T	29187	2017.09.19 13:32:04.245402632	0000678	
86	0.000434	-0.000419	-0.000113	-2.011228E-5	T	29187	2017.09.19 13:32:04.255402632	0000678	
87	0.000434	-0.000422	-9.904687E-5	-1.113817E-5	T	29185	2017.09.19 13:32:04.365490132	0000678	
87	0.000455	-0.000446	-8.978248E-5	-1.597980E-5	T	29185	2017.09.19 13:32:04.375490132	0000678	
87	0.000394	-0.000384	-8.552006E-5	-1.650562E-5	T	29185	2017.09.19 13:32:04.385490132	0000678	
87	0.000427	-0.000409	-0.000109	-5.920871E-5	T	29185	2017.09.19 13:32:04.395490132	0000678	
87	0.000435	-0.000422	-0.000104	-1.611721E-5	T	29185	2017.09.19 13:32:04.405490132	0000678	
87	0.000416	-0.000404	-9.042750E-5	-4.932871E-5	T	29185	2017.09.19 13:32:04.415490132	0000678	
87	0.000445	-0.000428	-0.000118	-3.901742E-5	T	29185	2017.09.19 13:32:04.425490132	0000678	
87	0.000439	-0.000427	-9.896715E-5	-6.097650E-6	T	29185	2017.09.19 13:32:04.435490132	0000678	
87	0.000447	-0.000428	-0.000123	-4.399646E-5	T	29185	2017.09.19 13:32:04.445490132	0000678	
87	0.000414	-0.000403	-8.538737E-5	-3.934988E-5	T	29185	2017.09.19 13:32:04.455490132	0000678	
88	0.000436	-0.000423	-9.916035E-5	-3.913700E-5	T	29191	2017.09.19 13:32:04.565577632	0000678	
88	0.000435	-0.000422	-0.000104	-1.611721E-5	T	29191	2017.09.19 13:32:04.575577632	0000678	
88	0.000434	-0.000419	-0.000104	-4.914842E-5	T	29191	2017.09.19 13:32:04.585577632	0000678	
88	0.000411	-0.000395	-0.000105	-4.434414E-5	T	29191	2017.09.19 13:32:04.595577632	0000678	
88	0.000428	-0.000418	-9.009514E-5	-1.120811E-5	T	29191	2017.09.19 13:32:04.605577632	0000678	
88	0.000409	-0.000399	-9.026431E-5	2.636527E-6	T	29191	2017.09.19 13:32:04.615577632	0000678	
88	0.000441	-0.000427	-0.000109	-1.605573E-5	T	29191	2017.09.19 13:32:04.625577632	0000678	
88	0.000413	-0.000403	-8.533063E-5	-2.535047E-5	T	29191	2017.09.19 13:32:04.635577632	0000678	
88	0.000427	-0.000418	-7.125065E-5	-4.928537E-5	T	29191	2017.09.19 13:32:04.645577632	0000678	
88	0.000429	-0.000413	-0.000113	-1.115339E-5	T	29191	2017.09.19 13:32:04.655577632	0000678	
89	0.000412	-0.000399	-9.935682E-5	-2.032516E-5	T	29189	2017.09.19 13:32:04.765665132	0000678	
89	0.000440	-0.000423	-0.000113	-4.407869E-5	T	29189	2017.09.19 13:32:04.775665132	0000678	
89	0.000418	-0.000408	-9.021404E-5	-1.128957E-5	T	29189	2017.09.19 13:32:04.785665132	0000678	
89	0.000423	-0.000409	-0.000104	-3.523047E-5	T	29189	2017.09.19 13:32:04.795665132	0000678	
89	0.000455	-0.000441	-0.000109	-1.094189E-5	T	29189	2017.09.19 13:32:04.805665132	0000678	
89	0.000419	-0.000404	-0.000109	-3.025066E-5	T	29189	2017.09.19 13:32:04.815665132	0000678	
89	0.000411	-0.000395	-9.955407E-5	-5.436447E-5	T	29189	2017.09.19 13:32:04.825665132	0000678	
89	0.000456	-0.000441	-0.000113	-1.092529E-5	T	29189	2017.09.19 13:32:04.835665132	0000678	
89	0.000427	-0.000413	-0.000104	-2.519015E-5	T	29189	2017.09.19 13:32:04.845665132	0000678	
89	0.000416	-0.000403	-9.929304E-5	-1.629274E-5	T	29189	2017.09.19 13:32:04.855665132	0000678	
90	0.000410	-0.000395	-9.059126E-5	-6.340145E-5	T	29187	2017.09.19 13:32:04.965752632	0000678	
90	0.000414	-0.000399	-0.000109	-1.628383E-5	T	29187	2017.09.19 13:32:04.975752632	0000678	
90	0.000428	-0.000418	-9.009514E-5	-1.120811E-5	T	29187	2017.09.19 13:32:04.985752632	0000678	
90	0.000414	-0.000399	-0.000109	-1.628383E-5	T	29187	2017.09.19 13:32:04.995752632	0000678	
90	0.000441	-0.000423	-0.000123	-2.003820E-5	T	29187	2017.09.19 13:32:05.005752632	0000678	
90	0.000462	-0.000442	-0.000128	-4.386166E-5	T	29187	2017.09.19 13:32:05.015752632	0000678	
90	0.000417	-0.000403	-0.000104	-2.027183E-5	T	29187	2017.09.19 13:32:05.025752632	0000678	
90	0.000460	-0.000442	-0.000128	-1.086304E-5	T	29187	2017.09.19 13:32:05.035752632	0000678	
90	0.000436	-0.000422	-0.000104	-2.011705E-5	T	29187	2017.09.19 13:32:05.045752632	0000678	
90	0.000406	-0.000390	-0.000110	-3.036471E-5	T	29187	2017.09.19 13:32:05.055752632	0000678	
91	0.000473	-0.000460	-0.000109	-1.578690E-5	T	29184	2017.09.19 13:32:05.165840132	0000678	
91	0.000415	-0.000395	-0.000110	-6.332260E-5	T	29184	2017.09.19 13:32:05.175840132	0000678	
91	0.000424	-0.000409	-0.000109	-3.520972E-5	T	29184	2017.09.19 13:32:05.185840132	0000678	
91	0.000434	-0.000419	-0.000113	-2.511207E-5	T	29184	2017.09.19 13:32:05.195840132	0000678	
91	0.000448	-0.000437	-8.994623E-5	-3.005253E-5	T	29184	2017.09.19 13:32:05.205840132	0000678	
91	0.000439	-0.000419	-0.000123	-4.406978E-5	T	29184	2017.09.19 13:32:05.215840132	0000678	
91	0.000409	-0.000399	-9.030078E-5	-6.363097E-6	T	29184	2017.09.19 13:32:05.225840132	0000678	
91	0.000438	-0.000427	-9.500800E-5	-1.611383E-5	T	29184	2017.09.19 13:32:05.235840132	0000678	
91	0.000434	-0.000422	-9.904687E-5	-1.113817E-5	T	29184	2017.09.19 13:32:05.245840132	0000678	
91	0.000428	-0.000418	-8.519280E-5	-3.522786E-5	T	29184	2017.09.19 13:32:05.255840132	0000678	
92	0.000456	-0.000442	-0.000113	-1.592508E-5	T	29174	2017.09.19 13:32:05.365927632	0000678	
92	0.000421	-0.000408	-9.532713E-5	-3.926765E-5	T	29174	2017.09.19 13:32:05.375927632	0000678	
92	0.000451	-0.000438	-0.000109	-1.997410E-5	T	29174	2017.09.19 13:32:05.385927632	0000678	
92	0.000424	-0.000413	-9.511772E-5	-2.228466E-6	T	29174	2017.09.19 13:32:05.395927632	0000678	
92	0.000444	-0.000432	-9.894823E-5	-1.605650E-5	T	29174	2017.09.19 13:32:05.405927632	0000678	
92	0.000444	-0.000432	-9.898471E-5	-2.505612E-5	T	29174	2017.09.19 13:32:05.415927632	0000678	
92	0.000415	-0.000400	-0.000109	-2.028366E-5	T	29174	2017.09.19 13:32:05.425927632	0000678	
92	0.000382	-0.000370	-9.068613E-5	-1.659892E-5	T	29174	2017.09.19 13:32:05.435927632	0000678	
92	0.000437	-0.000419	-0.000123	-2.007078E-5	T	29174	2017.09.19 13:32:05.445927632	0000678	
92	0.000449	-0.000437	-0.000104	4.004145E-6	T	29174	2017.09.19 13:32:05.455927632	0000678	
93	0.000438	-0.000423	-0.000113	-2.507949E-5	T	29187	2017.09.19 13:32:05.566015132	0000678	
93	0.000435	-0.000422	-9.912387E-5	-3.013738E-5	T	29187	2017.09.19 13:32:05.576015132	0000678	
93	0.000414	-0.000400	-9.943382E-5	-3.932437E-5	T	29187	2017.09.19 13:32:05.586015132	0000678	
93	0.000428	-0.000413	-0.000109	-1.116999E-5	T	29187	2017.09.19 13:32:05.596015132	0000678	
93	0.000412	-0.000395	-0.000113	-3.030737E-5	T	29187	2017.09.19 13:32:05.606015132	0000678	
93	0.000446	-0.000433	-9.012322E-5	-5.909205E-5	T	29187	2017.09.19 13:32:05.616015132	0000678	
93	0.000455	-0.000441	-0.000109	-1.094189E-5	T	29187	2017.09.19 13:32:05.626015132	0000678	
93	0.000437	-0.000427	-8.508579E-5	-3.515454E-5	T	29187	2017.09.19 13:32:05.636015132	0000678	
93	0.000429	-0.000414	-0.000113	-1.615318E-5	T	29187	2017.09.19 13:32:05.646015132	0000678	
93	0.000433	-0.000422	-8.518172E-5	-4.419489E-5	T	29187	2017.09.19 13:32:05.656015132	0000678	
94	0.000407	-0.000390	-0.000110	-3.936433E-5	T	29175	2017.09.19 13:32:05.766102632	0000678	
94	0.000424	-0.000404	-0.000113	-5.923285E-5	T	29175	2017.09.19 13:32:05.776102632	0000678	
94	0.000394	-0.000380	-9.956652E-5	-1.648011E-5	T	29175	2017.09.19 13:32:05.786102632	0000678	
94	0.000412	-0.000399	-9.937708E-5	-2.532495E-5	T	29175	2017.09.19 13:32:05.796102632	0000678	
94	0.000420	-0.000404	-0.000109	-3.925028E-5	T	29175	2017.09.19 13:32:05.806102632	0000678	
94	0.000449	-0.000433	-0.000118	-2.497727E-5	T	29175	2017.09.19 13:32:05.816102632	0000678	
94	0.000445	-0.000437	-8.486962E-5	-1.107408E-5	T	29175	2017.09.19 13:32:05.826102632	0000678	
94	0.000410	-0.000390	-0.000119	-4.932656E-5	T	29175	2017.09.19 13:32:05.836102632	0000678	
94	0.000412	-0.000399	-9.539766E-5	-3.034134E-5	T	29175	2017.09.19 13:32:05.846102632	0000678	
94	0.000439	-0.000423	-0.000113	-3.507907E-5	T	29175	2017.09.19 13:32:05.856102632	0000678	
95	0.000426	-0.000409	-0.000113	-4.419274E-5	T	29180	2017.09.19 13:32:05.966190132	0000678	
95	0.000408	-0.000390	-0.000119	-3.032736E-5	T	29180	2017.09.19 13:32:05.976190132	0000678	
95	0.000455	-0.000442	-0.000104	-3.896147E-5	T	29180	2017.09.19 13:32:05.986190132	0000678	
95	0.000463	-0.000451	-0.000104	-1.088118E-5	T	29180	2017.09.19 13:32:05.996190132	0000678	
95	0.000425	-0.000409	-0.000109	-4.420934E-5	T	29180	2017.09.19 13:32:06.006190132	0000678	
95	0.000414	-0.000399	-0.000109	-1.628383E-5	T	29180	2017.09.19 13:32:06.016190132	0000678	
95	0.000436	-0.000423	-9.916035E-5	-3.913700E-5	T	29180	2017.09.19 13:32:06.026190132	0000678	
95	0.000422	-0.000409	-9.536766E-5	-4.926723E-5	T	29180	2017.09.19 13:32:06.036190132	0000678	
95	0.000451	-0.000433	-0.000123	-2.495652E-5	T	29180	2017.09.19 13:32:06.046190132	0000678	
95	0.000422	-0.000408	-0.000104	-1.123147E-5	T	29180	2017.09.19 13:32:06.056190132	0000678	
96	0.000439	-0.000427	-9.892662E-5	3.901932E-6	T	29182	2017.09.19 13:32:06.166277632	0000678	
96	0.000437	-0.000423	-9.920088E-5	-4.913658E-5	T	29182	2017.09.19 13:32:06.176277632	0000678	
96	0.000426	-0.000409	-0.000118	-2.517278E-5	T	29182	2017.09.19 13:32:06.186277632	0000678	
96	0.000419	-0.000400	-0.000110	-6.328186E-5	T	29182	2017.09.19 13:32:06.196277632	0000678	
96	0.000435	-0.000419	-0.000109	-4.412788E-5	T	29182	2017.09.19 13:32:06.206277632	0000678	
96	0.000442	-0.000427	-0.000113	-1.103934E-5	T	29182	2017.09.19 13:32:06.216277632	0000678	
96	0.000444	-0.000428	-0.000109	-4.405456E-5	T	29182	2017.09.19 13:32:06.226277632	0000678	
96	0.000433	-0.000414	-0.000128	-1.609093E-5	T	29182	2017.09.19 13:32:06.236277632	0000678	
96	0.000397	-0.000384	-9.059667E-5	-3.548408E-5	T	29182	2017.09.19 13:32:06.246277632	0000678	
96	0.000419	-0.000403	-0.000113	-1.123485E-5	T	29182	2017.09.19 13:32:06.256277632	0000678	
97	0.000396	-0.000384	-9.547874E-5	-6.464541E-6	T	29188	2017.09.19 13:32:06.366365132	0000678	
97	0.000450	-0.000438	-9.898200E-5	-3.901481E-5	T	29188	2017.09.19 13:32:06.376365132	0000678	
97	0.000438	-0.000419	-0.000113	-5.911065E-5	T	29188	2017.09.19 13:32:06.386365132	0000678	
97	0.000401	-0.000381	-0.000119	-3.940030E-5	T	29188	2017.09.19 13:32:06.396365132	0000678	
97	0.000429	-0.000414	-0.000109	-3.516899E-5	T	29188	2017.09.19 13:32:06.406365132	0000678	
97	0.000430	-0.000422	-8.010511E-5	-2.521644E-5	T	29188	2017.09.19 13:32:06.416365132	0000678	
97	0.000441	-0.000423	-0.000118	-3.905815E-5	T	29188	2017.09.19 13:32:06.426365132	0000678	
97	0.000385	-0.000375	-8.560681E-5	-1.157915E-5	T	29188	2017.09.19 13:32:06.436365132	0000678	
97	0.000457	-0.000438	-0.000113	-6.295570E-5	T	29188	2017.09.19 13:32:06.446365132	0000678	
97	0.000441	-0.000428	-9.514175E-5	-4.911245E-5	T	29188	2017.09.19 13:32:06.456365132	0000678	
98	0.000449	-0.000433	-9.915899E-5	-6.805433E-5	T	29184	2017.09.19 13:32:06.566452632	0000678	
98	0.000441	-0.000427	-0.000109	-6.056149E-6	T	29184	2017.09.19 13:32:06.576452632	0000678	
98	0.000413	-0.000395	-0.000114	-4.430679E-5	T	29184	2017.09.19 13:32:06.586452632	0000678	
98	0.000450	-0.000437	-0.000104	-2.499464E-5	T	29184	2017.09.19 13:32:06.596452632	0000678	
98	0.000438	-0.000423	-0.000104	-4.411604E-5	T	29184	2017.09.19 13:32:06.606452632	0000678	
98	0.000437	-0.000419	-0.000123	-2.507057E-5	T	29184	2017.09.19 13:32:06.616452632	0000678	
98	0.000426	-0.000409	-9.048559E-5	-7.828677E-5	T	29184	2017.09.19 13:32:06.626452632	0000678	
98	0.000433	-0.000414	-0.000109	-6.316782E-5	T	29184	2017.09.19 13:32:06.636452632	0000678	
98	0.000426	-0.000413	-9.923089E-5	-3.021070E-5	T	29184	2017.09.19 13:32:06.646452632	0000678	
98	0.000465	-0.000452	-0.000104	-3.488018E-5	T	29184	2017.09.19 13:32:06.656452632	0000678	
99	0.000408	-0.000390	-0.000105	-5.938424E-5	T	29195	2017.09.19 13:32:06.766540132	0000678	
99	0.000417	-0.000400	-0.000104	-5.430299E-5	T	29195	2017.09.19 13:32:06.776540132	0000678	
99	0.000419	-0.000404	-0.000109	-3.025066E-5	T	29195	2017.09.19 13:32:06.786540132	0000678	
99	0.000415	-0.000400	-0.000109	-2.028366E-5	T	29195	2017.09.19 13:32:06.796540132	0000678	
99	0.000447	-0.000433	-9.910225E-5	-5.405491E-5	T	29195	2017.09.19 13:32:06.806540132	0000678	
99	0.000443	-0.000423	-0.000123	-4.903698E-5	T	29195	2017.09.19 13:32:06.816540132	0000678	
99	0.000424	-0.000413	-8.528873E-5	-4.426821E-5	T	29195	2017.09.19 13:32:06.826540132	0000678	
99	0.000433	-0.000419	-9.924844E-5	-4.916917E-5	T	29195	2017.09.19 13:32:06.836540132	0000678	
99	0.000415	-0.000400	-9.551520E-5	-5.934013E-5	T	29195	2017.09.19 13:32:06.846540132	0000678	
99	0.000445	-0.000428	-0.000118	-3.001780E-5	T	29195	2017.09.19 13:32:06.856540132	0000678	
100	0.000427	-0.000413	-0.000104	-2.519015E-5	T	29192	2017.09.19 13:32:06.966627632	0000678	
100	0.000451	-0.000433	-0.000118	-4.897627E-5	T	29192	2017.09.19 13:32:06.976627632	0000678	
100	0.000427	-0.000414	-9.925115E-5	-3.521049E-5	T	29192	2017.09.19 13:32:06.986627632	0000678	
100	0.000417	-0.000404	-9.938626E-5	-3.929178E-5	T	29192	2017.09.19 13:32:06.996627632	0000678	
100	0.000414	-0.000403	-9.523256E-5	-1.309970E-6	T	29192	2017.09.19 13:32:07.006627632	0000678	
100	0.000413	-0.000403	-8.531036E-5	-2.035068E-5	T	29192	2017.09.19 13:32:07.016627632	0000678	
100	0.000436	-0.000422	-0.000109	-7.096839E-6	T	29192	2017.09.19 13:32:07.026627632	0000678	
100	0.000424	-0.000413	-9.515419E-5	-1.122809E-5	T	29192	2017.09.19 13:32:07.036627632	0000678	
100	0.000431	-0.000418	-0.000104	-1.150425E-6	T	29192	2017.09.19 13:32:07.046627632	0000678	
100	0.000430	-0.000414	-0.000118	-1.613243E-5	T	29192	2017.09.19 13:32:07.056627632	0000678	
101	0.000436	-0.000419	-0.000109	-4.912767E-5	T	29189	2017.09.19 13:32:07.166715132	0000678	
101	0.000411	-0.000399	-9.534092E-5	-1.634193E-5	T	29189	2017.09.19 13:32:07.176715132	0000678	
101	0.000432	-0.000419	-9.922818E-5	-4.416938E-5	T	29189	2017.09.19 13:32:07.186715132	0000678	
101	0.000456	-0.000442	-0.000109	-3.494089E-5	T	29189	2017.09.19 13:32:07.196715132	0000678	
101	0.000436	-0.000422	-0.000104	-2.511684E-5	T	29189	2017.09.19 13:32:07.206715132	0000678	
101	0.000455	-0.000441	-0.000109	-5.942101E-6	T	29189	2017.09.19 13:32:07.216715132	0000678	
101	0.000421	-0.000404	-0.000109	-4.425007E-5	T	29189	2017.09.19 13:32:07.226715132	0000678	
101	0.000452	-0.000441	-9.485775E-5	-1.999962E-5	T	29189	2017.09.19 13:32:07.236715132	0000678	
101	0.000438	-0.000423	-0.000113	-1.607986E-5	T	29189	2017.09.19 13:32:07.246715132	0000678	
101	0.000403	-0.000389	-9.951625E-5	-3.040621E-5	T	29189	2017.09.19 13:32:07.256715132	0000678	
