Block	B	Bx	By	Bz	Units	Temperature	Timestamp	Serial No.	Comment
0	0.000113	-0.000104	1.907708E-5	-3.822585E-5	T	29477	2017.09.19 14:26:12.185790132	0000678	
0	0.000113	-0.000104	1.907708E-5	-3.822585E-5	T	29477	2017.09.19 14:26:12.195790132	0000678	
0	8.442748E-5	-7.610474E-5	1.476474E-5	-3.343756E-5	T	29477	2017.09.19 14:26:12.205790132	0000678	
0	9.192388E-5	-8.003859E-5	2.379132E-5	-3.844212E-5	T	29477	2017.09.19 14:26:12.215790132	0000678	
0	0.000113	-0.000104	1.506118E-5	-4.220909E-5	T	29477	2017.09.19 14:26:12.225790132	0000678	
0	0.000109	-9.917611E-5	1.500173E-5	-4.224982E-5	T	29477	2017.09.19 14:26:12.235790132	0000678	
0	0.000130	-0.000118	2.920627E-5	-4.715293E-5	T	29477	2017.09.19 14:26:12.245790132	0000678	
0	0.000101	-9.012962E-5	1.889441E-5	-4.233974E-5	T	29477	2017.09.19 14:26:12.255790132	0000678	
0	0.000105	-0.000104	5.195722E-6	-9.168966E-6	T	29477	2017.09.19 14:26:12.265790132	0000678	
0	0.000147	-0.000132	1.531305E-5	-6.198015E-5	T	29477	2017.09.19 14:26:12.275790132	0000678	
1	0.000120	-0.000113	2.420396E-5	-3.317350E-5	T	29475	2017.09.19 14:26:12.385877632	0000678	
1	0.000141	-0.000128	2.930491E-5	-5.207126E-5	T	29475	2017.09.19 14:26:12.395877632	0000678	
1	0.000114	-0.000113	1.530194E-5	-9.137150E-6	T	29475	2017.09.19 14:26:12.405877632	0000678	
1	0.000120	-0.000113	1.518441E-5	-3.813594E-5	T	29475	2017.09.19 14:26:12.415877632	0000678	
1	0.000116	-0.000109	1.915680E-5	-3.318533E-5	T	29475	2017.09.19 14:26:12.425877632	0000678	
1	0.000113	-0.000104	2.407669E-5	-3.824660E-5	T	29475	2017.09.19 14:26:12.435877632	0000678	
1	0.000104	-9.017059E-5	1.887414E-5	-4.733953E-5	T	29475	2017.09.19 14:26:12.445877632	0000678	
1	0.000104	-7.626847E-5	2.363028E-5	-6.647353E-5	T	29475	2017.09.19 14:26:12.455877632	0000678	
1	0.000141	-0.000137	2.452985E-5	-2.297840E-5	T	29475	2017.09.19 14:26:12.465877632	0000678	
1	9.726253E-5	-8.985535E-5	2.897063E-5	-2.338203E-5	T	29475	2017.09.19 14:26:12.475877632	0000678	
2	0.000113	-0.000104	1.506118E-5	-4.220909E-5	T	29476	2017.09.19 14:26:12.585965132	0000678	
2	7.788453E-5	-7.145294E-5	-2.423489E-5	-1.931703E-5	T	29476	2017.09.19 14:26:12.595965132	0000678	
2	0.000106	-9.885441E-5	2.907764E-5	-2.330871E-5	T	29476	2017.09.19 14:26:12.605965132	0000678	
2	0.000104	-9.888092E-5	2.409424E-5	-1.928813E-5	T	29476	2017.09.19 14:26:12.615965132	0000678	
2	0.000134	-0.000132	1.548733E-5	-1.898195E-5	T	29476	2017.09.19 14:26:12.625965132	0000678	
2	0.000139	-0.000132	1.941000E-5	-3.799776E-5	T	29476	2017.09.19 14:26:12.635965132	0000678	
2	0.000110	-9.906940E-5	2.400102E-5	-4.228717E-5	T	29476	2017.09.19 14:26:12.645965132	0000678	
2	0.000122	-0.000113	1.916788E-5	-4.215237E-5	T	29476	2017.09.19 14:26:12.655965132	0000678	
2	0.000138	-0.000123	5.206823E-6	-6.201197E-5	T	29476	2017.09.19 14:26:12.665965132	0000678	
2	0.000129	-0.000118	5.187903E-6	-5.205312E-5	T	29476	2017.09.19 14:26:12.675965132	0000678	
3	0.000140	-0.000128	1.930570E-5	-5.202976E-5	T	29469	2017.09.19 14:26:12.786052632	0000678	
3	0.000120	-9.547346E-5	9.837030E-6	-7.126044E-5	T	29469	2017.09.19 14:26:12.796052632	0000678	
3	0.000131	-0.000114	1.072026E-6	-6.607667E-5	T	29469	2017.09.19 14:26:12.806052632	0000678	
3	0.000101	-9.522134E-5	4.991439E-6	-3.324128E-5	T	29469	2017.09.19 14:26:12.816052632	0000678	
3	0.000119	-0.000104	5.001177E-6	-5.716696E-5	T	29469	2017.09.19 14:26:12.826052632	0000678	
3	0.000143	-0.000128	1.026588E-5	-6.199199E-5	T	29469	2017.09.19 14:26:12.836052632	0000678	
3	0.000124	-0.000113	1.914761E-5	-4.715216E-5	T	29469	2017.09.19 14:26:12.846052632	0000678	
3	0.000128	-9.068897E-5	4.700966E-6	-9.027963E-5	T	29469	2017.09.19 14:26:12.856052632	0000678	
3	0.000116	-0.000109	2.917627E-5	-2.822704E-5	T	29469	2017.09.19 14:26:12.866052632	0000678	
3	9.635352E-5	-8.982257E-5	2.898684E-5	-1.938220E-5	T	29469	2017.09.19 14:26:12.876052632	0000678	
4	0.000122	-8.548252E-5	1.866068E-5	-8.537867E-5	T	29472	2017.09.19 14:26:12.986140132	0000678	
4	0.000127	-0.000113	1.010779E-5	-5.711439E-5	T	29472	2017.09.19 14:26:12.996140132	0000678	
4	0.000127	-0.000118	1.922733E-5	-4.211164E-5	T	29472	2017.09.19 14:26:13.006140132	0000678	
4	0.000144	-0.000132	1.033370E-5	-5.695961E-5	T	29472	2017.09.19 14:26:13.016140132	0000678	
4	0.000104	-9.906138E-5	1.505848E-5	-2.825040E-5	T	29472	2017.09.19 14:26:13.026140132	0000678	
4	9.219544E-5	-9.015455E-5	9.890464E-7	-1.926600E-5	T	29472	2017.09.19 14:26:13.036140132	0000678	
4	0.000102	-9.510277E-5	1.499065E-5	-3.328278E-5	T	29472	2017.09.19 14:26:13.046140132	0000678	
4	0.000153	-0.000137	2.437179E-5	-6.197677E-5	T	29472	2017.09.19 14:26:13.056140132	0000678	
4	9.803061E-5	-8.527782E-5	9.815401E-6	-4.734291E-5	T	29472	2017.09.19 14:26:13.066140132	0000678	
4	8.878063E-5	-8.508114E-5	9.912674E-6	-2.334391E-5	T	29472	2017.09.19 14:26:13.076140132	0000678	
5	0.000113	-0.000109	5.178165E-6	-2.812744E-5	T	29466	2017.09.19 14:26:13.186227632	0000678	
5	0.000118	-0.000104	1.902034E-5	-5.222527E-5	T	29466	2017.09.19 14:26:13.196227632	0000678	
5	0.000123	-9.906731E-5	3.791886E-5	-6.234443E-5	T	29466	2017.09.19 14:26:13.206227632	0000678	
5	0.000132	-0.000128	1.040368E-5	-2.799341E-5	T	29466	2017.09.19 14:26:13.216227632	0000678	
5	0.000102	-8.521209E-5	1.879443E-5	-5.238005E-5	T	29466	2017.09.19 14:26:13.226227632	0000678	
5	7.935364E-5	-7.147770E-5	-3.319365E-5	-9.280093E-6	T	29466	2017.09.19 14:26:13.236227632	0000678	
5	0.000113	-0.000109	1.017777E-5	-2.814819E-5	T	29466	2017.09.19 14:26:13.246227632	0000678	
5	0.000103	-9.520303E-5	9.970779E-6	-3.826182E-5	T	29466	2017.09.19 14:26:13.256227632	0000678	
5	9.009439E-5	-8.014530E-5	1.479203E-5	-3.840477E-5	T	29466	2017.09.19 14:26:13.266227632	0000678	
5	0.000137	-0.000128	1.532628E-5	-4.701337E-5	T	29466	2017.09.19 14:26:13.276227632	0000678	
6	0.000153	-0.000151	1.069742E-5	-2.280625E-5	T	29480	2017.09.19 14:26:13.386315132	0000678	
6	0.000109	-0.000104	1.511793E-5	-2.820967E-5	T	29480	2017.09.19 14:26:13.396315132	0000678	
6	0.000112	-9.937663E-5	4.961992E-6	-5.220790E-5	T	29480	2017.09.19 14:26:13.406315132	0000678	
6	0.000107	-0.000104	1.515440E-5	-1.921005E-5	T	29480	2017.09.19 14:26:13.416315132	0000678	
6	0.000120	-0.000113	1.018480E-5	-3.811519E-5	T	29480	2017.09.19 14:26:13.426315132	0000678	
6	0.000104	-9.042499E-5	8.552967E-7	-5.226462E-5	T	29480	2017.09.19 14:26:13.436315132	0000678	
6	0.000106	-0.000104	1.015480E-5	-1.918930E-5	T	29480	2017.09.19 14:26:13.446315132	0000678	
6	0.000122	-0.000109	3.411913E-5	-4.224721E-5	T	29480	2017.09.19 14:26:13.456315132	0000678	
6	0.000113	-0.000109	2.925328E-5	-9.227835E-6	T	29480	2017.09.19 14:26:13.466315132	0000678	
6	7.122500E-5	-6.110630E-5	1.458639E-5	-3.355975E-5	T	29480	2017.09.19 14:26:13.476315132	0000678	
7	0.000115	-0.000104	2.406047E-5	-4.224644E-5	T	29484	2017.09.19 14:26:13.586402632	0000678	
7	0.000102	-8.505255E-5	2.881390E-5	-4.742176E-5	T	29484	2017.09.19 14:26:13.596402632	0000678	
7	0.000124	-9.914752E-5	3.390296E-5	-6.632767E-5	T	29484	2017.09.19 14:26:13.606402632	0000678	
7	0.000138	-0.000129	-1.867104E-5	-4.687227E-5	T	29484	2017.09.19 14:26:13.616402632	0000678	
7	0.000115	-0.000104	1.004131E-5	-4.718813E-5	T	29484	2017.09.19 14:26:13.626402632	0000678	
7	0.000128	-0.000119	-2.376928E-5	-4.193319E-5	T	29484	2017.09.19 14:26:13.636402632	0000678	
7	0.000112	-0.000109	1.519764E-5	-2.316915E-5	T	29484	2017.09.19 14:26:13.646402632	0000678	
7	0.000132	-0.000113	2.908603E-5	-6.219304E-5	T	29484	2017.09.19 14:26:13.656402632	0000678	
7	0.000102	-9.495509E-5	2.401020E-5	-2.832034E-5	T	29484	2017.09.19 14:26:13.666402632	0000678	
7	0.000123	-0.000113	3.420317E-5	-3.321500E-5	T	29484	2017.09.19 14:26:13.676402632	0000678	
8	0.000130	-0.000123	1.930299E-5	-3.807107E-5	T	29476	2017.09.19 14:26:13.786490132	0000678	
8	0.000120	-9.923330E-5	2.391996E-5	-6.228633E-5	T	29476	2017.09.19 14:26:13.796490132	0000678	
8	0.000119	-0.000113	2.422423E-5	-2.817371E-5	T	29476	2017.09.19 14:26:13.806490132	0000678	
8	0.000110	-9.927637E-5	9.981862E-6	-4.722886E-5	T	29476	2017.09.19 14:26:13.816490132	0000678	
8	0.000131	-0.000123	2.430260E-5	-3.809182E-5	T	29476	2017.09.19 14:26:13.826490132	0000678	
8	9.731393E-5	-9.486686E-5	1.908355E-5	-1.030034E-5	T	29476	2017.09.19 14:26:13.836490132	0000678	
8	0.000128	-0.000123	5.324361E-6	-3.301318E-5	T	29476	2017.09.19 14:26:13.846490132	0000678	
8	0.000142	-0.000123	3.420454E-5	-6.213232E-5	T	29476	2017.09.19 14:26:13.856490132	0000678	
8	0.000115	-0.000104	1.504092E-5	-4.720888E-5	T	29476	2017.09.19 14:26:13.866490132	0000678	
8	0.000122	-0.000104	9.980517E-6	-6.218750E-5	T	29476	2017.09.19 14:26:13.876490132	0000678	
9	0.000110	-9.933565E-5	4.982257E-6	-4.720811E-5	T	29470	2017.09.19 14:26:13.986577632	0000678	
9	0.000116	-9.929904E-5	1.494094E-5	-5.724919E-5	T	29470	2017.09.19 14:26:13.996577632	0000678	
9	0.000126	-0.000123	2.442013E-5	-9.093037E-6	T	29470	2017.09.19 14:26:14.006577632	0000678	
9	0.000127	-0.000123	1.034423E-5	-2.803414E-5	T	29470	2017.09.19 14:26:14.016577632	0000678	
9	0.000121	-0.000113	1.169299E-6	-4.207767E-5	T	29470	2017.09.19 14:26:14.026577632	0000678	
9	0.000132	-0.000128	5.383811E-6	-3.297245E-5	T	29470	2017.09.19 14:26:14.036577632	0000678	
9	0.000119	-9.526650E-5	2.385619E-5	-6.631875E-5	T	29470	2017.09.19 14:26:14.046577632	0000678	
9	0.000116	-0.000113	1.024560E-5	-2.311581E-5	T	29470	2017.09.19 14:26:14.056577632	0000678	
9	0.000131	-0.000128	5.404077E-6	-2.797266E-5	T	29470	2017.09.19 14:26:14.066577632	0000678	
9	0.000112	-9.535873E-5	9.893772E-6	-5.726103E-5	T	29470	2017.09.19 14:26:14.076577632	0000678	
10	0.000128	-0.000104	1.894333E-5	-7.122448E-5	T	29475	2017.09.19 14:26:14.186665132	0000678	
10	0.000108	-0.000104	1.011832E-5	-2.818892E-5	T	29475	2017.09.19 14:26:14.196665132	0000678	
10	9.270922E-5	-8.495613E-5	2.389130E-5	-2.840180E-5	T	29475	2017.09.19 14:26:14.206665132	0000678	
10	0.000125	-0.000113	5.128453E-6	-5.209385E-5	T	29475	2017.09.19 14:26:14.216665132	0000678	
10	0.000111	-9.916966E-5	1.898115E-5	-4.726621E-5	T	29475	2017.09.19 14:26:14.226665132	0000678	
10	0.000120	-0.000113	2.420396E-5	-3.317350E-5	T	29475	2017.09.19 14:26:14.236665132	0000678	
10	9.124144E-5	-9.011358E-5	1.009312E-6	-1.426621E-5	T	29475	2017.09.19 14:26:14.246665132	0000678	
10	0.000112	-0.000109	1.519764E-5	-2.316915E-5	T	29475	2017.09.19 14:26:14.256665132	0000678	
10	0.000136	-0.000118	2.414587E-5	-6.213155E-5	T	29475	2017.09.19 14:26:14.266665132	0000678	
10	0.000104	-8.525306E-5	1.877416E-5	-5.737984E-5	T	29475	2017.09.19 14:26:14.276665132	0000678	
11	9.097252E-5	-7.621947E-5	1.470800E-5	-4.743697E-5	T	29479	2017.09.19 14:26:14.386752632	0000678	
11	9.954396E-5	-9.474010E-5	2.908682E-5	-9.341884E-6	T	29479	2017.09.19 14:26:14.396752632	0000678	
11	0.000107	-9.527678E-5	9.934302E-6	-4.726144E-5	T	29479	2017.09.19 14:26:14.406752632	0000678	
11	0.000114	-9.539971E-5	9.873507E-6	-6.226082E-5	T	29479	2017.09.19 14:26:14.416752632	0000678	
11	0.000136	-0.000128	1.934623E-5	-4.203018E-5	T	29479	2017.09.19 14:26:14.426752632	0000678	
11	0.000130	-0.000118	1.018751E-5	-5.207387E-5	T	29479	2017.09.19 14:26:14.436752632	0000678	
11	8.745856E-5	-8.485970E-5	1.896871E-5	-9.381846E-6	T	29479	2017.09.19 14:26:14.446752632	0000678	
11	0.000148	-0.000147	5.666465E-6	-1.881826E-5	T	29479	2017.09.19 14:26:14.456752632	0000678	
11	0.000130	-0.000113	3.812585E-5	-5.223080E-5	T	29479	2017.09.19 14:26:14.466752632	0000678	
11	0.000105	-9.517653E-5	1.495417E-5	-4.228240E-5	T	29479	2017.09.19 14:26:14.476752632	0000678	
12	0.000124	-0.000113	1.514793E-5	-4.713556E-5	T	29469	2017.09.19 14:26:14.586840132	0000678	
12	0.000147	-0.000132	2.933221E-5	-5.703846E-5	T	29469	2017.09.19 14:26:14.596840132	0000678	
12	0.000112	-0.000109	2.423341E-5	-1.420688E-5	T	29469	2017.09.19 14:26:14.606840132	0000678	
12	0.000125	-0.000113	1.012806E-5	-5.211460E-5	T	29469	2017.09.19 14:26:14.616840132	0000678	
12	0.000128	-0.000113	1.910708E-5	-5.715174E-5	T	29469	2017.09.19 14:26:14.626840132	0000678	
12	8.602906E-5	-7.589778E-5	2.878390E-5	-2.849587E-5	T	29469	2017.09.19 14:26:14.636840132	0000678	
12	0.000115	-0.000109	1.515711E-5	-3.316873E-5	T	29469	2017.09.19 14:26:14.646840132	0000678	
12	0.000116	-0.000104	3.407590E-5	-3.828811E-5	T	29469	2017.09.19 14:26:14.656840132	0000678	
12	6.964912E-5	-5.720698E-5	9.518956E-6	-3.857138E-5	T	29469	2017.09.19 14:26:14.666840132	0000678	
12	0.000131	-0.000128	1.404392E-6	-2.795606E-5	T	29469	2017.09.19 14:26:14.676840132	0000678	
13	9.629122E-5	-9.022186E-5	4.931989E-6	-3.328201E-5	T	29481	2017.09.19 14:26:14.786927632	0000678	
13	0.000124	-0.000118	1.926381E-5	-3.311202E-5	T	29481	2017.09.19 14:26:14.796927632	0000678	
13	0.000114	-0.000104	1.906087E-5	-4.222569E-5	T	29481	2017.09.19 14:26:14.806927632	0000678	
13	0.000119	-0.000104	5.001177E-6	-5.716696E-5	T	29481	2017.09.19 14:26:14.816927632	0000678	
13	0.000116	-9.929904E-5	1.494094E-5	-5.724919E-5	T	29481	2017.09.19 14:26:14.826927632	0000678	
13	0.000116	-0.000113	-1.873590E-5	-1.899563E-5	T	29481	2017.09.19 14:26:14.836927632	0000678	
13	0.000124	-0.000118	1.926381E-5	-3.311202E-5	T	29481	2017.09.19 14:26:14.846927632	0000678	
13	0.000103	-8.515281E-5	2.379403E-5	-5.240080E-5	T	29481	2017.09.19 14:26:14.856927632	0000678	
13	8.420808E-5	-7.103953E-5	2.368431E-5	-3.851543E-5	T	29481	2017.09.19 14:26:14.866927632	0000678	
13	0.000115	-0.000109	-1.881994E-5	-2.802784E-5	T	29481	2017.09.19 14:26:14.876927632	0000678	
14	9.568176E-5	-8.483756E-5	3.389052E-5	-2.844330E-5	T	29475	2017.09.19 14:26:14.987015132	0000678	
14	0.000124	-0.000118	5.244646E-6	-3.805371E-5	T	29475	2017.09.19 14:26:14.997015132	0000678	
14	0.000140	-0.000132	2.440961E-5	-3.801851E-5	T	29475	2017.09.19 14:26:15.007015132	0000678	
14	0.000108	-9.517007E-5	1.893359E-5	-4.729880E-5	T	29475	2017.09.19 14:26:15.017015132	0000678	
14	0.000154	-0.000142	1.545221E-5	-5.689890E-5	T	29475	2017.09.19 14:26:15.027015132	0000678	
14	0.000106	-8.032734E-5	1.867823E-5	-6.642020E-5	T	29475	2017.09.19 14:26:15.037015132	0000678	
14	9.708244E-5	-9.515403E-5	1.048497E-6	-1.922526E-5	T	29475	2017.09.19 14:26:15.047015132	0000678	
14	0.000132	-0.000118	1.016724E-5	-5.707366E-5	T	29475	2017.09.19 14:26:15.057015132	0000678	
14	0.000117	-9.502675E-5	3.789156E-5	-5.737723E-5	T	29475	2017.09.19 14:26:15.067015132	0000678	
14	0.000122	-0.000118	2.432015E-5	-1.913335E-5	T	29475	2017.09.19 14:26:15.077015132	0000678	
15	0.000142	-0.000137	5.470557E-6	-3.789893E-5	T	29465	2017.09.19 14:26:15.187102632	0000678	
15	0.000126	-0.000123	1.536410E-5	-2.305510E-5	T	29465	2017.09.19 14:26:15.197102632	0000678	
15	0.000116	-0.000109	1.013724E-5	-3.814777E-5	T	29465	2017.09.19 14:26:15.207102632	0000678	
15	0.000142	-0.000132	4.344864E-5	-2.809778E-5	T	29465	2017.09.19 14:26:15.217102632	0000678	
15	0.000119	-0.000113	1.520467E-5	-3.313615E-5	T	29465	2017.09.19 14:26:15.227102632	0000678	
15	0.000107	-0.000104	1.139295E-6	-2.315178E-5	T	29465	2017.09.19 14:26:15.237102632	0000678	
15	0.000132	-0.000128	2.442284E-5	-2.305172E-5	T	29465	2017.09.19 14:26:15.247102632	0000678	
15	0.000109	-0.000104	2.917356E-5	-1.426836E-5	T	29465	2017.09.19 14:26:15.257102632	0000678	
15	0.000122	-0.000118	1.930434E-5	-2.311243E-5	T	29465	2017.09.19 14:26:15.267102632	0000678	
15	0.000107	-0.000104	1.013859E-5	-2.318913E-5	T	29465	2017.09.19 14:26:15.277102632	0000678	
16	0.000119	-0.000104	2.401994E-5	-5.224602E-5	T	29470	2017.09.19 14:26:15.387190132	0000678	
16	0.000130	-0.000123	2.432286E-5	-3.309203E-5	T	29470	2017.09.19 14:26:15.397190132	0000678	
16	0.000120	-0.000104	2.901955E-5	-5.226677E-5	T	29470	2017.09.19 14:26:15.407190132	0000678	
16	0.000121	-9.536675E-5	1.883632E-5	-7.129779E-5	T	29470	2017.09.19 14:26:15.417190132	0000678	
16	0.000138	-0.000132	5.411107E-6	-3.793966E-5	T	29470	2017.09.19 14:26:15.427190132	0000678	
16	8.570881E-5	-7.098025E-5	2.868392E-5	-3.853618E-5	T	29470	2017.09.19 14:26:15.437190132	0000678	
16	8.729834E-5	-7.609829E-5	1.874416E-5	-3.845395E-5	T	29470	2017.09.19 14:26:15.447190132	0000678	
16	0.000112	-0.000104	1.507740E-5	-3.820925E-5	T	29470	2017.09.19 14:26:15.457190132	0000678	
16	9.498421E-5	-9.012160E-5	9.951859E-6	-2.830297E-5	T	29470	2017.09.19 14:26:15.467190132	0000678	
16	0.000125	-0.000113	2.414722E-5	-4.717291E-5	T	29470	2017.09.19 14:26:15.477190132	0000678	
17	0.000134	-0.000118	1.014698E-5	-6.207345E-5	T	29462	2017.09.19 14:26:15.587277632	0000678	
17	0.000107	-0.000104	1.013859E-5	-2.318913E-5	T	29462	2017.09.19 14:26:15.597277632	0000678	
17	0.000117	-0.000113	2.426070E-5	-1.917408E-5	T	29462	2017.09.19 14:26:15.607277632	0000678	
17	0.000107	-9.533607E-5	4.934697E-6	-4.724069E-5	T	29462	2017.09.19 14:26:15.617277632	0000678	
17	0.000108	-8.549281E-5	4.738788E-6	-6.632136E-5	T	29462	2017.09.19 14:26:15.627277632	0000678	
17	0.000112	-0.000109	-2.374659E-5	-1.000784E-5	T	29462	2017.09.19 14:26:15.637277632	0000678	
17	9.433981E-5	-8.021906E-5	1.475556E-5	-4.740439E-5	T	29462	2017.09.19 14:26:15.647277632	0000678	
17	0.000122	-0.000104	4.805858E-5	-4.234604E-5	T	29462	2017.09.19 14:26:15.657277632	0000678	
17	0.000116	-0.000104	1.904060E-5	-4.722548E-5	T	29462	2017.09.19 14:26:15.667277632	0000678	
17	0.000139	-0.000118	1.511011E-5	-7.109383E-5	T	29462	2017.09.19 14:26:15.677277632	0000678	
18	8.136953E-5	-7.986667E-5	1.492984E-5	-4.406187E-6	T	29481	2017.09.19 14:26:15.787365132	0000678	
18	0.000132	-0.000128	2.443905E-5	-1.905189E-5	T	29481	2017.09.19 14:26:15.797365132	0000678	
18	9.972462E-5	-9.009684E-5	1.891062E-5	-3.833990E-5	T	29481	2017.09.19 14:26:15.807365132	0000678	
18	0.000118	-0.000104	1.902034E-5	-5.222527E-5	T	29481	2017.09.19 14:26:15.817365132	0000678	
18	0.000108	-9.929468E-5	5.002522E-6	-4.220832E-5	T	29481	2017.09.19 14:26:15.827365132	0000678	
18	9.274158E-5	-7.130194E-5	1.460802E-5	-5.747729E-5	T	29481	2017.09.19 14:26:15.837365132	0000678	
18	9.198913E-5	-8.516309E-5	9.872144E-6	-3.334349E-5	T	29481	2017.09.19 14:26:15.847365132	0000678	
18	0.000110	-0.000109	1.529491E-5	8.298472E-7	T	29481	2017.09.19 14:26:15.857365132	0000678	
18	0.000147	-0.000142	1.554948E-5	-3.289990E-5	T	29481	2017.09.19 14:26:15.867365132	0000678	
18	9.323090E-5	-9.013991E-5	4.972519E-6	-2.328243E-5	T	29481	2017.09.19 14:26:15.877365132	0000678	
19	0.000118	-0.000109	2.915601E-5	-3.322683E-5	T	29474	2017.09.19 14:26:15.987452632	0000678	
19	0.000111	-9.921709E-5	1.498147E-5	-4.724961E-5	T	29474	2017.09.19 14:26:15.997452632	0000678	
19	0.000129	-0.000118	2.922654E-5	-4.215314E-5	T	29474	2017.09.19 14:26:16.007452632	0000678	
19	0.000138	-0.000109	2.396186E-5	-8.120408E-5	T	29474	2017.09.19 14:26:16.017452632	0000678	
19	0.000101	-9.516205E-5	9.991044E-6	-3.326203E-5	T	29474	2017.09.19 14:26:16.027452632	0000678	
19	0.000101	-9.482205E-5	2.904629E-5	-1.934147E-5	T	29474	2017.09.19 14:26:16.037452632	0000678	
19	0.000106	-9.557965E-5	-1.904314E-5	-4.214130E-5	T	29474	2017.09.19 14:26:16.047452632	0000678	
19	0.000120	-0.000104	2.901955E-5	-5.226677E-5	T	29474	2017.09.19 14:26:16.057452632	0000678	
19	0.000101	-8.019430E-5	2.371432E-5	-5.744132E-5	T	29474	2017.09.19 14:26:16.067452632	0000678	
19	9.263369E-5	-9.004784E-5	9.988336E-6	-1.930335E-5	T	29474	2017.09.19 14:26:16.077452632	0000678	
20	0.000121	-0.000118	1.932055E-5	-1.911260E-5	T	29472	2017.09.19 14:26:16.187540132	0000678	
20	9.558766E-5	-9.006231E-5	1.495146E-5	-2.832372E-5	T	29472	2017.09.19 14:26:16.197540132	0000678	
20	0.000104	-9.017059E-5	1.887414E-5	-4.733953E-5	T	29472	2017.09.19 14:26:16.207540132	0000678	
20	0.000134	-0.000118	1.014698E-5	-6.207345E-5	T	29472	2017.09.19 14:26:16.217540132	0000678	
20	0.000115	-0.000113	5.262203E-6	-1.909523E-5	T	29472	2017.09.19 14:26:16.227540132	0000678	
20	0.000128	-0.000128	1.050095E-5	-3.994414E-6	T	29472	2017.09.19 14:26:16.237540132	0000678	
20	0.000115	-0.000113	1.026181E-5	-1.911598E-5	T	29472	2017.09.19 14:26:16.247540132	0000678	
20	0.000112	-0.000109	1.521385E-5	-1.916932E-5	T	29472	2017.09.19 14:26:16.257540132	0000678	
20	0.000141	-0.000132	2.439340E-5	-4.201834E-5	T	29472	2017.09.19 14:26:16.267540132	0000678	
20	9.900000E-5	-9.898972E-5	1.177118E-6	8.064847E-7	T	29472	2017.09.19 14:26:16.277540132	0000678	
21	0.000110	-8.577737E-5	-1.925932E-5	-6.622176E-5	T	29473	2017.09.19 14:26:16.387627632	0000678	
21	0.000118	-0.000109	1.012103E-5	-4.214761E-5	T	29473	2017.09.19 14:26:16.397627632	0000678	
21	0.000105	-9.025900E-5	1.485419E-5	-5.232272E-5	T	29473	2017.09.19 14:26:16.407627632	0000678	
21	8.623804E-5	-8.006335E-5	1.483256E-5	-2.840518E-5	T	29473	2017.09.19 14:26:16.417627632	0000678	
21	0.000117	-0.000109	1.513685E-5	-3.816852E-5	T	29473	2017.09.19 14:26:16.427627632	0000678	
21	0.000116	-0.000105	-1.895640E-5	-4.706778E-5	T	29473	2017.09.19 14:26:16.437627632	0000678	
21	0.000110	-0.000104	1.009806E-5	-3.318871E-5	T	29473	2017.09.19 14:26:16.447627632	0000678	
21	0.000103	-9.520303E-5	9.970779E-6	-3.826182E-5	T	29473	2017.09.19 14:26:16.457627632	0000678	
21	7.037045E-5	-6.599105E-5	1.470258E-5	-1.951961E-5	T	29473	2017.09.19 14:26:16.467627632	0000678	
21	0.000113	-9.931734E-5	9.961597E-6	-5.222865E-5	T	29473	2017.09.19 14:26:16.477627632	0000678	
22	8.819864E-5	-8.475944E-5	2.398858E-5	-4.402806E-6	T	29473	2017.09.19 14:26:16.587715132	0000678	
22	0.000113	-9.925806E-5	1.496120E-5	-5.224940E-5	T	29473	2017.09.19 14:26:16.597715132	0000678	
22	0.000107	-0.000104	1.515440E-5	-1.921005E-5	T	29473	2017.09.19 14:26:16.607715132	0000678	
22	0.000104	-9.514375E-5	1.497038E-5	-3.828257E-5	T	29473	2017.09.19 14:26:16.617715132	0000678	
22	0.000125	-0.000104	2.897902E-5	-6.226635E-5	T	29473	2017.09.19 14:26:16.627715132	0000678	
22	9.973465E-5	-9.512108E-5	1.001131E-5	-2.826224E-5	T	29473	2017.09.19 14:26:16.637715132	0000678	
22	9.638465E-5	-8.031932E-5	9.735686E-6	-5.238343E-5	T	29473	2017.09.19 14:26:16.647715132	0000678	
22	0.000122	-8.016571E-5	4.261554E-5	-8.151917E-5	T	29473	2017.09.19 14:26:16.657715132	0000678	
22	0.000125	-0.000104	2.897902E-5	-6.226635E-5	T	29473	2017.09.19 14:26:16.667715132	0000678	
22	0.000118	-0.000118	5.382448E-6	-4.055127E-6	T	29473	2017.09.19 14:26:16.677715132	0000678	
23	0.000112	-9.529945E-5	1.489338E-5	-5.728178E-5	T	29494	2017.09.19 14:26:16.787802632	0000678	
23	0.000124	-0.000114	-1.884939E-5	-4.699446E-5	T	29494	2017.09.19 14:26:16.797802632	0000678	
23	0.000128	-0.000109	2.403886E-5	-6.220487E-5	T	29494	2017.09.19 14:26:16.807802632	0000678	
23	0.000112	-9.535873E-5	9.893772E-6	-5.726103E-5	T	29494	2017.09.19 14:26:16.817802632	0000678	
23	0.000112	-9.937663E-5	4.961992E-6	-5.220790E-5	T	29494	2017.09.19 14:26:16.827802632	0000678	
23	0.000124	-0.000113	1.514793E-5	-4.713556E-5	T	29494	2017.09.19 14:26:16.837802632	0000678	
23	0.000119	-0.000104	1.000078E-5	-5.718771E-5	T	29494	2017.09.19 14:26:16.847802632	0000678	
23	0.000106	-9.926190E-5	5.018734E-6	-3.820849E-5	T	29494	2017.09.19 14:26:16.857802632	0000678	
23	0.000102	-7.147596E-5	9.551668E-6	-7.145595E-5	T	29494	2017.09.19 14:26:16.867802632	0000678	
23	0.000143	-0.000132	3.439261E-5	-4.205984E-5	T	29494	2017.09.19 14:26:16.877802632	0000678	
24	0.000124	-0.000104	9.964305E-6	-6.618733E-5	T	29478	2017.09.19 14:26:16.987890132	0000678	
24	7.982481E-5	-7.599001E-5	1.482148E-5	-1.943815E-5	T	29478	2017.09.19 14:26:16.997890132	0000678	
24	0.000114	-9.519274E-5	2.389267E-5	-5.731913E-5	T	29478	2017.09.19 14:26:17.007890132	0000678	
24	0.000117	-0.000113	1.522494E-5	-2.813636E-5	T	29478	2017.09.19 14:26:17.017890132	0000678	
24	0.000128	-0.000123	-1.865348E-5	-2.791379E-5	T	29478	2017.09.19 14:26:17.027890132	0000678	
24	0.000101	-9.885825E-5	1.913517E-5	-9.267798E-6	T	29478	2017.09.19 14:26:17.037890132	0000678	
24	8.493527E-5	-7.113159E-5	1.866850E-5	-4.249452E-5	T	29478	2017.09.19 14:26:17.047890132	0000678	
24	0.000111	-9.481176E-5	4.296818E-5	-3.839877E-5	T	29478	2017.09.19 14:26:17.057890132	0000678	
24	0.000139	-0.000132	1.039450E-5	-4.196024E-5	T	29478	2017.09.19 14:26:17.067890132	0000678	
24	0.000120	-0.000113	1.018480E-5	-3.811519E-5	T	29478	2017.09.19 14:26:17.077890132	0000678	
25	9.211949E-5	-7.136123E-5	9.608410E-6	-5.745654E-5	T	29479	2017.09.19 14:26:17.187977632	0000678	
25	0.000147	-0.000129	1.230112E-6	-7.095426E-5	T	29479	2017.09.19 14:26:17.197977632	0000678	
25	0.000102	-9.913897E-5	5.079529E-6	-2.320911E-5	T	29479	2017.09.19 14:26:17.207977632	0000678	
25	0.000113	-9.931734E-5	9.961597E-6	-5.222865E-5	T	29479	2017.09.19 14:26:17.217977632	0000678	
25	0.000144	-0.000142	1.060662E-5	-1.887974E-5	T	29479	2017.09.19 14:26:17.227977632	0000678	
25	0.000129	-0.000113	5.087923E-6	-6.209343E-5	T	29479	2017.09.19 14:26:17.237977632	0000678	
25	0.000120	-0.000104	2.901955E-5	-5.226677E-5	T	29479	2017.09.19 14:26:17.247977632	0000678	
25	0.000137	-0.000132	1.043098E-5	-3.296062E-5	T	29479	2017.09.19 14:26:17.257977632	0000678	
25	0.000118	-0.000109	1.012103E-5	-4.214761E-5	T	29479	2017.09.19 14:26:17.267977632	0000678	
25	9.029950E-5	-8.488237E-5	2.392778E-5	-1.940218E-5	T	29479	2017.09.19 14:26:17.277977632	0000678	
26	0.000108	-8.507521E-5	3.377298E-5	-5.744209E-5	T	29471	2017.09.19 14:26:17.388065132	0000678	
26	0.000119	-0.000109	1.912032E-5	-4.218496E-5	T	29471	2017.09.19 14:26:17.398065132	0000678	
26	0.000108	-0.000104	1.513819E-5	-2.320988E-5	T	29471	2017.09.19 14:26:17.408065132	0000678	
26	0.000138	-0.000132	1.041071E-5	-3.796041E-5	T	29471	2017.09.19 14:26:17.418065132	0000678	
26	0.000110	-9.897734E-5	2.901684E-5	-3.830809E-5	T	29471	2017.09.19 14:26:17.428065132	0000678	
26	0.000120	-0.000109	1.910005E-5	-4.718475E-5	T	29471	2017.09.19 14:26:17.438065132	0000678	
26	0.000124	-0.000113	1.914761E-5	-4.715216E-5	T	29471	2017.09.19 14:26:17.448065132	0000678	
26	0.000100	-8.511183E-5	2.381430E-5	-4.740101E-5	T	29471	2017.09.19 14:26:17.458065132	0000678	
26	0.000130	-0.000118	3.422615E-5	-4.217389E-5	T	29471	2017.09.19 14:26:17.468065132	0000678	
26	0.000123	-0.000118	5.264911E-6	-3.305391E-5	T	29471	2017.09.19 14:26:17.478065132	0000678	
27	0.000115	-0.000104	1.004131E-5	-4.718813E-5	T	29480	2017.09.19 14:26:17.588152632	0000678	
27	0.000109	-9.511079E-5	2.393320E-5	-4.731955E-5	T	29480	2017.09.19 14:26:17.598152632	0000678	
27	0.000142	-0.000118	1.908953E-5	-7.611022E-5	T	29480	2017.09.19 14:26:17.608152632	0000678	
27	0.000107	-9.533607E-5	4.934697E-6	-4.724069E-5	T	29480	2017.09.19 14:26:17.618152632	0000678	
27	9.544108E-5	-8.978159E-5	2.900710E-5	-1.438241E-5	T	29480	2017.09.19 14:26:17.628152632	0000678	
27	0.000120	-9.541418E-5	1.483664E-5	-7.128119E-5	T	29480	2017.09.19 14:26:17.638152632	0000678	
27	9.558766E-5	-9.006231E-5	1.495146E-5	-2.832372E-5	T	29480	2017.09.19 14:26:17.648152632	0000678	
27	0.000107	-0.000104	1.139295E-6	-2.315178E-5	T	29480	2017.09.19 14:26:17.658152632	0000678	
27	0.000157	-0.000151	5.620806E-6	-4.178471E-5	T	29480	2017.09.19 14:26:17.668152632	0000678	
27	0.000118	-8.566316E-5	6.783087E-7	-8.130414E-5	T	29480	2017.09.19 14:26:17.678152632	0000678	
28	0.000135	-0.000123	1.524656E-5	-5.205389E-5	T	29468	2017.09.19 14:26:17.788240132	0000678	
28	0.000119	-0.000109	1.010076E-5	-4.714740E-5	T	29468	2017.09.19 14:26:17.798240132	0000678	
28	0.000116	-0.000104	1.904060E-5	-4.722548E-5	T	29468	2017.09.19 14:26:17.808240132	0000678	
28	0.000109	-0.000104	2.413748E-5	-2.324723E-5	T	29468	2017.09.19 14:26:17.818240132	0000678	
28	9.694328E-5	-8.513014E-5	1.883496E-5	-4.238047E-5	T	29468	2017.09.19 14:26:17.828240132	0000678	
28	9.167333E-5	-7.617205E-5	1.870768E-5	-4.745358E-5	T	29468	2017.09.19 14:26:17.838240132	0000678	
28	0.000141	-0.000128	1.528575E-5	-5.701295E-5	T	29468	2017.09.19 14:26:17.848240132	0000678	
28	0.000104	-9.906138E-5	1.505848E-5	-2.825040E-5	T	29468	2017.09.19 14:26:17.858240132	0000678	
28	8.968835E-5	-6.625504E-5	1.854825E-5	-5.753462E-5	T	29468	2017.09.19 14:26:17.868240132	0000678	
28	0.000122	-0.000118	5.285176E-6	-2.805412E-5	T	29468	2017.09.19 14:26:17.878240132	0000678	
29	0.000117	-9.950600E-5	9.217772E-7	-6.219088E-5	T	29476	2017.09.19 14:26:17.988327632	0000678	
29	0.000122	-0.000113	1.916788E-5	-4.215237E-5	T	29476	2017.09.19 14:26:17.998327632	0000678	
29	0.000105	-9.025900E-5	1.485419E-5	-5.232272E-5	T	29476	2017.09.19 14:26:18.008327632	0000678	
29	0.000123	-0.000113	5.148718E-6	-4.709406E-5	T	29476	2017.09.19 14:26:18.018327632	0000678	
29	0.000125	-0.000113	2.414722E-5	-4.717291E-5	T	29476	2017.09.19 14:26:18.028327632	0000678	
29	8.942595E-5	-8.502186E-5	1.491228E-5	-2.336466E-5	T	29476	2017.09.19 14:26:18.038327632	0000678	
29	0.000125	-0.000123	1.365207E-6	-2.299700E-5	T	29476	2017.09.19 14:26:18.048327632	0000678	
29	0.000123	-0.000109	1.907979E-5	-5.218454E-5	T	29476	2017.09.19 14:26:18.058327632	0000678	
29	0.000129	-0.000118	1.920706E-5	-4.711143E-5	T	29476	2017.09.19 14:26:18.068327632	0000678	
29	7.523962E-5	-6.094031E-5	2.858528E-5	-3.361786E-5	T	29476	2017.09.19 14:26:18.078327632	0000678	
30	0.000151	-0.000137	3.841121E-5	-5.203529E-5	T	29473	2017.09.19 14:26:18.188415132	0000678	
30	0.000124	-0.000104	2.397941E-5	-6.224560E-5	T	29473	2017.09.19 14:26:18.198415132	0000678	
30	0.000132	-0.000118	1.016724E-5	-5.707366E-5	T	29473	2017.09.19 14:26:18.208415132	0000678	
30	9.126883E-5	-8.023737E-5	9.776216E-6	-4.238385E-5	T	29473	2017.09.19 14:26:18.218415132	0000678	
30	0.000128	-0.000118	1.520738E-5	-4.709483E-5	T	29473	2017.09.19 14:26:18.228415132	0000678	
30	0.000126	-0.000113	1.512766E-5	-5.213535E-5	T	29473	2017.09.19 14:26:18.238415132	0000678	
30	0.000103	-9.897298E-5	1.907842E-5	-2.326721E-5	T	29473	2017.09.19 14:26:18.248415132	0000678	
30	0.000114	-0.000109	1.517738E-5	-2.816894E-5	T	29473	2017.09.19 14:26:18.258415132	0000678	
30	0.000129	-0.000123	1.030370E-5	-3.803372E-5	T	29473	2017.09.19 14:26:18.268415132	0000678	
30	0.000122	-9.926608E-5	2.390375E-5	-6.628617E-5	T	29473	2017.09.19 14:26:18.278415132	0000678	
31	0.000115	-0.000109	2.417667E-5	-2.820629E-5	T	29465	2017.09.19 14:26:18.388502632	0000678	
31	0.000132	-0.000123	5.267619E-6	-4.701260E-5	T	29465	2017.09.19 14:26:18.398502632	0000678	
31	0.000121	-0.000113	1.016859E-5	-4.211502E-5	T	29465	2017.09.19 14:26:18.408502632	0000678	
31	0.000128	-0.000123	1.032397E-5	-3.303393E-5	T	29465	2017.09.19 14:26:18.418502632	0000678	
31	0.000139	-0.000118	1.511011E-5	-7.109383E-5	T	29465	2017.09.19 14:26:18.428502632	0000678	
31	0.000117	-9.945858E-5	4.921462E-6	-6.220748E-5	T	29465	2017.09.19 14:26:18.438502632	0000678	
31	0.000161	-0.000147	1.949108E-5	-6.187456E-5	T	29465	2017.09.19 14:26:18.448502632	0000678	
31	8.512344E-5	-6.632077E-5	9.569225E-6	-5.249748E-5	T	29465	2017.09.19 14:26:18.458502632	0000678	
31	0.000131	-0.000128	1.042395E-5	-2.299362E-5	T	29465	2017.09.19 14:26:18.468502632	0000678	
31	0.000123	-0.000123	5.441899E-6	-4.014395E-6	T	29465	2017.09.19 14:26:18.478502632	0000678	
32	0.000108	-9.934210E-5	1.002838E-6	-4.219172E-5	T	29475	2017.09.19 14:26:18.588590132	0000678	
32	9.972462E-5	-9.009684E-5	1.891062E-5	-3.833990E-5	T	29475	2017.09.19 14:26:18.598590132	0000678	
32	0.000133	-0.000123	1.526683E-5	-4.705410E-5	T	29475	2017.09.19 14:26:18.608590132	0000678	
32	0.000114	-0.000109	1.517738E-5	-2.816894E-5	T	29475	2017.09.19 14:26:18.618590132	0000678	
32	0.000127	-0.000118	5.208168E-6	-4.705333E-5	T	29475	2017.09.19 14:26:18.628590132	0000678	
32	0.000106	-9.930932E-5	1.019050E-6	-3.819189E-5	T	29475	2017.09.19 14:26:18.638590132	0000678	
32	0.000130	-0.000119	-2.378954E-5	-4.693298E-5	T	29475	2017.09.19 14:26:18.648590132	0000678	
32	0.000129	-0.000123	1.932326E-5	-3.307128E-5	T	29475	2017.09.19 14:26:18.658590132	0000678	
32	0.000111	-8.526754E-5	2.373729E-5	-6.640021E-5	T	29475	2017.09.19 14:26:18.668590132	0000678	
32	0.000106	-7.636873E-5	1.861041E-5	-7.145257E-5	T	29475	2017.09.19 14:26:18.678590132	0000678	
33	0.000115	-9.935832E-5	9.941332E-6	-5.722844E-5	T	29482	2017.09.19 14:26:18.788677632	0000678	
33	0.000124	-0.000118	1.526412E-5	-3.309542E-5	T	29482	2017.09.19 14:26:18.798677632	0000678	
33	0.000113	-9.037373E-5	1.479745E-5	-6.632213E-5	T	29482	2017.09.19 14:26:18.808677632	0000678	
33	0.000148	-0.000132	5.297622E-6	-6.593849E-5	T	29482	2017.09.19 14:26:18.818677632	0000678	
33	0.000101	-8.525951E-5	1.479474E-5	-5.236345E-5	T	29482	2017.09.19 14:26:18.828677632	0000678	
33	0.000113	-0.000104	5.061972E-6	-4.216759E-5	T	29482	2017.09.19 14:26:18.838677632	0000678	
33	0.000101	-9.003756E-5	2.391022E-5	-3.836065E-5	T	29482	2017.09.19 14:26:18.848677632	0000678	
33	7.798718E-5	-7.600832E-5	9.842140E-6	-1.441760E-5	T	29482	2017.09.19 14:26:18.858677632	0000678	
33	8.744141E-5	-8.494810E-5	1.494876E-5	-1.436504E-5	T	29482	2017.09.19 14:26:18.868677632	0000678	
33	0.000107	-9.920261E-5	1.001834E-5	-3.822924E-5	T	29482	2017.09.19 14:26:18.878677632	0000678	
34	8.773255E-5	-7.654884E-5	-1.925284E-5	-3.829625E-5	T	29471	2017.09.19 14:26:18.988765132	0000678	
34	8.374366E-5	-7.616403E-5	9.765133E-6	-3.341681E-5	T	29471	2017.09.19 14:26:18.998765132	0000678	
34	0.000120	-0.000104	1.500039E-5	-5.720846E-5	T	29471	2017.09.19 14:26:19.008765132	0000678	
34	0.000127	-0.000123	-1.863322E-5	-2.291400E-5	T	29471	2017.09.19 14:26:19.018765132	0000678	
34	0.000139	-0.000128	1.530601E-5	-5.201316E-5	T	29471	2017.09.19 14:26:19.028765132	0000678	
34	8.164558E-5	-7.089830E-5	2.872445E-5	-2.853660E-5	T	29471	2017.09.19 14:26:19.038765132	0000678	
34	0.000114	-0.000113	1.530194E-5	-9.137150E-6	T	29471	2017.09.19 14:26:19.048765132	0000678	
34	0.000133	-0.000128	1.038342E-5	-3.299320E-5	T	29471	2017.09.19 14:26:19.058765132	0000678	
34	0.000120	-9.953878E-5	9.055651E-7	-6.619072E-5	T	29471	2017.09.19 14:26:19.068765132	0000678	
34	0.000113	-0.000104	2.909656E-5	-3.326756E-5	T	29471	2017.09.19 14:26:19.078765132	0000678	
35	0.000110	-0.000109	1.529491E-5	8.298472E-7	T	29464	2017.09.19 14:26:19.188852632	0000678	
35	0.000108	-9.934210E-5	1.002838E-6	-4.219172E-5	T	29464	2017.09.19 14:26:19.198852632	0000678	
35	0.000118	-0.000113	2.424449E-5	-2.317391E-5	T	29464	2017.09.19 14:26:19.208852632	0000678	
35	0.000129	-0.000123	1.932326E-5	-3.307128E-5	T	29464	2017.09.19 14:26:19.218852632	0000678	
35	0.000125	-0.000118	1.024425E-5	-3.807446E-5	T	29464	2017.09.19 14:26:19.228852632	0000678	
35	9.126883E-5	-8.023737E-5	9.776216E-6	-4.238385E-5	T	29464	2017.09.19 14:26:19.238852632	0000678	
35	0.000112	-8.541522E-5	1.471773E-5	-7.136266E-5	T	29464	2017.09.19 14:26:19.248852632	0000678	
35	0.000111	-0.000105	-2.387900E-5	-2.804782E-5	T	29464	2017.09.19 14:26:19.258852632	0000678	
35	0.000105	-0.000104	1.175773E-6	-1.415216E-5	T	29464	2017.09.19 14:26:19.268852632	0000678	
35	0.000140	-0.000123	1.019022E-5	-6.603255E-5	T	29464	2017.09.19 14:26:19.278852632	0000678	
36	0.000128	-0.000118	1.520738E-5	-4.709483E-5	T	29478	2017.09.19 14:26:19.388940132	0000678	
36	0.000130	-0.000123	1.930299E-5	-3.807107E-5	T	29478	2017.09.19 14:26:19.398940132	0000678	
36	0.000109	-9.025254E-5	1.883361E-5	-5.733911E-5	T	29478	2017.09.19 14:26:19.408940132	0000678	
36	0.000148	-0.000147	1.070660E-5	-8.839425E-6	T	29478	2017.09.19 14:26:19.418940132	0000678	
36	0.000111	-9.029352E-5	1.881335E-5	-6.233890E-5	T	29478	2017.09.19 14:26:19.428940132	0000678	
36	0.000125	-0.000113	2.414722E-5	-4.717291E-5	T	29478	2017.09.19 14:26:19.438940132	0000678	
36	0.000124	-0.000123	1.544111E-5	-4.055895E-6	T	29478	2017.09.19 14:26:19.448940132	0000678	
36	0.000132	-0.000128	5.383811E-6	-3.297245E-5	T	29478	2017.09.19 14:26:19.458940132	0000678	
36	0.000106	-9.910236E-5	1.503821E-5	-3.325019E-5	T	29478	2017.09.19 14:26:19.468940132	0000678	
36	0.000119	-0.000109	5.101158E-6	-4.712665E-5	T	29478	2017.09.19 14:26:19.478940132	0000678	
37	9.360556E-5	-8.526335E-5	4.852273E-6	-3.832253E-5	T	29472	2017.09.19 14:26:19.589027632	0000678	
37	0.000115	-0.000104	1.504092E-5	-4.720888E-5	T	29472	2017.09.19 14:26:19.599027632	0000678	
37	0.000129	-0.000118	2.922654E-5	-4.215314E-5	T	29472	2017.09.19 14:26:19.609027632	0000678	
37	9.662815E-5	-9.016257E-5	9.931594E-6	-3.330276E-5	T	29472	2017.09.19 14:26:19.619027632	0000678	
37	0.000140	-0.000128	1.930570E-5	-5.202976E-5	T	29472	2017.09.19 14:26:19.629027632	0000678	
37	0.000104	-9.001105E-5	2.889362E-5	-4.238124E-5	T	29472	2017.09.19 14:26:19.639027632	0000678	
37	0.000143	-0.000142	1.566702E-5	-3.901116E-6	T	29472	2017.09.19 14:26:19.649027632	0000678	
37	0.000129	-0.000123	1.932326E-5	-3.307128E-5	T	29472	2017.09.19 14:26:19.659027632	0000678	
37	0.000125	-0.000104	1.896360E-5	-6.622468E-5	T	29472	2017.09.19 14:26:19.669027632	0000678	
37	8.535807E-5	-7.087999E-5	3.370379E-5	-3.355714E-5	T	29472	2017.09.19 14:26:19.679027632	0000678	
38	0.000125	-0.000113	2.414722E-5	-4.717291E-5	T	29478	2017.09.19 14:26:19.789115132	0000678	
38	0.000123	-0.000113	1.014832E-5	-4.711481E-5	T	29478	2017.09.19 14:26:19.799115132	0000678	
38	7.707788E-5	-7.097589E-5	1.874550E-5	-2.349531E-5	T	29478	2017.09.19 14:26:19.809115132	0000678	
38	0.000150	-0.000137	1.939244E-5	-5.695623E-5	T	29478	2017.09.19 14:26:19.819115132	0000678	
38	0.000123	-0.000118	2.430394E-5	-2.313318E-5	T	29478	2017.09.19 14:26:19.829115132	0000678	
38	0.000134	-0.000123	1.024696E-5	-5.203314E-5	T	29478	2017.09.19 14:26:19.839115132	0000678	
38	0.000120	-0.000104	3.803910E-5	-4.730433E-5	T	29478	2017.09.19 14:26:19.849115132	0000678	
38	8.355238E-5	-7.093927E-5	2.870418E-5	-3.353639E-5	T	29478	2017.09.19 14:26:19.859115132	0000678	
38	9.594269E-5	-8.991463E-5	2.397102E-5	-2.336128E-5	T	29478	2017.09.19 14:26:19.869115132	0000678	
38	9.027735E-5	-8.538784E-5	-2.900724E-5	-4.182853E-6	T	29478	2017.09.19 14:26:19.879115132	0000678	
39	0.000119	-0.000109	5.101158E-6	-4.712665E-5	T	29471	2017.09.19 14:26:19.989202632	0000678	
39	0.000143	-0.000123	1.516956E-5	-7.105310E-5	T	29471	2017.09.19 14:26:19.999202632	0000678	
39	0.000122	-0.000109	2.909926E-5	-4.722625E-5	T	29471	2017.09.19 14:26:20.009202632	0000678	
39	0.000104	-9.509632E-5	1.897007E-5	-3.829917E-5	T	29471	2017.09.19 14:26:20.019202632	0000678	
39	0.000107	-0.000104	5.138980E-6	-2.316838E-5	T	29471	2017.09.19 14:26:20.029202632	0000678	
39	0.000111	-8.998629E-5	3.785238E-5	-5.241817E-5	T	29471	2017.09.19 14:26:20.039202632	0000678	
39	0.000116	-0.000113	1.024560E-5	-2.311581E-5	T	29471	2017.09.19 14:26:20.049202632	0000678	
39	0.000127	-0.000109	1.503957E-5	-6.216752E-5	T	29471	2017.09.19 14:26:20.059202632	0000678	
39	0.000118	-0.000113	2.424449E-5	-2.317391E-5	T	29471	2017.09.19 14:26:20.069202632	0000678	
39	0.000104	-9.891370E-5	2.407803E-5	-2.328796E-5	T	29471	2017.09.19 14:26:20.079202632	0000678	
40	0.000105	-8.037476E-5	1.467855E-5	-6.640360E-5	T	29478	2017.09.19 14:26:20.189290132	0000678	
40	0.000101	-9.526876E-5	9.917545E-7	-3.322468E-5	T	29478	2017.09.19 14:26:20.199290132	0000678	
40	0.000135	-0.000123	1.524656E-5	-5.205389E-5	T	29478	2017.09.19 14:26:20.209290132	0000678	
40	0.000103	-9.526231E-5	4.971174E-6	-3.824107E-5	T	29478	2017.09.19 14:26:20.219290132	0000678	
40	0.000127	-0.000113	5.108188E-6	-5.709364E-5	T	29478	2017.09.19 14:26:20.229290132	0000678	
40	0.000125	-8.530468E-5	3.365949E-5	-8.544092E-5	T	29478	2017.09.19 14:26:20.239290132	0000678	
40	9.731393E-5	-8.995561E-5	2.395075E-5	-2.836107E-5	T	29478	2017.09.19 14:26:20.249290132	0000678	
40	0.000134	-0.000129	-1.861429E-5	-3.287285E-5	T	29478	2017.09.19 14:26:20.259290132	0000678	
40	0.000132	-0.000128	5.383811E-6	-3.297245E-5	T	29478	2017.09.19 14:26:20.269290132	0000678	
40	0.000110	-9.003372E-5	3.385269E-5	-5.240157E-5	T	29478	2017.09.19 14:26:20.279290132	0000678	
41	0.000122	-0.000109	1.508010E-5	-5.216794E-5	T	29475	2017.09.19 14:26:20.389377632	0000678	
41	8.878063E-5	-8.508114E-5	9.912674E-6	-2.334391E-5	T	29475	2017.09.19 14:26:20.399377632	0000678	
41	9.976973E-5	-9.488133E-5	2.404668E-5	-1.932072E-5	T	29475	2017.09.19 14:26:20.409377632	0000678	
41	0.000127	-0.000123	2.436339E-5	-2.309245E-5	T	29475	2017.09.19 14:26:20.419377632	0000678	
41	9.749872E-5	-9.504732E-5	1.004779E-5	-1.926262E-5	T	29475	2017.09.19 14:26:20.429377632	0000678	
41	9.719053E-5	-9.494707E-5	1.506766E-5	-1.428357E-5	T	29475	2017.09.19 14:26:20.439377632	0000678	
41	0.000126	-0.000123	5.344626E-6	-2.801339E-5	T	29475	2017.09.19 14:26:20.449377632	0000678	
41	0.000120	-0.000113	1.518441E-5	-3.813594E-5	T	29475	2017.09.19 14:26:20.459377632	0000678	
41	0.000120	-0.000109	3.413535E-5	-3.824737E-5	T	29475	2017.09.19 14:26:20.469377632	0000678	
41	0.000135	-0.000128	5.347334E-6	-4.197208E-5	T	29475	2017.09.19 14:26:20.479377632	0000678	
42	0.000111	-0.000109	1.925407E-5	-9.186335E-6	T	29473	2017.09.19 14:26:20.589465132	0000678	
42	0.000120	-0.000113	1.518441E-5	-3.813594E-5	T	29473	2017.09.19 14:26:20.599465132	0000678	
42	0.000132	-0.000118	1.516685E-5	-5.709441E-5	T	29473	2017.09.19 14:26:20.609465132	0000678	
42	0.000109	-8.492753E-5	4.279253E-5	-5.247965E-5	T	29473	2017.09.19 14:26:20.619465132	0000678	
42	0.000120	-9.541418E-5	1.483664E-5	-7.128119E-5	T	29473	2017.09.19 14:26:20.629465132	0000678	
42	0.000101	-9.516205E-5	9.991044E-6	-3.326203E-5	T	29473	2017.09.19 14:26:20.639465132	0000678	
42	9.816822E-5	-9.026283E-5	4.911723E-6	-3.828180E-5	T	29473	2017.09.19 14:26:20.649465132	0000678	
42	0.000101	-9.017705E-5	1.489472E-5	-4.232314E-5	T	29473	2017.09.19 14:26:20.659465132	0000678	
42	0.000106	-0.000104	1.923515E-5	7.725155E-7	T	29473	2017.09.19 14:26:20.669465132	0000678	
42	0.000105	-0.000104	5.195722E-6	-9.168966E-6	T	29473	2017.09.19 14:26:20.679465132	0000678	
43	0.000111	-0.000105	-1.889966E-5	-3.306836E-5	T	29465	2017.09.19 14:26:20.789552632	0000678	
43	0.000107	-9.889539E-5	2.905737E-5	-2.830850E-5	T	29465	2017.09.19 14:26:20.799552632	0000678	
43	0.000140	-0.000132	1.939379E-5	-4.199759E-5	T	29465	2017.09.19 14:26:20.809552632	0000678	
43	9.694328E-5	-8.513014E-5	1.883496E-5	-4.238047E-5	T	29465	2017.09.19 14:26:20.819552632	0000678	
43	9.352005E-5	-8.531078E-5	8.525886E-7	-3.830593E-5	T	29465	2017.09.19 14:26:20.829552632	0000678	
43	9.798469E-5	-9.518681E-5	1.032285E-6	-2.322510E-5	T	29465	2017.09.19 14:26:20.839552632	0000678	
43	7.156815E-5	-7.088592E-5	9.843485E-6	5.410376E-7	T	29465	2017.09.19 14:26:20.849552632	0000678	
43	0.000121	-9.536675E-5	1.883632E-5	-7.129779E-5	T	29465	2017.09.19 14:26:20.859552632	0000678	
43	0.000140	-0.000123	3.422480E-5	-5.713253E-5	T	29465	2017.09.19 14:26:20.869552632	0000678	
43	0.000104	-9.509632E-5	1.897007E-5	-3.829917E-5	T	29465	2017.09.19 14:26:20.879552632	0000678	
44	0.000114	-0.000109	1.158216E-6	-3.311063E-5	T	29474	2017.09.19 14:26:20.989640132	0000678	
44	0.000129	-0.000118	5.187903E-6	-5.205312E-5	T	29474	2017.09.19 14:26:20.999640132	0000678	
44	0.000136	-0.000128	1.534655E-5	-4.201358E-5	T	29474	2017.09.19 14:26:21.009640132	0000678	
44	0.000124	-0.000113	1.914761E-5	-4.715216E-5	T	29474	2017.09.19 14:26:21.019640132	0000678	
44	0.000136	-0.000113	2.404995E-5	-7.117191E-5	T	29474	2017.09.19 14:26:21.029640132	0000678	
44	0.000139	-0.000128	1.307120E-6	-5.195506E-5	T	29474	2017.09.19 14:26:21.039640132	0000678	
44	0.000130	-0.000113	1.508713E-5	-6.213493E-5	T	29474	2017.09.19 14:26:21.049640132	0000678	
44	0.000143	-0.000132	1.935326E-5	-5.199717E-5	T	29474	2017.09.19 14:26:21.059640132	0000678	
44	0.000144	-0.000132	2.435287E-5	-5.201792E-5	T	29474	2017.09.19 14:26:21.069640132	0000678	
44	0.000101	-9.017705E-5	1.489472E-5	-4.232314E-5	T	29474	2017.09.19 14:26:21.079640132	0000678	
45	0.000120	-0.000118	1.532086E-5	-1.909600E-5	T	29476	2017.09.19 14:26:21.189727632	0000678	
45	0.000103	-9.917995E-5	5.059264E-6	-2.820890E-5	T	29476	2017.09.19 14:26:21.199727632	0000678	
45	8.809086E-5	-7.985639E-5	2.885172E-5	-2.346349E-5	T	29476	2017.09.19 14:26:21.209727632	0000678	
45	0.000117	-0.000109	5.121423E-6	-4.212686E-5	T	29476	2017.09.19 14:26:21.219727632	0000678	
45	8.817029E-5	-8.490068E-5	1.894844E-5	-1.438164E-5	T	29476	2017.09.19 14:26:21.229727632	0000678	
45	8.942595E-5	-8.502186E-5	1.491228E-5	-2.336466E-5	T	29476	2017.09.19 14:26:21.239727632	0000678	
45	0.000101	-9.017705E-5	1.489472E-5	-4.232314E-5	T	29476	2017.09.19 14:26:21.249727632	0000678	
45	0.000100	-8.983704E-5	3.394997E-5	-2.840257E-5	T	29476	2017.09.19 14:26:21.259727632	0000678	
45	9.787747E-5	-9.005586E-5	1.893088E-5	-3.334011E-5	T	29476	2017.09.19 14:26:21.269727632	0000678	
45	0.000135	-0.000132	5.451637E-6	-2.794008E-5	T	29476	2017.09.19 14:26:21.279727632	0000678	
46	0.000118	-0.000109	2.413614E-5	-3.820587E-5	T	29481	2017.09.19 14:26:21.389815132	0000678	
46	0.000109	-9.960574E-5	-2.397898E-5	-3.808813E-5	T	29481	2017.09.19 14:26:21.399815132	0000678	
46	0.000103	-9.917995E-5	5.059264E-6	-2.820890E-5	T	29481	2017.09.19 14:26:21.409815132	0000678	
46	0.000119	-0.000113	1.920436E-5	-3.315275E-5	T	29481	2017.09.19 14:26:21.419815132	0000678	
46	0.000126	-0.000113	1.912735E-5	-5.215195E-5	T	29481	2017.09.19 14:26:21.429815132	0000678	
46	0.000131	-0.000118	1.918680E-5	-5.211122E-5	T	29481	2017.09.19 14:26:21.439815132	0000678	
46	0.000114	-0.000109	1.917706E-5	-2.818554E-5	T	29481	2017.09.19 14:26:21.449815132	0000678	
46	0.000110	-7.145120E-5	1.851043E-5	-8.149289E-5	T	29481	2017.09.19 14:26:21.459815132	0000678	
46	0.000110	-9.521105E-5	1.891333E-5	-5.229859E-5	T	29481	2017.09.19 14:26:21.469815132	0000678	
46	9.694328E-5	-8.513014E-5	1.883496E-5	-4.238047E-5	T	29481	2017.09.19 14:26:21.479815132	0000678	
47	0.000110	-9.505151E-5	2.893280E-5	-4.734030E-5	T	29465	2017.09.19 14:26:21.589902632	0000678	
47	0.000109	-0.000104	1.098765E-6	-3.315136E-5	T	29465	2017.09.19 14:26:21.599902632	0000678	
47	0.000111	-0.000109	1.021425E-5	-1.914857E-5	T	29465	2017.09.19 14:26:21.609902632	0000678	
47	0.000115	-0.000104	5.041707E-6	-4.716738E-5	T	29465	2017.09.19 14:26:21.619902632	0000678	
47	0.000122	-0.000109	1.508010E-5	-5.216794E-5	T	29465	2017.09.19 14:26:21.629902632	0000678	
47	6.702984E-5	-6.102435E-5	1.462692E-5	-2.356017E-5	T	29465	2017.09.19 14:26:21.639902632	0000678	
47	0.000124	-0.000118	1.244961E-6	-3.803711E-5	T	29465	2017.09.19 14:26:21.649902632	0000678	
47	9.082401E-5	-8.034408E-5	7.769262E-7	-4.234650E-5	T	29465	2017.09.19 14:26:21.659902632	0000678	
47	0.000159	-0.000156	1.073660E-5	-2.776531E-5	T	29465	2017.09.19 14:26:21.669902632	0000678	
47	0.000110	-9.906940E-5	2.400102E-5	-4.228717E-5	T	29465	2017.09.19 14:26:21.679902632	0000678	
48	0.000100	-9.506180E-5	1.501091E-5	-2.828299E-5	T	29465	2017.09.19 14:26:21.789990132	0000678	
48	0.000124	-0.000118	2.930355E-5	-2.315393E-5	T	29465	2017.09.19 14:26:21.799990132	0000678	
48	0.000112	-9.529945E-5	1.489338E-5	-5.728178E-5	T	29465	2017.09.19 14:26:21.809990132	0000678	
48	0.000139	-0.000137	1.531668E-6	-2.288295E-5	T	29465	2017.09.19 14:26:21.819990132	0000678	
48	0.000125	-0.000113	5.128453E-6	-5.209385E-5	T	29465	2017.09.19 14:26:21.829990132	0000678	
48	0.000108	-0.000104	-2.382225E-5	-1.404841E-5	T	29465	2017.09.19 14:26:21.839990132	0000678	
48	0.000112	-0.000109	1.519764E-5	-2.316915E-5	T	29465	2017.09.19 14:26:21.849990132	0000678	
48	0.000133	-0.000118	1.916653E-5	-5.711101E-5	T	29465	2017.09.19 14:26:21.859990132	0000678	
48	9.438750E-5	-7.621302E-5	1.868742E-5	-5.245337E-5	T	29465	2017.09.19 14:26:21.869990132	0000678	
48	0.000104	-9.878066E-5	2.911411E-5	-1.430909E-5	T	29465	2017.09.19 14:26:21.879990132	0000678	
49	0.000119	-0.000109	4.319543E-5	-2.328535E-5	T	29478	2017.09.19 14:26:21.990077632	0000678	
49	0.000130	-0.000123	1.930299E-5	-3.807107E-5	T	29478	2017.09.19 14:26:22.000077632	0000678	
49	0.000135	-0.000128	1.536276E-5	-3.801374E-5	T	29478	2017.09.19 14:26:22.010077632	0000678	
49	9.780593E-5	-9.052472E-5	-2.404546E-5	-2.816187E-5	T	29478	2017.09.19 14:26:22.020077632	0000678	
49	0.000102	-9.033659E-5	4.875246E-6	-4.728143E-5	T	29478	2017.09.19 14:26:22.030077632	0000678	
49	0.000129	-0.000128	5.460819E-6	-1.397325E-5	T	29478	2017.09.19 14:26:22.040077632	0000678	
49	0.000132	-0.000113	1.507092E-5	-6.613477E-5	T	29478	2017.09.19 14:26:22.050077632	0000678	
49	0.000141	-0.000119	1.009024E-5	-7.607287E-5	T	29478	2017.09.19 14:26:22.060077632	0000678	
49	0.000104	-6.635146E-5	2.347085E-5	-7.655458E-5	T	29478	2017.09.19 14:26:22.070077632	0000678	
49	0.000128	-0.000123	1.934352E-5	-2.807149E-5	T	29478	2017.09.19 14:26:22.080077632	0000678	
50	0.000122	-9.957976E-5	8.853000E-7	-7.119051E-5	T	29478	2017.09.19 14:26:22.190165132	0000678	
50	0.000105	-9.523581E-5	9.954567E-6	-4.226165E-5	T	29478	2017.09.19 14:26:22.200165132	0000678	
50	0.000135	-0.000113	1.905034E-5	-7.115116E-5	T	29478	2017.09.19 14:26:22.210165132	0000678	
50	9.029950E-5	-7.607179E-5	2.372755E-5	-4.247453E-5	T	29478	2017.09.19 14:26:22.220165132	0000678	
50	0.000107	-0.000104	1.013859E-5	-2.318913E-5	T	29478	2017.09.19 14:26:22.230165132	0000678	
50	0.000138	-0.000132	2.442987E-5	-3.301872E-5	T	29478	2017.09.19 14:26:22.240165132	0000678	
50	0.000125	-0.000123	1.538031E-5	-1.905527E-5	T	29478	2017.09.19 14:26:22.250165132	0000678	
50	0.000106	-9.910236E-5	1.503821E-5	-3.325019E-5	T	29478	2017.09.19 14:26:22.260165132	0000678	
50	0.000123	-0.000113	2.416748E-5	-4.217312E-5	T	29478	2017.09.19 14:26:22.270165132	0000678	
50	0.000110	-9.521105E-5	1.891333E-5	-5.229859E-5	T	29478	2017.09.19 14:26:22.280165132	0000678	
51	0.000113	-0.000109	1.017777E-5	-2.814819E-5	T	29474	2017.09.19 14:26:22.390252632	0000678	
51	0.000112	-9.937663E-5	4.961992E-6	-5.220790E-5	T	29474	2017.09.19 14:26:22.400252632	0000678	
51	0.000101	-9.012962E-5	1.889441E-5	-4.233974E-5	T	29474	2017.09.19 14:26:22.410252632	0000678	
51	0.000112	-0.000109	1.521385E-5	-1.916932E-5	T	29474	2017.09.19 14:26:22.420252632	0000678	
51	0.000137	-0.000132	3.450609E-5	-1.406101E-5	T	29474	2017.09.19 14:26:22.430252632	0000678	
51	9.763708E-5	-8.021261E-5	1.873498E-5	-5.242078E-5	T	29474	2017.09.19 14:26:22.440252632	0000678	
51	0.000114	-9.086263E-5	-2.918287E-5	-6.213970E-5	T	29474	2017.09.19 14:26:22.450252632	0000678	
51	0.000121	-0.000109	5.080893E-6	-5.212644E-5	T	29474	2017.09.19 14:26:22.460252632	0000678	
51	0.000132	-0.000109	1.900278E-5	-7.118374E-5	T	29474	2017.09.19 14:26:22.470252632	0000678	
51	0.000110	-0.000104	1.509766E-5	-3.320946E-5	T	29474	2017.09.19 14:26:22.480252632	0000678	
52	0.000120	-0.000109	1.910005E-5	-4.718475E-5	T	29478	2017.09.19 14:26:22.590340132	0000678	
52	0.000166	-0.000156	2.463823E-5	-5.182241E-5	T	29478	2017.09.19 14:26:22.600340132	0000678	
52	0.000100	-8.983704E-5	3.394997E-5	-2.840257E-5	T	29478	2017.09.19 14:26:22.610340132	0000678	
52	0.000136	-0.000132	1.431687E-6	-3.292327E-5	T	29478	2017.09.19 14:26:22.620340132	0000678	
52	8.220706E-5	-7.114624E-5	1.468502E-5	-3.847808E-5	T	29478	2017.09.19 14:26:22.630340132	0000678	
52	0.000119	-0.000109	1.010076E-5	-4.714740E-5	T	29478	2017.09.19 14:26:22.640340132	0000678	
52	0.000121	-0.000109	2.409966E-5	-4.720550E-5	T	29478	2017.09.19 14:26:22.650340132	0000678	
52	0.000108	-9.923539E-5	1.000213E-5	-4.222907E-5	T	29478	2017.09.19 14:26:22.660340132	0000678	
52	0.000134	-0.000128	3.443827E-5	-1.909339E-5	T	29478	2017.09.19 14:26:22.670340132	0000678	
52	0.000123	-0.000118	2.430394E-5	-2.313318E-5	T	29478	2017.09.19 14:26:22.680340132	0000678	
53	0.000110	-0.000109	1.025478E-5	-9.148985E-6	T	29455	2017.09.19 14:26:22.790427632	0000678	
53	0.000115	-9.529300E-5	1.887280E-5	-6.229817E-5	T	29455	2017.09.19 14:26:22.800427632	0000678	
53	0.000123	-0.000118	5.264911E-6	-3.305391E-5	T	29455	2017.09.19 14:26:22.810427632	0000678	
53	0.000116	-9.523372E-5	2.387240E-5	-6.231892E-5	T	29455	2017.09.19 14:26:22.820427632	0000678	
53	0.000117	-0.000113	1.924489E-5	-2.315316E-5	T	29455	2017.09.19 14:26:22.830427632	0000678	
53	0.000107	-0.000104	1.917435E-5	-1.422686E-5	T	29455	2017.09.19 14:26:22.840427632	0000678	
53	8.683893E-5	-7.121999E-5	1.464855E-5	-4.747771E-5	T	29455	2017.09.19 14:26:22.850427632	0000678	
53	0.000103	-9.922737E-5	1.059580E-6	-2.819230E-5	T	29455	2017.09.19 14:26:22.860427632	0000678	
53	0.000140	-0.000132	1.374945E-6	-4.692268E-5	T	29455	2017.09.19 14:26:22.870427632	0000678	
53	0.000116	-0.000109	1.137950E-6	-3.811042E-5	T	29455	2017.09.19 14:26:22.880427632	0000678	
54	0.000107	-9.506982E-5	2.395346E-5	-4.231975E-5	T	29462	2017.09.19 14:26:22.990515132	0000678	
54	0.000122	-9.524819E-5	2.883553E-5	-7.133929E-5	T	29462	2017.09.19 14:26:23.000515132	0000678	
54	0.000124	-0.000113	1.514793E-5	-4.713556E-5	T	29462	2017.09.19 14:26:23.010515132	0000678	
54	0.000110	-9.938308E-5	9.825725E-7	-4.719151E-5	T	29462	2017.09.19 14:26:23.020515132	0000678	
54	0.000103	-9.869871E-5	2.915464E-5	-4.309508E-6	T	29462	2017.09.19 14:26:23.030515132	0000678	
54	0.000116	-0.000113	5.245991E-6	-2.309506E-5	T	29462	2017.09.19 14:26:23.040515132	0000678	
54	0.000119	-0.000105	-2.397627E-5	-5.204682E-5	T	29462	2017.09.19 14:26:23.050515132	0000678	
54	0.000148	-0.000142	1.552922E-5	-3.789969E-5	T	29462	2017.09.19 14:26:23.060515132	0000678	
54	0.000115	-9.899181E-5	3.397997E-5	-4.732846E-5	T	29462	2017.09.19 14:26:23.070515132	0000678	
54	0.000113	-0.000109	2.929381E-5	7.717466E-7	T	29462	2017.09.19 14:26:23.080515132	0000678	
55	0.000127	-0.000118	1.922733E-5	-4.211164E-5	T	29464	2017.09.19 14:26:23.190602632	0000678	
55	0.000111	-0.000104	5.078184E-6	-3.816775E-5	T	29464	2017.09.19 14:26:23.200602632	0000678	
55	0.000119	-0.000109	5.101158E-6	-4.712665E-5	T	29464	2017.09.19 14:26:23.210602632	0000678	
55	8.420808E-5	-7.103953E-5	2.368431E-5	-3.851543E-5	T	29464	2017.09.19 14:26:23.220602632	0000678	
55	0.000130	-0.000123	1.530331E-5	-3.805447E-5	T	29464	2017.09.19 14:26:23.230602632	0000678	
55	0.000111	-0.000109	5.214642E-6	-1.912782E-5	T	29464	2017.09.19 14:26:23.240602632	0000678	
55	0.000102	-9.510277E-5	1.499065E-5	-3.328278E-5	T	29464	2017.09.19 14:26:23.250602632	0000678	
55	0.000104	-9.906138E-5	1.505848E-5	-2.825040E-5	T	29464	2017.09.19 14:26:23.260602632	0000678	
55	0.000102	-8.046055E-5	4.695550E-6	-6.236226E-5	T	29464	2017.09.19 14:26:23.270602632	0000678	
55	0.000109	-9.542447E-5	9.147471E-7	-5.222389E-5	T	29464	2017.09.19 14:26:23.280602632	0000678	
56	8.843642E-5	-7.617850E-5	1.472826E-5	-4.243718E-5	T	29480	2017.09.19 14:26:23.390690132	0000678	
56	9.719053E-5	-9.494707E-5	1.506766E-5	-1.428357E-5	T	29480	2017.09.19 14:26:23.400690132	0000678	
56	0.000107	-0.000104	1.013859E-5	-2.318913E-5	T	29480	2017.09.19 14:26:23.410690132	0000678	
56	0.000111	-9.541802E-5	4.894166E-6	-5.724028E-5	T	29480	2017.09.19 14:26:23.420690132	0000678	
56	0.000107	-9.506982E-5	2.395346E-5	-4.231975E-5	T	29480	2017.09.19 14:26:23.430690132	0000678	
56	0.000115	-9.941760E-5	4.941727E-6	-5.720769E-5	T	29480	2017.09.19 14:26:23.440690132	0000678	
56	0.000122	-0.000118	-1.869267E-5	-2.295473E-5	T	29480	2017.09.19 14:26:23.450690132	0000678	
56	0.000114	-0.000109	1.158216E-6	-3.311063E-5	T	29480	2017.09.19 14:26:23.460690132	0000678	
56	0.000127	-0.000118	1.922733E-5	-4.211164E-5	T	29480	2017.09.19 14:26:23.470690132	0000678	
56	9.926228E-5	-8.517111E-5	1.881469E-5	-4.738026E-5	T	29480	2017.09.19 14:26:23.480690132	0000678	
57	9.816822E-5	-9.026283E-5	4.911723E-6	-3.828180E-5	T	29476	2017.09.19 14:26:23.590777632	0000678	
57	0.000147	-0.000142	1.554948E-5	-3.289990E-5	T	29476	2017.09.19 14:26:23.600777632	0000678	
57	0.000109	-9.912868E-5	1.900142E-5	-4.226642E-5	T	29476	2017.09.19 14:26:23.610777632	0000678	
57	0.000109	-9.537704E-5	4.914431E-6	-5.224049E-5	T	29476	2017.09.19 14:26:23.620777632	0000678	
57	0.000150	-0.000142	5.493530E-6	-4.685782E-5	T	29476	2017.09.19 14:26:23.630777632	0000678	
57	9.395212E-5	-8.520407E-5	9.851879E-6	-3.834328E-5	T	29476	2017.09.19 14:26:23.640777632	0000678	
57	8.988882E-5	-7.638547E-5	7.091008E-7	-4.737887E-5	T	29476	2017.09.19 14:26:23.650777632	0000678	
57	0.000102	-9.505534E-5	1.899033E-5	-3.329938E-5	T	29476	2017.09.19 14:26:23.660777632	0000678	
57	9.635352E-5	-8.982257E-5	2.898684E-5	-1.938220E-5	T	29476	2017.09.19 14:26:23.670777632	0000678	
57	0.000144	-0.000113	2.399320E-5	-8.517132E-5	T	29476	2017.09.19 14:26:23.680777632	0000678	
58	0.000111	-0.000104	1.078500E-6	-3.815115E-5	T	29475	2017.09.19 14:26:23.790865132	0000678	
58	0.000121	-0.000104	2.399968E-5	-5.724581E-5	T	29475	2017.09.19 14:26:23.800865132	0000678	
58	0.000148	-0.000137	1.541303E-5	-5.193984E-5	T	29475	2017.09.19 14:26:23.810865132	0000678	
58	0.000119	-0.000104	3.403942E-5	-4.728773E-5	T	29475	2017.09.19 14:26:23.820865132	0000678	
58	8.741281E-5	-7.629706E-5	4.729050E-6	-4.239568E-5	T	29475	2017.09.19 14:26:23.830865132	0000678	
58	0.000106	-9.512910E-5	1.895386E-5	-4.229900E-5	T	29475	2017.09.19 14:26:23.840865132	0000678	
58	0.000129	-0.000123	1.932326E-5	-3.307128E-5	T	29475	2017.09.19 14:26:23.850865132	0000678	
58	9.575490E-5	-7.599420E-5	3.370650E-5	-4.751583E-5	T	29475	2017.09.19 14:26:23.860865132	0000678	
58	0.000101	-9.501437E-5	1.901060E-5	-2.829959E-5	T	29475	2017.09.19 14:26:23.870865132	0000678	
58	8.841380E-5	-8.514042E-5	4.913068E-6	-2.332316E-5	T	29475	2017.09.19 14:26:23.880865132	0000678	
59	9.625487E-5	-9.001489E-5	1.895115E-5	-2.834032E-5	T	29491	2017.09.19 14:26:23.990952632	0000678	
59	0.000103	-9.897298E-5	1.907842E-5	-2.326721E-5	T	29491	2017.09.19 14:26:24.000952632	0000678	
59	0.000117	-0.000104	1.002105E-5	-5.218792E-5	T	29491	2017.09.19 14:26:24.010952632	0000678	
59	0.000111	-0.000104	1.007779E-5	-3.818850E-5	T	29491	2017.09.19 14:26:24.020952632	0000678	
59	0.000122	-0.000104	1.498012E-5	-6.220825E-5	T	29491	2017.09.19 14:26:24.030952632	0000678	
59	0.000106	-9.895467E-5	2.405777E-5	-2.828775E-5	T	29491	2017.09.19 14:26:24.040952632	0000678	
59	9.097252E-5	-7.621947E-5	1.470800E-5	-4.743697E-5	T	29491	2017.09.19 14:26:24.050952632	0000678	
59	0.000119	-0.000109	1.010076E-5	-4.714740E-5	T	29491	2017.09.19 14:26:24.060952632	0000678	
59	0.000107	-9.920261E-5	1.001834E-5	-3.822924E-5	T	29491	2017.09.19 14:26:24.070952632	0000678	
59	0.000120	-0.000113	1.018480E-5	-3.811519E-5	T	29491	2017.09.19 14:26:24.080952632	0000678	
60	9.628084E-5	-8.517756E-5	1.483527E-5	-4.236387E-5	T	29472	2017.09.19 14:26:24.191040132	0000678	
60	0.000116	-9.047398E-5	9.777579E-6	-7.130117E-5	T	29472	2017.09.19 14:26:24.201040132	0000678	
60	0.000131	-0.000113	5.071711E-6	-6.609327E-5	T	29472	2017.09.19 14:26:24.211040132	0000678	
60	9.625487E-5	-9.001489E-5	1.895115E-5	-2.834032E-5	T	29472	2017.09.19 14:26:24.221040132	0000678	
60	0.000131	-0.000119	-1.881020E-5	-5.195352E-5	T	29472	2017.09.19 14:26:24.231040132	0000678	
60	0.000126	-0.000118	1.924354E-5	-3.811181E-5	T	29472	2017.09.19 14:26:24.241040132	0000678	
60	0.000106	-9.910236E-5	1.503821E-5	-3.325019E-5	T	29472	2017.09.19 14:26:24.251040132	0000678	
60	0.000123	-0.000118	1.026452E-5	-3.307466E-5	T	29472	2017.09.19 14:26:24.261040132	0000678	
60	0.000113	-9.925806E-5	1.496120E-5	-5.224940E-5	T	29472	2017.09.19 14:26:24.271040132	0000678	
60	0.000108	-9.923539E-5	1.000213E-5	-4.222907E-5	T	29472	2017.09.19 14:26:24.281040132	0000678	
61	0.000132	-0.000109	1.900278E-5	-7.118374E-5	T	29480	2017.09.19 14:26:24.391127632	0000678	
61	0.000101	-9.017705E-5	1.489472E-5	-4.232314E-5	T	29480	2017.09.19 14:26:24.401127632	0000678	
61	0.000112	-0.000104	1.507740E-5	-3.820925E-5	T	29480	2017.09.19 14:26:24.411127632	0000678	
61	0.000128	-0.000123	1.532357E-5	-3.305468E-5	T	29480	2017.09.19 14:26:24.421127632	0000678	
61	0.000129	-0.000109	1.502336E-5	-6.616735E-5	T	29480	2017.09.19 14:26:24.431127632	0000678	
61	0.000133	-0.000123	1.526683E-5	-4.705410E-5	T	29480	2017.09.19 14:26:24.441127632	0000678	
61	0.000152	-0.000123	2.411210E-5	-8.508986E-5	T	29480	2017.09.19 14:26:24.451127632	0000678	
61	8.804544E-5	-8.010433E-5	1.481230E-5	-3.340497E-5	T	29480	2017.09.19 14:26:24.461127632	0000678	
61	0.000106	-9.021157E-5	1.885388E-5	-5.233932E-5	T	29480	2017.09.19 14:26:24.471127632	0000678	
61	9.456215E-5	-8.514478E-5	1.485148E-5	-3.836403E-5	T	29480	2017.09.19 14:26:24.481127632	0000678	
62	0.000125	-0.000113	5.128453E-6	-5.209385E-5	T	29476	2017.09.19 14:26:24.591215132	0000678	
62	8.802840E-5	-6.599524E-5	3.358760E-5	-4.759729E-5	T	29476	2017.09.19 14:26:24.601215132	0000678	
62	8.420808E-5	-7.103953E-5	2.368431E-5	-3.851543E-5	T	29476	2017.09.19 14:26:24.611215132	0000678	
62	0.000115	-0.000109	1.515711E-5	-3.316873E-5	T	29476	2017.09.19 14:26:24.621215132	0000678	
62	0.000121	-0.000113	1.918409E-5	-3.815254E-5	T	29476	2017.09.19 14:26:24.631215132	0000678	
62	0.000111	-9.916966E-5	1.898115E-5	-4.726621E-5	T	29476	2017.09.19 14:26:24.641215132	0000678	
62	6.367103E-5	-4.710131E-5	1.839935E-5	-3.869019E-5	T	29476	2017.09.19 14:26:24.651215132	0000678	
62	0.000112	-0.000109	1.921354E-5	-1.918592E-5	T	29476	2017.09.19 14:26:24.661215132	0000678	
62	0.000122	-0.000118	5.285176E-6	-2.805412E-5	T	29476	2017.09.19 14:26:24.671215132	0000678	
62	0.000122	-0.000118	-2.861487E-5	-3.914025E-6	T	29476	2017.09.19 14:26:24.681215132	0000678	
63	0.000132	-0.000123	2.428638E-5	-4.209166E-5	T	29498	2017.09.19 14:26:24.791302632	0000678	
63	0.000145	-0.000137	1.043369E-5	-4.691930E-5	T	29498	2017.09.19 14:26:24.801302632	0000678	
63	0.000120	-0.000118	1.532086E-5	-1.909600E-5	T	29498	2017.09.19 14:26:24.811302632	0000678	
63	0.000121	-9.932536E-5	1.890414E-5	-6.626542E-5	T	29498	2017.09.19 14:26:24.821302632	0000678	
63	0.000118	-0.000104	1.902034E-5	-5.222527E-5	T	29498	2017.09.19 14:26:24.831302632	0000678	
63	0.000139	-0.000118	1.910979E-5	-7.111043E-5	T	29498	2017.09.19 14:26:24.841302632	0000678	
63	0.000112	-8.541522E-5	1.471773E-5	-7.136266E-5	T	29498	2017.09.19 14:26:24.851302632	0000678	
63	0.000116	-9.909207E-5	2.896010E-5	-5.230750E-5	T	29498	2017.09.19 14:26:24.861302632	0000678	
63	9.839715E-5	-9.508010E-5	1.003157E-5	-2.326245E-5	T	29498	2017.09.19 14:26:24.871302632	0000678	
63	9.486833E-5	-8.997391E-5	1.897141E-5	-2.334053E-5	T	29498	2017.09.19 14:26:24.881302632	0000678	
64	6.649060E-5	-5.722528E-5	4.539616E-6	-3.355084E-5	T	29480	2017.09.19 14:26:24.991390132	0000678	
64	0.000119	-0.000113	1.920436E-5	-3.315275E-5	T	29480	2017.09.19 14:26:25.001390132	0000678	
64	0.000126	-0.000109	1.003997E-5	-6.214677E-5	T	29480	2017.09.19 14:26:25.011390132	0000678	
64	0.000134	-0.000114	-2.392600E-5	-6.597292E-5	T	29480	2017.09.19 14:26:25.021390132	0000678	
64	0.000120	-9.541418E-5	1.483664E-5	-7.128119E-5	T	29480	2017.09.19 14:26:25.031390132	0000678	
64	8.942595E-5	-8.502186E-5	1.491228E-5	-2.336466E-5	T	29480	2017.09.19 14:26:25.041390132	0000678	
64	0.000121	-0.000110	-1.889695E-5	-4.702705E-5	T	29480	2017.09.19 14:26:25.051390132	0000678	
64	0.000138	-0.000113	1.903008E-5	-7.615095E-5	T	29480	2017.09.19 14:26:25.061390132	0000678	
64	0.000126	-0.000118	2.926302E-5	-3.315352E-5	T	29480	2017.09.19 14:26:25.071390132	0000678	
64	0.000109	-9.487104E-5	3.796857E-5	-3.837802E-5	T	29480	2017.09.19 14:26:25.081390132	0000678	
65	0.000125	-0.000104	1.496391E-5	-6.620808E-5	T	29475	2017.09.19 14:26:25.191477632	0000678	
65	0.000139	-0.000129	-2.367064E-5	-4.685152E-5	T	29475	2017.09.19 14:26:25.201477632	0000678	
65	0.000121	-0.000109	5.080893E-6	-5.212644E-5	T	29475	2017.09.19 14:26:25.211477632	0000678	
65	0.000145	-0.000132	1.933299E-5	-5.699696E-5	T	29475	2017.09.19 14:26:25.221477632	0000678	
65	0.000104	-9.912066E-5	1.005887E-5	-2.822965E-5	T	29475	2017.09.19 14:26:25.231477632	0000678	
65	0.000117	-0.000110	-1.886047E-5	-3.802742E-5	T	29475	2017.09.19 14:26:25.241477632	0000678	
65	0.000137	-0.000132	2.445014E-5	-2.801893E-5	T	29475	2017.09.19 14:26:25.251477632	0000678	
65	0.000127	-0.000113	1.108503E-6	-5.707704E-5	T	29475	2017.09.19 14:26:25.261477632	0000678	
65	9.976973E-5	-9.488133E-5	2.404668E-5	-1.932072E-5	T	29475	2017.09.19 14:26:25.271477632	0000678	
65	0.000119	-0.000118	1.538166E-5	-4.096627E-6	T	29475	2017.09.19 14:26:25.281477632	0000678	
66	0.000110	-9.933565E-5	4.982257E-6	-4.720811E-5	T	29481	2017.09.19 14:26:25.391565132	0000678	
66	0.000120	-0.000118	1.305757E-6	-2.303773E-5	T	29481	2017.09.19 14:26:25.401565132	0000678	
66	0.000110	-9.927637E-5	9.981862E-6	-4.722886E-5	T	29481	2017.09.19 14:26:25.411565132	0000678	
66	8.544004E-5	-7.997495E-5	1.885251E-5	-2.342199E-5	T	29481	2017.09.19 14:26:25.421565132	0000678	
66	0.000100	-9.023633E-5	9.895117E-6	-4.230239E-5	T	29481	2017.09.19 14:26:25.431565132	0000678	
66	0.000118	-9.030799E-5	2.377647E-5	-7.135927E-5	T	29481	2017.09.19 14:26:25.441565132	0000678	
66	7.937884E-5	-6.575113E-5	3.768455E-5	-2.361489E-5	T	29481	2017.09.19 14:26:25.451565132	0000678	
66	9.263369E-5	-9.004784E-5	9.988336E-6	-1.930335E-5	T	29481	2017.09.19 14:26:25.461565132	0000678	
66	7.209022E-5	-6.623080E-5	6.672074E-7	-2.846113E-5	T	29481	2017.09.19 14:26:25.471565132	0000678	
66	0.000112	-9.901012E-5	2.900063E-5	-4.230792E-5	T	29481	2017.09.19 14:26:25.481565132	0000678	
67	0.000131	-0.000123	2.430260E-5	-3.809182E-5	T	29482	2017.09.19 14:26:25.591652632	0000678	
67	0.000124	-0.000118	1.526412E-5	-3.309542E-5	T	29482	2017.09.19 14:26:25.601652632	0000678	
67	0.000135	-0.000123	1.924625E-5	-5.207049E-5	T	29482	2017.09.19 14:26:25.611652632	0000678	
67	0.000107	-0.000104	1.915409E-5	-1.922665E-5	T	29482	2017.09.19 14:26:25.621652632	0000678	
67	9.409570E-5	-8.984088E-5	2.400750E-5	-1.436166E-5	T	29482	2017.09.19 14:26:25.631652632	0000678	
67	0.000103	-8.499326E-5	3.381351E-5	-4.744251E-5	T	29482	2017.09.19 14:26:25.641652632	0000678	
67	0.000123	-0.000110	-1.891721E-5	-5.202684E-5	T	29482	2017.09.19 14:26:25.651652632	0000678	
67	0.000122	-0.000118	5.285176E-6	-2.805412E-5	T	29482	2017.09.19 14:26:25.661652632	0000678	
67	0.000106	-9.512910E-5	1.895386E-5	-4.229900E-5	T	29482	2017.09.19 14:26:25.671652632	0000678	
67	0.000112	-0.000104	2.911682E-5	-2.826777E-5	T	29482	2017.09.19 14:26:25.681652632	0000678	
68	9.419129E-5	-9.002134E-5	1.497173E-5	-2.332393E-5	T	29479	2017.09.19 14:26:25.791740132	0000678	
68	0.000125	-0.000118	1.524386E-5	-3.809521E-5	T	29479	2017.09.19 14:26:25.801740132	0000678	
68	0.000136	-0.000123	3.426533E-5	-4.713295E-5	T	29479	2017.09.19 14:26:25.811740132	0000678	
68	0.000105	-9.946450E-5	-1.893884E-5	-2.810930E-5	T	29479	2017.09.19 14:26:25.821740132	0000678	
68	0.000126	-0.000109	2.405913E-5	-5.720508E-5	T	29479	2017.09.19 14:26:25.831740132	0000678	
68	9.568176E-5	-8.523685E-5	9.835666E-6	-4.234312E-5	T	29479	2017.09.19 14:26:25.841740132	0000678	
68	0.000111	-0.000109	1.021425E-5	-1.914857E-5	T	29479	2017.09.19 14:26:25.851740132	0000678	
68	0.000128	-0.000113	1.910708E-5	-5.715174E-5	T	29479	2017.09.19 14:26:25.861740132	0000678	
68	0.000132	-0.000109	1.900278E-5	-7.118374E-5	T	29479	2017.09.19 14:26:25.871740132	0000678	
68	0.000122	-0.000109	4.315490E-5	-3.328493E-5	T	29479	2017.09.19 14:26:25.881740132	0000678	
69	0.000120	-0.000104	1.900007E-5	-5.722506E-5	T	29474	2017.09.19 14:26:25.991827632	0000678	
69	0.000117	-9.945858E-5	4.921462E-6	-6.220748E-5	T	29474	2017.09.19 14:26:26.001827632	0000678	
69	0.000106	-9.905493E-5	1.903789E-5	-3.326680E-5	T	29474	2017.09.19 14:26:26.011827632	0000678	
69	0.000134	-0.000118	2.916574E-5	-5.715251E-5	T	29474	2017.09.19 14:26:26.021827632	0000678	
69	0.000124	-0.000118	1.244961E-6	-3.803711E-5	T	29474	2017.09.19 14:26:26.031827632	0000678	
69	7.527284E-5	-7.135268E-5	-1.921502E-5	-1.433798E-5	T	29474	2017.09.19 14:26:26.041827632	0000678	
69	0.000145	-0.000124	5.150081E-6	-7.601139E-5	T	29474	2017.09.19 14:26:26.051827632	0000678	
69	0.000145	-0.000128	2.926438E-5	-6.207084E-5	T	29474	2017.09.19 14:26:26.061827632	0000678	
69	9.159694E-5	-8.501541E-5	1.889170E-5	-2.838105E-5	T	29474	2017.09.19 14:26:26.071827632	0000678	
69	0.000103	-9.897298E-5	1.907842E-5	-2.326721E-5	T	29474	2017.09.19 14:26:26.081827632	0000678	
70	0.000154	-0.000142	2.947137E-5	-5.195721E-5	T	29494	2017.09.19 14:26:26.191915132	0000678	
70	0.000103	-9.917995E-5	5.059264E-6	-2.820890E-5	T	29494	2017.09.19 14:26:26.201915132	0000678	
70	0.000108	-0.000104	1.011832E-5	-2.818892E-5	T	29494	2017.09.19 14:26:26.211915132	0000678	
70	0.000151	-0.000142	1.549274E-5	-4.689932E-5	T	29494	2017.09.19 14:26:26.221915132	0000678	
70	9.325235E-5	-8.998856E-5	1.498794E-5	-1.932410E-5	T	29494	2017.09.19 14:26:26.231915132	0000678	
70	0.000132	-0.000123	2.428638E-5	-4.209166E-5	T	29494	2017.09.19 14:26:26.241915132	0000678	
70	0.000110	-9.897734E-5	2.901684E-5	-3.830809E-5	T	29494	2017.09.19 14:26:26.251915132	0000678	
70	8.003749E-5	-6.604005E-5	2.362486E-5	-3.855616E-5	T	29494	2017.09.19 14:26:26.261915132	0000678	
70	8.932525E-5	-7.095374E-5	3.366731E-5	-4.255677E-5	T	29494	2017.09.19 14:26:26.271915132	0000678	
70	0.000120	-9.937279E-5	1.490446E-5	-6.624882E-5	T	29494	2017.09.19 14:26:26.281915132	0000678	
71	0.000120	-0.000104	1.500039E-5	-5.720846E-5	T	29487	2017.09.19 14:26:26.392002632	0000678	
71	0.000123	-0.000109	1.907979E-5	-5.218454E-5	T	29487	2017.09.19 14:26:26.402002632	0000678	
71	0.000129	-0.000123	1.030370E-5	-3.803372E-5	T	29487	2017.09.19 14:26:26.412002632	0000678	
71	0.000104	-9.906138E-5	1.505848E-5	-2.825040E-5	T	29487	2017.09.19 14:26:26.422002632	0000678	
71	0.000125	-0.000104	1.896360E-5	-6.622468E-5	T	29487	2017.09.19 14:26:26.432002632	0000678	
71	0.000127	-0.000113	2.412695E-5	-5.217270E-5	T	29487	2017.09.19 14:26:26.442002632	0000678	
71	0.000112	-0.000104	1.507740E-5	-3.820925E-5	T	29487	2017.09.19 14:26:26.452002632	0000678	
71	8.518803E-5	-8.018192E-5	4.833353E-6	-2.836368E-5	T	29487	2017.09.19 14:26:26.462002632	0000678	
71	0.000117	-0.000113	-2.373551E-5	-1.897488E-5	T	29487	2017.09.19 14:26:26.472002632	0000678	
71	0.000111	-0.000109	1.214958E-6	-1.911122E-5	T	29487	2017.09.19 14:26:26.482002632	0000678	
72	0.000104	-9.514375E-5	1.497038E-5	-3.828257E-5	T	29476	2017.09.19 14:26:26.592090132	0000678	
72	0.000112	-0.000109	1.519764E-5	-2.316915E-5	T	29476	2017.09.19 14:26:26.602090132	0000678	
72	0.000136	-0.000128	1.534655E-5	-4.201358E-5	T	29476	2017.09.19 14:26:26.612090132	0000678	
72	7.792304E-5	-7.590806E-5	1.486201E-5	-9.438563E-6	T	29476	2017.09.19 14:26:26.622090132	0000678	
72	9.979980E-5	-8.030101E-5	1.471503E-5	-5.740397E-5	T	29476	2017.09.19 14:26:26.632090132	0000678	
72	8.876936E-5	-8.005690E-5	1.881198E-5	-3.342157E-5	T	29476	2017.09.19 14:26:26.642090132	0000678	
72	0.000132	-0.000128	5.383811E-6	-3.297245E-5	T	29476	2017.09.19 14:26:26.652090132	0000678	
72	0.000113	-0.000104	1.006158E-5	-4.218834E-5	T	29476	2017.09.19 14:26:26.662090132	0000678	
72	0.000124	-0.000118	3.431936E-5	-1.917485E-5	T	29476	2017.09.19 14:26:26.672090132	0000678	
72	7.127412E-5	-6.594363E-5	1.870226E-5	-1.953621E-5	T	29476	2017.09.19 14:26:26.682090132	0000678	
73	0.000114	-9.966118E-5	-1.903611E-5	-5.210830E-5	T	29491	2017.09.19 14:26:26.792177632	0000678	
73	9.568176E-5	-8.483756E-5	3.389052E-5	-2.844330E-5	T	29491	2017.09.19 14:26:26.802177632	0000678	
73	0.000111	-9.546544E-5	8.944820E-7	-5.722368E-5	T	29491	2017.09.19 14:26:26.812177632	0000678	
73	0.000129	-0.000118	2.420667E-5	-4.713218E-5	T	29491	2017.09.19 14:26:26.822177632	0000678	
73	0.000130	-0.000118	2.920627E-5	-4.715293E-5	T	29491	2017.09.19 14:26:26.832177632	0000678	
73	7.343705E-5	-6.606481E-5	1.466610E-5	-2.851923E-5	T	29491	2017.09.19 14:26:26.842177632	0000678	
73	0.000114	-0.000109	1.517738E-5	-2.816894E-5	T	29491	2017.09.19 14:26:26.852177632	0000678	
73	9.694328E-5	-8.513014E-5	1.883496E-5	-4.238047E-5	T	29491	2017.09.19 14:26:26.862177632	0000678	
73	0.000129	-0.000113	2.410669E-5	-5.717249E-5	T	29491	2017.09.19 14:26:26.872177632	0000678	
73	0.000127	-0.000118	2.924275E-5	-3.815331E-5	T	29491	2017.09.19 14:26:26.882177632	0000678	
74	9.159694E-5	-8.501541E-5	1.889170E-5	-2.838105E-5	T	29486	2017.09.19 14:26:26.992265132	0000678	
74	0.000156	-0.000151	5.637018E-6	-3.778488E-5	T	29486	2017.09.19 14:26:27.002265132	0000678	
74	0.000124	-0.000109	1.505984E-5	-5.716773E-5	T	29486	2017.09.19 14:26:27.012265132	0000678	
74	9.620811E-5	-9.026928E-5	9.323041E-7	-3.326541E-5	T	29486	2017.09.19 14:26:27.022265132	0000678	
74	0.000107	-9.914333E-5	1.501795E-5	-3.824999E-5	T	29486	2017.09.19 14:26:27.032265132	0000678	
74	0.000125	-0.000113	3.416669E-5	-4.221462E-5	T	29486	2017.09.19 14:26:27.042265132	0000678	
74	9.261209E-5	-8.510381E-5	1.487175E-5	-3.336424E-5	T	29486	2017.09.19 14:26:27.052265132	0000678	
74	0.000109	-0.000104	2.413748E-5	-2.324723E-5	T	29486	2017.09.19 14:26:27.062265132	0000678	
74	0.000132	-0.000123	1.928678E-5	-4.207091E-5	T	29486	2017.09.19 14:26:27.072265132	0000678	
74	0.000114	-0.000109	1.517738E-5	-2.816894E-5	T	29486	2017.09.19 14:26:27.082265132	0000678	
75	0.000110	-0.000104	2.411722E-5	-2.824702E-5	T	29483	2017.09.19 14:26:27.192352632	0000678	
75	0.000114	-0.000113	1.282783E-6	-1.407884E-5	T	29483	2017.09.19 14:26:27.202352632	0000678	
75	0.000125	-0.000118	1.524386E-5	-3.809521E-5	T	29483	2017.09.19 14:26:27.212352632	0000678	
75	0.000120	-0.000109	2.911953E-5	-4.222646E-5	T	29483	2017.09.19 14:26:27.222352632	0000678	
75	0.000107	-0.000104	1.515440E-5	-1.921005E-5	T	29483	2017.09.19 14:26:27.232352632	0000678	
75	0.000140	-0.000109	1.894604E-5	-8.518316E-5	T	29483	2017.09.19 14:26:27.242352632	0000678	
75	0.000130	-0.000118	1.518711E-5	-5.209462E-5	T	29483	2017.09.19 14:26:27.252352632	0000678	
75	0.000105	-0.000104	5.195722E-6	-9.168966E-6	T	29483	2017.09.19 14:26:27.262352632	0000678	
75	0.000126	-0.000113	2.914682E-5	-4.719366E-5	T	29483	2017.09.19 14:26:27.272352632	0000678	
75	0.000107	-0.000104	2.421449E-5	-4.248026E-6	T	29483	2017.09.19 14:26:27.282352632	0000678	
76	0.000120	-0.000109	1.510037E-5	-4.716815E-5	T	29472	2017.09.19 14:26:27.392440132	0000678	
76	0.000119	-0.000104	5.001177E-6	-5.716696E-5	T	29472	2017.09.19 14:26:27.402440132	0000678	
76	0.000107	-9.920261E-5	1.001834E-5	-3.822924E-5	T	29472	2017.09.19 14:26:27.412440132	0000678	
76	0.000105	-9.946450E-5	-1.893884E-5	-2.810930E-5	T	29472	2017.09.19 14:26:27.422440132	0000678	
76	8.458132E-5	-7.984191E-5	2.388860E-5	-1.444312E-5	T	29472	2017.09.19 14:26:27.432440132	0000678	
76	0.000148	-0.000132	5.297622E-6	-6.593849E-5	T	29472	2017.09.19 14:26:27.442440132	0000678	
76	0.000143	-0.000123	1.016995E-5	-7.103235E-5	T	29472	2017.09.19 14:26:27.452440132	0000678	
76	0.000103	-9.499606E-5	2.398994E-5	-3.332013E-5	T	29472	2017.09.19 14:26:27.462440132	0000678	
76	9.022749E-5	-8.998420E-5	5.049526E-6	-4.283223E-6	T	29472	2017.09.19 14:26:27.472440132	0000678	
76	0.000109	-9.912868E-5	1.900142E-5	-4.226642E-5	T	29472	2017.09.19 14:26:27.482440132	0000678	
77	0.000125	-0.000123	1.365207E-6	-2.299700E-5	T	29480	2017.09.19 14:26:27.592527632	0000678	
77	0.000159	-0.000151	1.060015E-5	-4.680525E-5	T	29480	2017.09.19 14:26:27.602527632	0000678	
77	0.000177	-0.000170	1.826768E-6	-4.661312E-5	T	29480	2017.09.19 14:26:27.612527632	0000678	
77	0.000102	-9.463339E-5	3.808611E-5	-9.379234E-6	T	29480	2017.09.19 14:26:27.622527632	0000678	
77	7.982481E-5	-7.599001E-5	1.482148E-5	-1.943815E-5	T	29480	2017.09.19 14:26:27.632527632	0000678	
77	9.029950E-5	-8.488237E-5	2.392778E-5	-1.940218E-5	T	29480	2017.09.19 14:26:27.642527632	0000678	
77	0.000153	-0.000147	5.573246E-6	-4.181730E-5	T	29480	2017.09.19 14:26:27.652527632	0000678	
77	0.000124	-0.000113	3.418291E-5	-3.821479E-5	T	29480	2017.09.19 14:26:27.662527632	0000678	
77	0.000109	-0.000104	2.917356E-5	-1.426836E-5	T	29480	2017.09.19 14:26:27.672527632	0000678	
77	0.000150	-0.000147	1.964915E-5	-2.287619E-5	T	29480	2017.09.19 14:26:27.682527632	0000678	
78	8.189017E-5	-8.000791E-5	9.889701E-6	-1.438502E-5	T	29482	2017.09.19 14:26:27.792615132	0000678	
78	9.962429E-5	-9.497339E-5	1.903086E-5	-2.329980E-5	T	29482	2017.09.19 14:26:27.802615132	0000678	
78	9.803061E-5	-8.527782E-5	9.815401E-6	-4.734291E-5	T	29482	2017.09.19 14:26:27.812615132	0000678	
78	0.000107	-9.920261E-5	1.001834E-5	-3.822924E-5	T	29482	2017.09.19 14:26:27.822615132	0000678	
78	0.000115	-0.000113	1.026181E-5	-1.911598E-5	T	29482	2017.09.19 14:26:27.832615132	0000678	
78	0.000149	-0.000147	-1.829111E-5	-8.719074E-6	T	29482	2017.09.19 14:26:27.842615132	0000678	
78	0.000140	-0.000137	5.511087E-6	-2.789934E-5	T	29482	2017.09.19 14:26:27.852615132	0000678	
78	0.000107	-9.899565E-5	2.403750E-5	-3.328755E-5	T	29482	2017.09.19 14:26:27.862615132	0000678	
78	0.000125	-0.000113	3.818259E-5	-3.823139E-5	T	29482	2017.09.19 14:26:27.872615132	0000678	
78	0.000128	-0.000128	5.481084E-6	-8.973455E-6	T	29482	2017.09.19 14:26:27.882615132	0000678	
79	9.839715E-5	-9.508010E-5	1.003157E-5	-2.326245E-5	T	29483	2017.09.19 14:26:27.992702632	0000678	
79	9.722140E-5	-9.010329E-5	1.493120E-5	-3.332351E-5	T	29483	2017.09.19 14:26:28.002702632	0000678	
79	0.000129	-0.000123	1.030370E-5	-3.803372E-5	T	29483	2017.09.19 14:26:28.012702632	0000678	
79	0.000125	-0.000113	2.414722E-5	-4.717291E-5	T	29483	2017.09.19 14:26:28.022702632	0000678	
79	0.000104	-9.906138E-5	1.505848E-5	-2.825040E-5	T	29483	2017.09.19 14:26:28.032702632	0000678	
79	0.000109	-0.000104	-1.885913E-5	-2.306878E-5	T	29483	2017.09.19 14:26:28.042702632	0000678	
79	8.927486E-5	-7.168240E-5	-2.434838E-5	-4.731585E-5	T	29483	2017.09.19 14:26:28.052702632	0000678	
79	0.000117	-0.000104	3.405968E-5	-4.228794E-5	T	29483	2017.09.19 14:26:28.062702632	0000678	
79	0.000127	-9.904081E-5	4.290225E-5	-6.636502E-5	T	29483	2017.09.19 14:26:28.072702632	0000678	
79	0.000126	-0.000118	1.924354E-5	-3.811181E-5	T	29483	2017.09.19 14:26:28.082702632	0000678	
80	0.000101	-9.501437E-5	1.901060E-5	-2.829959E-5	T	29471	2017.09.19 14:26:28.192790132	0000678	
80	0.000136	-0.000132	5.431372E-6	-3.293987E-5	T	29471	2017.09.19 14:26:28.202790132	0000678	
80	0.000113	-0.000109	1.017777E-5	-2.814819E-5	T	29471	2017.09.19 14:26:28.212790132	0000678	
80	9.501579E-5	-8.017163E-5	1.875524E-5	-4.742099E-5	T	29471	2017.09.19 14:26:28.222790132	0000678	
80	0.000100	-9.890567E-5	1.513548E-5	-9.251198E-6	T	29471	2017.09.19 14:26:28.232790132	0000678	
80	0.000113	-0.000109	-1.878346E-5	-1.902822E-5	T	29471	2017.09.19 14:26:28.242790132	0000678	
80	0.000106	-9.926190E-5	5.018734E-6	-3.820849E-5	T	29471	2017.09.19 14:26:28.252790132	0000678	
80	0.000106	-9.926190E-5	5.018734E-6	-3.820849E-5	T	29471	2017.09.19 14:26:28.262790132	0000678	
80	0.000137	-0.000128	1.532628E-5	-4.701337E-5	T	29471	2017.09.19 14:26:28.272790132	0000678	
80	0.000143	-0.000128	1.526548E-5	-6.201274E-5	T	29471	2017.09.19 14:26:28.282790132	0000678	
81	0.000105	-9.025900E-5	1.485419E-5	-5.232272E-5	T	29473	2017.09.19 14:26:28.392877632	0000678	
81	9.720597E-5	-9.485866E-5	1.908761E-5	-9.300383E-6	T	29473	2017.09.19 14:26:28.402877632	0000678	
81	0.000112	-0.000104	2.409695E-5	-3.324681E-5	T	29473	2017.09.19 14:26:28.412877632	0000678	
81	0.000136	-0.000128	2.436205E-5	-3.805109E-5	T	29473	2017.09.19 14:26:28.422877632	0000678	
81	0.000102	-8.046055E-5	4.695550E-6	-6.236226E-5	T	29473	2017.09.19 14:26:28.432877632	0000678	
81	9.962429E-5	-9.497339E-5	1.903086E-5	-2.329980E-5	T	29473	2017.09.19 14:26:28.442877632	0000678	
81	0.000138	-0.000119	5.110896E-6	-7.105233E-5	T	29473	2017.09.19 14:26:28.452877632	0000678	
81	0.000117	-9.036727E-5	1.877687E-5	-7.133852E-5	T	29473	2017.09.19 14:26:28.462877632	0000678	
81	0.000139	-0.000128	1.030641E-5	-5.199241E-5	T	29473	2017.09.19 14:26:28.472877632	0000678	
81	0.000135	-0.000128	2.938192E-5	-3.307205E-5	T	29473	2017.09.19 14:26:28.482877632	0000678	
82	0.000113	-9.017495E-5	2.881256E-5	-6.238040E-5	T	29493	2017.09.19 14:26:28.592965132	0000678	
82	0.000137	-0.000123	1.922598E-5	-5.707028E-5	T	29493	2017.09.19 14:26:28.602965132	0000678	
82	0.000121	-0.000113	2.920357E-5	-3.319425E-5	T	29493	2017.09.19 14:26:28.612965132	0000678	
82	9.908078E-5	-9.014426E-5	1.491093E-5	-3.832330E-5	T	29493	2017.09.19 14:26:28.622965132	0000678	
82	0.000117	-0.000109	1.913653E-5	-3.818512E-5	T	29493	2017.09.19 14:26:28.632965132	0000678	
82	8.280097E-5	-6.622051E-5	1.458910E-5	-4.751844E-5	T	29493	2017.09.19 14:26:28.642965132	0000678	
82	0.000108	-9.893636E-5	2.903711E-5	-3.330830E-5	T	29493	2017.09.19 14:26:28.652965132	0000678	
82	0.000122	-0.000109	3.411913E-5	-4.224721E-5	T	29493	2017.09.19 14:26:28.662965132	0000678	
82	0.000101	-9.501437E-5	1.901060E-5	-2.829959E-5	T	29493	2017.09.19 14:26:28.672965132	0000678	
82	0.000126	-0.000118	1.522764E-5	-4.209504E-5	T	29493	2017.09.19 14:26:28.682965132	0000678	
83	0.000112	-8.541522E-5	1.471773E-5	-7.136266E-5	T	29483	2017.09.19 14:26:28.793052632	0000678	
83	0.000130	-0.000123	1.930299E-5	-3.807107E-5	T	29483	2017.09.19 14:26:28.803052632	0000678	
83	9.456215E-5	-8.514478E-5	1.485148E-5	-3.836403E-5	T	29483	2017.09.19 14:26:28.813052632	0000678	
83	6.746851E-5	-6.582715E-5	1.478364E-5	4.795559E-7	T	29483	2017.09.19 14:26:28.823052632	0000678	
83	9.659710E-5	-9.500635E-5	1.006805E-5	-1.426282E-5	T	29483	2017.09.19 14:26:28.833052632	0000678	
83	0.000135	-0.000132	1.451952E-6	-2.792348E-5	T	29483	2017.09.19 14:26:28.843052632	0000678	
83	0.000109	-0.000104	2.413748E-5	-2.324723E-5	T	29483	2017.09.19 14:26:28.853052632	0000678	
83	0.000107	-8.529404E-5	1.875390E-5	-6.237963E-5	T	29483	2017.09.19 14:26:28.863052632	0000678	
83	0.000126	-0.000113	1.912735E-5	-5.215195E-5	T	29483	2017.09.19 14:26:28.873052632	0000678	
83	9.058697E-5	-8.992492E-5	1.004913E-5	-4.303974E-6	T	29483	2017.09.19 14:26:28.883052632	0000678	
84	0.000106	-0.000104	1.919462E-5	-9.227067E-6	T	29482	2017.09.19 14:26:28.993140132	0000678	
84	0.000114	-0.000109	5.157900E-6	-3.312723E-5	T	29482	2017.09.19 14:26:29.003140132	0000678	
84	0.000149	-0.000137	1.539276E-5	-5.693963E-5	T	29482	2017.09.19 14:26:29.013140132	0000678	
84	0.000137	-0.000109	1.496257E-5	-8.116673E-5	T	29482	2017.09.19 14:26:29.023140132	0000678	
84	0.000126	-0.000118	5.228433E-6	-4.205354E-5	T	29482	2017.09.19 14:26:29.033140132	0000678	
84	8.532878E-5	-6.130298E-5	1.448911E-5	-5.755875E-5	T	29482	2017.09.19 14:26:29.043140132	0000678	
84	9.330059E-5	-7.997931E-5	2.879093E-5	-3.846287E-5	T	29482	2017.09.19 14:26:29.053140132	0000678	
84	0.000110	-0.000109	1.529491E-5	8.298472E-7	T	29482	2017.09.19 14:26:29.063140132	0000678	
84	0.000109	-9.917611E-5	1.500173E-5	-4.224982E-5	T	29482	2017.09.19 14:26:29.073140132	0000678	
84	9.979980E-5	-8.030101E-5	1.471503E-5	-5.740397E-5	T	29482	2017.09.19 14:26:29.083140132	0000678	
85	0.000120	-9.541418E-5	1.483664E-5	-7.128119E-5	T	29472	2017.09.19 14:26:29.193227632	0000678	
85	0.000129	-0.000113	2.410669E-5	-5.717249E-5	T	29472	2017.09.19 14:26:29.203227632	0000678	
85	0.000113	-9.925806E-5	1.496120E-5	-5.224940E-5	T	29472	2017.09.19 14:26:29.213227632	0000678	
85	0.000106	-9.910236E-5	1.503821E-5	-3.325019E-5	T	29472	2017.09.19 14:26:29.223227632	0000678	
85	0.000124	-0.000118	5.244646E-6	-3.805371E-5	T	29472	2017.09.19 14:26:29.233227632	0000678	
85	0.000113	-0.000109	-1.879968E-5	-2.302805E-5	T	29472	2017.09.19 14:26:29.243227632	0000678	
85	0.000110	-0.000104	1.509766E-5	-3.320946E-5	T	29472	2017.09.19 14:26:29.253227632	0000678	
85	0.000110	-0.000104	1.509766E-5	-3.320946E-5	T	29472	2017.09.19 14:26:29.263227632	0000678	
85	0.000105	-9.011131E-5	2.387375E-5	-4.736028E-5	T	29472	2017.09.19 14:26:29.273227632	0000678	
85	7.639372E-5	-6.605836E-5	1.864552E-5	-3.353562E-5	T	29472	2017.09.19 14:26:29.283227632	0000678	
86	0.000113	-9.895084E-5	3.400023E-5	-4.232867E-5	T	29467	2017.09.19 14:26:29.393315132	0000678	
86	0.000136	-0.000128	3.438152E-5	-3.309280E-5	T	29467	2017.09.19 14:26:29.403315132	0000678	
86	9.749872E-5	-9.504732E-5	1.004779E-5	-1.926262E-5	T	29467	2017.09.19 14:26:29.413315132	0000678	
86	0.000112	-9.937663E-5	4.961992E-6	-5.220790E-5	T	29467	2017.09.19 14:26:29.423315132	0000678	
86	0.000124	-0.000118	5.244646E-6	-3.805371E-5	T	29467	2017.09.19 14:26:29.433315132	0000678	
86	9.259050E-5	-8.013066E-5	1.877551E-5	-4.242120E-5	T	29467	2017.09.19 14:26:29.443315132	0000678	
86	0.000118	-0.000109	2.413614E-5	-3.820587E-5	T	29467	2017.09.19 14:26:29.453315132	0000678	
86	0.000113	-0.000109	1.919733E-5	-2.318575E-5	T	29467	2017.09.19 14:26:29.463315132	0000678	
86	0.000137	-0.000132	-1.854647E-5	-2.784047E-5	T	29467	2017.09.19 14:26:29.473315132	0000678	
86	0.000134	-0.000110	9.983226E-6	-7.614618E-5	T	29467	2017.09.19 14:26:29.483315132	0000678	
87	0.000130	-0.000118	2.920627E-5	-4.715293E-5	T	29466	2017.09.19 14:26:29.593402632	0000678	
87	0.000120	-0.000104	2.901955E-5	-5.226677E-5	T	29466	2017.09.19 14:26:29.603402632	0000678	
87	0.000103	-9.021802E-5	1.487446E-5	-4.732293E-5	T	29466	2017.09.19 14:26:29.613402632	0000678	
87	0.000110	-9.521105E-5	1.891333E-5	-5.229859E-5	T	29466	2017.09.19 14:26:29.623402632	0000678	
87	0.000113	-0.000104	1.907708E-5	-3.822585E-5	T	29466	2017.09.19 14:26:29.633402632	0000678	
87	9.962429E-5	-9.497339E-5	1.903086E-5	-2.329980E-5	T	29466	2017.09.19 14:26:29.643402632	0000678	
87	0.000120	-0.000113	2.420396E-5	-3.317350E-5	T	29466	2017.09.19 14:26:29.653402632	0000678	
87	0.000114	-0.000109	5.157900E-6	-3.312723E-5	T	29466	2017.09.19 14:26:29.663402632	0000678	
87	0.000127	-0.000119	-1.876967E-5	-4.195394E-5	T	29466	2017.09.19 14:26:29.673402632	0000678	
87	0.000145	-0.000142	1.960591E-5	-1.891709E-5	T	29466	2017.09.19 14:26:29.683402632	0000678	
88	0.000121	-0.000109	5.080893E-6	-5.212644E-5	T	29480	2017.09.19 14:26:29.793490132	0000678	
88	0.000104	-9.509632E-5	1.897007E-5	-3.829917E-5	T	29480	2017.09.19 14:26:29.803490132	0000678	
88	0.000104	-9.001105E-5	2.889362E-5	-4.238124E-5	T	29480	2017.09.19 14:26:29.813490132	0000678	
88	0.000105	-8.519378E-5	2.377377E-5	-5.740059E-5	T	29480	2017.09.19 14:26:29.823490132	0000678	
88	0.000112	-9.937663E-5	4.961992E-6	-5.220790E-5	T	29480	2017.09.19 14:26:29.833490132	0000678	
88	0.000126	-0.000118	1.924354E-5	-3.811181E-5	T	29480	2017.09.19 14:26:29.843490132	0000678	
88	0.000118	-0.000109	2.413614E-5	-3.820587E-5	T	29480	2017.09.19 14:26:29.853490132	0000678	
88	0.000124	-0.000104	4.301844E-5	-5.232487E-5	T	29480	2017.09.19 14:26:29.863490132	0000678	
88	9.026073E-5	-8.512212E-5	9.892409E-6	-2.834370E-5	T	29480	2017.09.19 14:26:29.873490132	0000678	
88	0.000113	-0.000109	1.017777E-5	-2.814819E-5	T	29480	2017.09.19 14:26:29.883490132	0000678	
89	9.808670E-5	-9.498804E-5	1.504739E-5	-1.928337E-5	T	29490	2017.09.19 14:26:29.993577632	0000678	
89	0.000118	-0.000109	2.413614E-5	-3.820587E-5	T	29490	2017.09.19 14:26:30.003577632	0000678	
89	0.000102	-9.007034E-5	2.389401E-5	-4.236049E-5	T	29490	2017.09.19 14:26:30.013577632	0000678	
89	0.000119	-0.000109	1.912032E-5	-4.218496E-5	T	29490	2017.09.19 14:26:30.023577632	0000678	
89	0.000131	-0.000118	1.918680E-5	-5.211122E-5	T	29490	2017.09.19 14:26:30.033577632	0000678	
89	0.000101	-8.495229E-5	3.383377E-5	-4.244272E-5	T	29490	2017.09.19 14:26:30.043577632	0000678	
89	0.000117	-0.000104	1.021758E-6	-5.215057E-5	T	29490	2017.09.19 14:26:30.053577632	0000678	
89	0.000136	-0.000132	2.950649E-5	-1.404026E-5	T	29490	2017.09.19 14:26:30.063577632	0000678	
89	0.000102	-8.987802E-5	3.392970E-5	-3.340236E-5	T	29490	2017.09.19 14:26:30.073577632	0000678	
89	0.000116	-0.000109	5.137635E-6	-3.812702E-5	T	29490	2017.09.19 14:26:30.083577632	0000678	
90	0.000108	-0.000104	5.118715E-6	-2.816817E-5	T	29486	2017.09.19 14:26:30.193665132	0000678	
90	0.000126	-0.000123	2.439987E-5	-1.409283E-5	T	29486	2017.09.19 14:26:30.203665132	0000678	
90	0.000129	-0.000104	2.394294E-5	-7.124523E-5	T	29486	2017.09.19 14:26:30.213665132	0000678	
90	0.000108	-8.020877E-5	2.867744E-5	-6.646170E-5	T	29486	2017.09.19 14:26:30.223665132	0000678	
90	8.325863E-5	-7.627074E-5	7.658431E-7	-3.337946E-5	T	29486	2017.09.19 14:26:30.233665132	0000678	
90	0.000146	-0.000142	1.556975E-5	-2.790011E-5	T	29486	2017.09.19 14:26:30.243665132	0000678	
90	0.000116	-0.000113	5.245991E-6	-2.309506E-5	T	29486	2017.09.19 14:26:30.253665132	0000678	
90	0.000137	-0.000118	1.913006E-5	-6.611064E-5	T	29486	2017.09.19 14:26:30.263665132	0000678	
90	6.643794E-5	-5.701832E-5	1.855878E-5	-2.860915E-5	T	29486	2017.09.19 14:26:30.273665132	0000678	
90	0.000133	-0.000128	2.943866E-5	-1.907264E-5	T	29486	2017.09.19 14:26:30.283665132	0000678	
91	9.492102E-5	-7.992003E-5	3.379053E-5	-3.848362E-5	T	29477	2017.09.19 14:26:30.393752632	0000678	
91	0.000115	-0.000104	1.504092E-5	-4.720888E-5	T	29477	2017.09.19 14:26:30.403752632	0000678	
91	0.000124	-0.000118	1.526412E-5	-3.309542E-5	T	29477	2017.09.19 14:26:30.413752632	0000678	
91	0.000113	-0.000104	1.006158E-5	-4.218834E-5	T	29477	2017.09.19 14:26:30.423752632	0000678	
91	0.000119	-0.000118	1.034152E-5	-1.407546E-5	T	29477	2017.09.19 14:26:30.433752632	0000678	
91	0.000107	-9.041854E-5	4.834716E-6	-5.728101E-5	T	29477	2017.09.19 14:26:30.443752632	0000678	
91	0.000126	-0.000113	1.512766E-5	-5.213535E-5	T	29477	2017.09.19 14:26:30.453752632	0000678	
91	0.000125	-0.000104	2.897902E-5	-6.226635E-5	T	29477	2017.09.19 14:26:30.463752632	0000678	
91	8.915716E-5	-8.494165E-5	1.892818E-5	-1.938143E-5	T	29477	2017.09.19 14:26:30.473752632	0000678	
91	0.000101	-9.012962E-5	1.889441E-5	-4.233974E-5	T	29477	2017.09.19 14:26:30.483752632	0000678	
92	0.000104	-9.042499E-5	8.552967E-7	-5.226462E-5	T	29477	2017.09.19 14:26:30.593840132	0000678	
92	0.000123	-0.000113	1.149034E-6	-4.707746E-5	T	29477	2017.09.19 14:26:30.603840132	0000678	
92	9.357884E-5	-9.008062E-5	9.972124E-6	-2.330318E-5	T	29477	2017.09.19 14:26:30.613840132	0000678	
92	9.868131E-5	-8.015332E-5	2.373458E-5	-5.244153E-5	T	29477	2017.09.19 14:26:30.623840132	0000678	
92	0.000122	-0.000104	4.980912E-6	-6.216675E-5	T	29477	2017.09.19 14:26:30.633840132	0000678	
92	0.000109	-9.917611E-5	1.500173E-5	-4.224982E-5	T	29477	2017.09.19 14:26:30.643840132	0000678	
92	0.000117	-0.000113	2.932110E-5	-4.195459E-6	T	29477	2017.09.19 14:26:30.653840132	0000678	
92	0.000115	-0.000113	5.262203E-6	-1.909523E-5	T	29477	2017.09.19 14:26:30.663840132	0000678	
92	0.000145	-0.000128	1.524927E-5	-6.601257E-5	T	29477	2017.09.19 14:26:30.673840132	0000678	
92	0.000123	-9.920680E-5	2.890336E-5	-6.630692E-5	T	29477	2017.09.19 14:26:30.683840132	0000678	
93	0.000111	-9.921709E-5	1.498147E-5	-4.724961E-5	T	29482	2017.09.19 14:26:30.793927632	0000678	
93	0.000120	-0.000113	2.420396E-5	-3.317350E-5	T	29482	2017.09.19 14:26:30.803927632	0000678	
93	0.000111	-9.013398E-5	2.883282E-5	-5.738061E-5	T	29482	2017.09.19 14:26:30.813927632	0000678	
93	0.000111	-9.916966E-5	1.898115E-5	-4.726621E-5	T	29482	2017.09.19 14:26:30.823927632	0000678	
93	0.000112	-8.541522E-5	1.471773E-5	-7.136266E-5	T	29482	2017.09.19 14:26:30.833927632	0000678	
93	0.000115	-9.941760E-5	4.941727E-6	-5.720769E-5	T	29482	2017.09.19 14:26:30.843927632	0000678	
93	0.000136	-0.000118	1.513037E-5	-6.609404E-5	T	29482	2017.09.19 14:26:30.853927632	0000678	
93	0.000104	-9.888092E-5	2.409424E-5	-1.928813E-5	T	29482	2017.09.19 14:26:30.863927632	0000678	
93	9.808670E-5	-9.498804E-5	1.504739E-5	-1.928337E-5	T	29482	2017.09.19 14:26:30.873927632	0000678	
93	0.000124	-0.000123	1.544111E-5	-4.055895E-6	T	29482	2017.09.19 14:26:30.883927632	0000678	
94	9.996499E-5	-8.009404E-5	2.873419E-5	-5.246228E-5	T	29471	2017.09.19 14:26:30.994015132	0000678	
94	0.000120	-0.000113	1.518441E-5	-3.813594E-5	T	29471	2017.09.19 14:26:31.004015132	0000678	
94	0.000101	-9.012962E-5	1.889441E-5	-4.233974E-5	T	29471	2017.09.19 14:26:31.014015132	0000678	
94	0.000101	-9.017705E-5	1.489472E-5	-4.232314E-5	T	29471	2017.09.19 14:26:31.024015132	0000678	
94	9.456215E-5	-8.514478E-5	1.485148E-5	-3.836403E-5	T	29471	2017.09.19 14:26:31.034015132	0000678	
94	0.000156	-0.000132	3.425480E-5	-7.605842E-5	T	29471	2017.09.19 14:26:31.044015132	0000678	
94	0.000129	-0.000104	2.394294E-5	-7.124523E-5	T	29471	2017.09.19 14:26:31.054015132	0000678	
94	0.000133	-0.000128	1.538302E-5	-3.301395E-5	T	29471	2017.09.19 14:26:31.064015132	0000678	
94	0.000121	-0.000113	1.016859E-5	-4.211502E-5	T	29471	2017.09.19 14:26:31.074015132	0000678	
94	0.000137	-0.000114	5.031180E-6	-7.609285E-5	T	29471	2017.09.19 14:26:31.084015132	0000678	
95	0.000118	-0.000113	1.922462E-5	-2.815296E-5	T	29480	2017.09.19 14:26:31.194102632	0000678	
95	0.000114	-0.000113	1.028207E-5	-1.411619E-5	T	29480	2017.09.19 14:26:31.204102632	0000678	
95	9.568176E-5	-8.523685E-5	9.835666E-6	-4.234312E-5	T	29480	2017.09.19 14:26:31.214102632	0000678	
95	0.000110	-9.003372E-5	3.385269E-5	-5.240157E-5	T	29480	2017.09.19 14:26:31.224102632	0000678	
95	0.000146	-0.000137	1.543329E-5	-4.694005E-5	T	29480	2017.09.19 14:26:31.234102632	0000678	
95	0.000117	-0.000113	1.022533E-5	-2.811561E-5	T	29480	2017.09.19 14:26:31.244102632	0000678	
95	0.000110	-9.897734E-5	2.901684E-5	-3.830809E-5	T	29480	2017.09.19 14:26:31.254102632	0000678	
95	9.523655E-5	-8.509736E-5	1.885117E-5	-3.838063E-5	T	29480	2017.09.19 14:26:31.264102632	0000678	
95	7.548510E-5	-7.108260E-5	9.746213E-6	-2.345796E-5	T	29480	2017.09.19 14:26:31.274102632	0000678	
95	0.000131	-0.000128	5.404077E-6	-2.797266E-5	T	29480	2017.09.19 14:26:31.284102632	0000678	
96	0.000125	-0.000123	5.364891E-6	-2.301360E-5	T	29478	2017.09.19 14:26:31.394190132	0000678	
96	0.000142	-0.000132	2.939300E-5	-4.203909E-5	T	29478	2017.09.19 14:26:31.404190132	0000678	
96	0.000103	-9.520303E-5	9.970779E-6	-3.826182E-5	T	29478	2017.09.19 14:26:31.414190132	0000678	
96	0.000118	-0.000104	1.902034E-5	-5.222527E-5	T	29478	2017.09.19 14:26:31.424190132	0000678	
96	0.000128	-9.564748E-5	4.780682E-6	-8.523911E-5	T	29478	2017.09.19 14:26:31.434190132	0000678	
96	9.124144E-5	-9.011358E-5	1.009312E-6	-1.426621E-5	T	29478	2017.09.19 14:26:31.444190132	0000678	
96	9.168424E-5	-9.000687E-5	1.000860E-5	-1.430356E-5	T	29478	2017.09.19 14:26:31.454190132	0000678	
96	0.000118	-0.000104	1.502065E-5	-5.220867E-5	T	29478	2017.09.19 14:26:31.464190132	0000678	
96	0.000113	-0.000109	1.919733E-5	-2.318575E-5	T	29478	2017.09.19 14:26:31.474190132	0000678	
96	0.000120	-0.000104	1.900007E-5	-5.722506E-5	T	29478	2017.09.19 14:26:31.484190132	0000678	
97	0.000129	-0.000104	2.394294E-5	-7.124523E-5	T	29484	2017.09.19 14:26:31.594277632	0000678	
97	0.000121	-0.000113	2.920357E-5	-3.319425E-5	T	29484	2017.09.19 14:26:31.604277632	0000678	
97	0.000112	-9.942405E-5	9.623074E-7	-5.219130E-5	T	29484	2017.09.19 14:26:31.614277632	0000678	
97	0.000133	-0.000113	2.407021E-5	-6.617212E-5	T	29484	2017.09.19 14:26:31.624277632	0000678	
97	0.000115	-0.000113	1.026181E-5	-1.911598E-5	T	29484	2017.09.19 14:26:31.634277632	0000678	
97	0.000128	-0.000123	1.324677E-6	-3.299658E-5	T	29484	2017.09.19 14:26:31.644277632	0000678	
97	0.000131	-0.000128	1.404392E-6	-2.795606E-5	T	29484	2017.09.19 14:26:31.654277632	0000678	
97	0.000142	-0.000132	2.437313E-5	-4.701813E-5	T	29484	2017.09.19 14:26:31.664277632	0000678	
97	0.000108	-9.923539E-5	1.000213E-5	-4.222907E-5	T	29484	2017.09.19 14:26:31.674277632	0000678	
97	9.716481E-5	-9.510661E-5	5.048181E-6	-1.924186E-5	T	29484	2017.09.19 14:26:31.684277632	0000678	
98	0.000115	-0.000104	1.504092E-5	-4.720888E-5	T	29475	2017.09.19 14:26:31.794365132	0000678	
98	9.897980E-5	-9.502082E-5	1.503118E-5	-2.328320E-5	T	29475	2017.09.19 14:26:31.804365132	0000678	
98	9.525755E-5	-8.534356E-5	8.363766E-7	-4.230577E-5	T	29475	2017.09.19 14:26:31.814365132	0000678	
98	0.000138	-0.000118	2.412966E-5	-6.613139E-5	T	29475	2017.09.19 14:26:31.824365132	0000678	
98	0.000120	-0.000113	5.185195E-6	-3.809444E-5	T	29475	2017.09.19 14:26:31.834365132	0000678	
98	0.000106	-9.512910E-5	1.895386E-5	-4.229900E-5	T	29475	2017.09.19 14:26:31.844365132	0000678	
98	9.763708E-5	-8.021261E-5	1.873498E-5	-5.242078E-5	T	29475	2017.09.19 14:26:31.854365132	0000678	
98	0.000106	-0.000104	1.015480E-5	-1.918930E-5	T	29475	2017.09.19 14:26:31.864365132	0000678	
98	0.000137	-0.000123	1.922598E-5	-5.707028E-5	T	29475	2017.09.19 14:26:31.874365132	0000678	
98	0.000115	-0.000109	3.423262E-5	-1.424838E-5	T	29475	2017.09.19 14:26:31.884365132	0000678	
99	0.000107	-0.000104	1.013859E-5	-2.318913E-5	T	29484	2017.09.19 14:26:31.994452632	0000678	
99	0.000119	-0.000118	1.938134E-5	-4.113227E-6	T	29484	2017.09.19 14:26:32.004452632	0000678	
99	0.000132	-0.000128	5.383811E-6	-3.297245E-5	T	29484	2017.09.19 14:26:32.014452632	0000678	
99	0.000105	-9.503704E-5	2.396967E-5	-3.831992E-5	T	29484	2017.09.19 14:26:32.024452632	0000678	
99	0.000128	-0.000118	1.020777E-5	-4.707408E-5	T	29484	2017.09.19 14:26:32.034452632	0000678	
99	0.000127	-0.000113	2.412695E-5	-5.217270E-5	T	29484	2017.09.19 14:26:32.044452632	0000678	
99	7.435052E-5	-6.622435E-5	4.646627E-6	-3.347752E-5	T	29484	2017.09.19 14:26:32.054452632	0000678	
99	0.000111	-9.490382E-5	3.795236E-5	-4.237785E-5	T	29484	2017.09.19 14:26:32.064452632	0000678	
99	0.000120	-0.000118	5.305441E-6	-2.305433E-5	T	29484	2017.09.19 14:26:32.074452632	0000678	
99	0.000116	-0.000109	1.137950E-6	-3.811042E-5	T	29484	2017.09.19 14:26:32.084452632	0000678	
100	0.000111	-9.916966E-5	1.898115E-5	-4.726621E-5	T	29485	2017.09.19 14:26:32.194540132	0000678	
100	0.000118	-0.000113	5.205460E-6	-3.309465E-5	T	29485	2017.09.19 14:26:32.204540132	0000678	
100	8.869047E-5	-7.137953E-5	4.629070E-6	-5.243600E-5	T	29485	2017.09.19 14:26:32.214540132	0000678	
100	0.000119	-0.000109	1.912032E-5	-4.218496E-5	T	29485	2017.09.19 14:26:32.224540132	0000678	
100	0.000101	-9.522134E-5	4.991439E-6	-3.324128E-5	T	29485	2017.09.19 14:26:32.234540132	0000678	
100	9.016097E-5	-7.105400E-5	2.864744E-5	-4.753581E-5	T	29485	2017.09.19 14:26:32.244540132	0000678	
100	0.000122	-0.000109	2.909926E-5	-4.722625E-5	T	29485	2017.09.19 14:26:32.254540132	0000678	
100	0.000105	-0.000104	1.519493E-5	-9.210466E-6	T	29485	2017.09.19 14:26:32.264540132	0000678	
100	0.000129	-0.000128	1.048069E-5	-8.994205E-6	T	29485	2017.09.19 14:26:32.274540132	0000678	
100	0.000102	-8.521209E-5	1.879443E-5	-5.238005E-5	T	29485	2017.09.19 14:26:32.284540132	0000678	
101	8.255907E-5	-8.010816E-5	4.869830E-6	-1.936406E-5	T	29484	2017.09.19 14:26:32.394627632	0000678	
101	0.000110	-9.505151E-5	2.893280E-5	-4.734030E-5	T	29484	2017.09.19 14:26:32.404627632	0000678	
101	0.000130	-0.000123	5.287884E-6	-4.201281E-5	T	29484	2017.09.19 14:26:32.414627632	0000678	
101	0.000123	-0.000118	1.026452E-5	-3.307466E-5	T	29484	2017.09.19 14:26:32.424627632	0000678	
101	0.000104	-9.529509E-5	4.954962E-6	-4.224090E-5	T	29484	2017.09.19 14:26:32.434627632	0000678	
101	0.000118	-0.000104	2.903981E-5	-4.726698E-5	T	29484	2017.09.19 14:26:32.444627632	0000678	
101	6.419502E-5	-6.115756E-5	6.442342E-7	-1.950224E-5	T	29484	2017.09.19 14:26:32.454627632	0000678	
101	0.000104	-9.062114E-5	-1.912286E-5	-4.718183E-5	T	29484	2017.09.19 14:26:32.464627632	0000678	
101	0.000147	-0.000132	2.933221E-5	-5.703846E-5	T	29484	2017.09.19 14:26:32.474627632	0000678	
101	0.000124	-0.000123	1.542084E-5	-9.055687E-6	T	29484	2017.09.19 14:26:32.484627632	0000678	
