Block	B	Bx	By	Bz	Units	Temperature	Timestamp	Serial No.	Comment
0	0.000193	2.047809E-5	-0.000189	-3.340159E-5	T	29230	2017.09.19 13:38:45.941102632	0000678	
0	0.000201	6.842411E-5	-0.000181	-5.282917E-5	T	29230	2017.09.19 13:38:45.951102632	0000678	
0	0.000192	1.538219E-5	-0.000184	-5.238081E-5	T	29230	2017.09.19 13:38:45.961102632	0000678	
0	0.000204	1.183126E-6	-0.000194	-6.222484E-5	T	29230	2017.09.19 13:38:45.971102632	0000678	
0	0.000182	3.454621E-5	-0.000171	-5.259369E-5	T	29230	2017.09.19 13:38:45.981102632	0000678	
0	0.000197	7.262037E-5	-0.000181	-2.886275E-5	T	29230	2017.09.19 13:38:45.991102632	0000678	
0	0.000198	6.353291E-5	-0.000185	-3.377263E-5	T	29230	2017.09.19 13:38:46.001102632	0000678	
0	0.000181	3.468360E-5	-0.000176	-2.857394E-5	T	29230	2017.09.19 13:38:46.011102632	0000678	
0	0.000206	6.349629E-5	-0.000195	-2.373155E-5	T	29230	2017.09.19 13:38:46.021102632	0000678	
0	0.000198	3.429826E-5	-0.000185	-6.253517E-5	T	29230	2017.09.19 13:38:46.031102632	0000678	
1	0.000198	1.522648E-5	-0.000184	-7.138002E-5	T	29228	2017.09.19 13:38:46.141190132	0000678	
1	0.000196	3.443566E-5	-0.000190	-3.851543E-5	T	29228	2017.09.19 13:38:46.151190132	0000678	
1	0.000201	7.246467E-5	-0.000181	-4.786196E-5	T	29228	2017.09.19 13:38:46.161190132	0000678	
1	0.000201	3.034401E-5	-0.000195	-4.246192E-5	T	29228	2017.09.19 13:38:46.171190132	0000678	
1	0.000178	2.058863E-5	-0.000170	-4.747985E-5	T	29228	2017.09.19 13:38:46.181190132	0000678	
1	0.000197	3.931239E-5	-0.000181	-6.659234E-5	T	29228	2017.09.19 13:38:46.191190132	0000678	
1	0.000223	5.809316E-5	-0.000209	-5.263150E-5	T	29228	2017.09.19 13:38:46.201190132	0000678	
1	0.000196	9.664647E-5	-0.000162	-5.313611E-5	T	29228	2017.09.19 13:38:46.211190132	0000678	
1	0.000214	3.011438E-5	-0.000204	-5.742395E-5	T	29228	2017.09.19 13:38:46.221190132	0000678	
1	0.000189	4.952634E-5	-0.000176	-4.769534E-5	T	29228	2017.09.19 13:38:46.231190132	0000678	
2	0.000188	7.273894E-5	-0.000171	-2.890425E-5	T	29227	2017.09.19 13:38:46.341277632	0000678	
2	0.000192	4.446758E-5	-0.000181	-4.763386E-5	T	29227	2017.09.19 13:38:46.351277632	0000678	
2	0.000205	4.423794E-5	-0.000190	-6.259589E-5	T	29227	2017.09.19 13:38:46.361277632	0000678	
2	0.000200	3.432093E-5	-0.000190	-5.251484E-5	T	29227	2017.09.19 13:38:46.371277632	0000678	
2	0.000212	6.325864E-5	-0.000195	-5.273033E-5	T	29227	2017.09.19 13:38:46.381277632	0000678	
2	0.000204	3.039946E-5	-0.000199	-2.844176E-5	T	29227	2017.09.19 13:38:46.391277632	0000678	
2	0.000221	7.223294E-5	-0.000204	-4.276672E-5	T	29227	2017.09.19 13:38:46.401277632	0000678	
2	0.000195	4.942608E-5	-0.000181	-5.267439E-5	T	29227	2017.09.19 13:38:46.411277632	0000678	
2	0.000211	3.916087E-5	-0.000200	-5.751386E-5	T	29227	2017.09.19 13:38:46.421277632	0000678	
2	0.000196	5.857440E-5	-0.000185	-2.873211E-5	T	29227	2017.09.19 13:38:46.431277632	0000678	
3	0.000203	5.840039E-5	-0.000190	-4.271077E-5	T	29231	2017.09.19 13:38:46.541365132	0000678	
3	0.000190	7.258968E-5	-0.000167	-5.291985E-5	T	29231	2017.09.19 13:38:46.551365132	0000678	
3	0.000207	3.024376E-5	-0.000200	-4.744096E-5	T	29231	2017.09.19 13:38:46.561365132	0000678	
3	0.000180	3.472458E-5	-0.000176	-2.357415E-5	T	29231	2017.09.19 13:38:46.571365132	0000678	
3	0.000202	4.441631E-5	-0.000195	-3.357635E-5	T	29231	2017.09.19 13:38:46.581365132	0000678	
3	0.000188	2.057835E-5	-0.000184	-2.842255E-5	T	29231	2017.09.19 13:38:46.591365132	0000678	
3	0.000195	3.047705E-5	-0.000190	-3.348305E-5	T	29231	2017.09.19 13:38:46.601365132	0000678	
3	0.000193	5.858085E-5	-0.000181	-3.374850E-5	T	29231	2017.09.19 13:38:46.611365132	0000678	
3	0.000211	1.102638E-5	-0.000194	-8.130551E-5	T	29231	2017.09.19 13:38:46.621365132	0000678	
3	0.000201	2.051523E-5	-0.000199	-1.436088E-5	T	29231	2017.09.19 13:38:46.631365132	0000678	
4	0.000204	3.918301E-5	-0.000185	-7.657532E-5	T	29216	2017.09.19 13:38:46.741452632	0000678	
4	0.000188	2.546955E-5	-0.000181	-4.747908E-5	T	29216	2017.09.19 13:38:46.751452632	0000678	
4	0.000202	4.431989E-5	-0.000190	-5.259630E-5	T	29216	2017.09.19 13:38:46.761452632	0000678	
4	0.000209	3.924282E-5	-0.000200	-4.751428E-5	T	29216	2017.09.19 13:38:46.771452632	0000678	
4	0.000198	3.927142E-5	-0.000181	-7.159213E-5	T	29216	2017.09.19 13:38:46.781452632	0000678	
4	0.000192	3.953540E-5	-0.000185	-3.357712E-5	T	29216	2017.09.19 13:38:46.791452632	0000678	
4	0.000196	4.455755E-5	-0.000190	-2.359752E-5	T	29216	2017.09.19 13:38:46.801452632	0000678	
4	0.000211	3.044026E-5	-0.000208	-1.040516E-5	T	29216	2017.09.19 13:38:46.811452632	0000678	
4	0.000199	3.936139E-5	-0.000190	-4.755578E-5	T	29216	2017.09.19 13:38:46.821452632	0000678	
4	0.000189	5.847641E-5	-0.000167	-6.680522E-5	T	29216	2017.09.19 13:38:46.831452632	0000678	
5	0.000188	3.473260E-5	-0.000184	-9.537388E-6	T	29231	2017.09.19 13:38:46.941540132	0000678	
5	0.000219	3.399923E-5	-0.000204	-7.145595E-5	T	29231	2017.09.19 13:38:46.951540132	0000678	
5	0.000204	4.922295E-5	-0.000185	-7.165699E-5	T	29231	2017.09.19 13:38:46.961540132	0000678	
5	0.000203	3.423898E-5	-0.000190	-6.251442E-5	T	29231	2017.09.19 13:38:46.971540132	0000678	
5	0.000182	1.566727E-5	-0.000180	-2.339862E-5	T	29231	2017.09.19 13:38:46.981540132	0000678	
5	0.000200	3.432093E-5	-0.000190	-5.251484E-5	T	29231	2017.09.19 13:38:46.991540132	0000678	
5	0.000199	5.355661E-5	-0.000190	-2.367083E-5	T	29231	2017.09.19 13:38:47.001540132	0000678	
5	0.000205	3.022109E-5	-0.000195	-5.746130E-5	T	29231	2017.09.19 13:38:47.011540132	0000678	
5	0.000221	3.911780E-5	-0.000214	-4.245639E-5	T	29231	2017.09.19 13:38:47.021540132	0000678	
5	0.000186	3.058376E-5	-0.000181	-3.352040E-5	T	29231	2017.09.19 13:38:47.031540132	0000678	
6	0.000187	4.452686E-5	-0.000176	-4.765461E-5	T	29236	2017.09.19 13:38:47.141627632	0000678	
6	0.000216	4.908608E-5	-0.000200	-6.659495E-5	T	29236	2017.09.19 13:38:47.151627632	0000678	
6	0.000171	-2.138541E-6	-0.000170	-1.429387E-5	T	29236	2017.09.19 13:38:47.161627632	0000678	
6	0.000188	3.051001E-5	-0.000181	-4.252002E-5	T	29236	2017.09.19 13:38:47.171627632	0000678	
6	0.000205	4.423794E-5	-0.000190	-6.259589E-5	T	29236	2017.09.19 13:38:47.181627632	0000678	
6	0.000189	3.040539E-5	-0.000176	-6.253994E-5	T	29236	2017.09.19 13:38:47.191627632	0000678	
6	0.000207	4.426061E-5	-0.000195	-5.257555E-5	T	29236	2017.09.19 13:38:47.201627632	0000678	
6	0.000177	1.728006E-6	-0.000175	-2.330533E-5	T	29236	2017.09.19 13:38:47.211627632	0000678	
6	0.000200	4.943410E-5	-0.000190	-3.863762E-5	T	29236	2017.09.19 13:38:47.221627632	0000678	
6	0.000185	2.558428E-5	-0.000180	-3.347967E-5	T	29236	2017.09.19 13:38:47.231627632	0000678	
7	0.000189	6.862462E-5	-0.000171	-4.287108E-5	T	29226	2017.09.19 13:38:47.341715132	0000678	
7	0.000204	4.941580E-5	-0.000195	-3.361708E-5	T	29226	2017.09.19 13:38:47.351715132	0000678	
7	0.000209	6.334059E-5	-0.000195	-4.273075E-5	T	29226	2017.09.19 13:38:47.361715132	0000678	
7	0.000218	6.830711E-5	-0.000204	-3.373451E-5	T	29226	2017.09.19 13:38:47.371715132	0000678	
7	0.000176	2.559457E-5	-0.000167	-5.253697E-5	T	29226	2017.09.19 13:38:47.381715132	0000678	
7	0.000194	2.547757E-5	-0.000189	-3.344232E-5	T	29226	2017.09.19 13:38:47.391715132	0000678	
7	0.000184	6.378085E-5	-0.000171	-2.383115E-5	T	29226	2017.09.19 13:38:47.401715132	0000678	
7	0.000207	5.323701E-5	-0.000190	-6.266920E-5	T	29226	2017.09.19 13:38:47.411715132	0000678	
7	0.000208	4.431606E-5	-0.000200	-3.855539E-5	T	29226	2017.09.19 13:38:47.421715132	0000678	
7	0.000191	6.347589E-5	-0.000167	-6.684595E-5	T	29226	2017.09.19 13:38:47.431715132	0000678	
8	0.000178	1.572655E-5	-0.000175	-2.341937E-5	T	29219	2017.09.19 13:38:47.541802632	0000678	
8	0.000209	3.924282E-5	-0.000200	-4.751428E-5	T	29219	2017.09.19 13:38:47.551802632	0000678	
8	0.000181	5.374091E-5	-0.000171	-2.874947E-5	T	29219	2017.09.19 13:38:47.561802632	0000678	
8	0.000208	3.928380E-5	-0.000200	-4.251449E-5	T	29219	2017.09.19 13:38:47.571802632	0000678	
8	0.000192	2.559230E-5	-0.000189	-1.944290E-5	T	29219	2017.09.19 13:38:47.581802632	0000678	
8	0.000187	3.073301E-5	-0.000184	-9.504803E-6	T	29219	2017.09.19 13:38:47.591802632	0000678	
8	0.000186	3.952738E-5	-0.000176	-4.761388E-5	T	29219	2017.09.19 13:38:47.601802632	0000678	
8	0.000191	4.977202E-5	-0.000185	-4.659792E-6	T	29219	2017.09.19 13:38:47.611802632	0000678	
8	0.000200	4.933768E-5	-0.000185	-5.765758E-5	T	29219	2017.09.19 13:38:47.621802632	0000678	
8	0.000193	1.547861E-5	-0.000189	-3.336085E-5	T	29219	2017.09.19 13:38:47.631802632	0000678	
9	0.000184	3.052831E-5	-0.000176	-4.754057E-5	T	29219	2017.09.19 13:38:47.741890132	0000678	
9	0.000207	2.020382E-5	-0.000199	-5.235929E-5	T	29219	2017.09.19 13:38:47.751890132	0000678	
9	0.000191	4.464961E-5	-0.000185	-1.961843E-5	T	29219	2017.09.19 13:38:47.761890132	0000678	
9	0.000202	4.431989E-5	-0.000190	-5.259630E-5	T	29219	2017.09.19 13:38:47.771890132	0000678	
9	0.000196	2.540382E-5	-0.000189	-4.244194E-5	T	29219	2017.09.19 13:38:47.781890132	0000678	
9	0.000190	6.363962E-5	-0.000176	-3.380998E-5	T	29219	2017.09.19 13:38:47.791890132	0000678	
9	0.000186	4.954465E-5	-0.000171	-5.271589E-5	T	29219	2017.09.19 13:38:47.801890132	0000678	
9	0.000214	3.021080E-5	-0.000209	-3.840399E-5	T	29219	2017.09.19 13:38:47.811890132	0000678	
9	0.000189	6.372157E-5	-0.000176	-2.381040E-5	T	29219	2017.09.19 13:38:47.821890132	0000678	
9	0.000202	3.918947E-5	-0.000181	-8.159171E-5	T	29219	2017.09.19 13:38:47.831890132	0000678	
10	0.000210	5.820371E-5	-0.000190	-6.670977E-5	T	29231	2017.09.19 13:38:47.941977632	0000678	
10	0.000188	5.350326E-5	-0.000171	-5.774826E-5	T	29231	2017.09.19 13:38:47.951977632	0000678	
10	0.000203	5.335993E-5	-0.000190	-4.766983E-5	T	29231	2017.09.19 13:38:47.961977632	0000678	
10	0.000186	2.054382E-5	-0.000180	-3.843873E-5	T	29231	2017.09.19 13:38:47.971977632	0000678	
10	0.000205	3.920568E-5	-0.000190	-6.655499E-5	T	29231	2017.09.19 13:38:47.981977632	0000678	
10	0.000205	1.524531E-5	-0.000199	-4.731877E-5	T	29231	2017.09.19 13:38:47.991977632	0000678	
10	0.000199	6.349193E-5	-0.000185	-3.877242E-5	T	29231	2017.09.19 13:38:48.001977632	0000678	
10	0.000182	4.959207E-5	-0.000167	-5.273249E-5	T	29231	2017.09.19 13:38:48.011977632	0000678	
10	0.000209	4.417866E-5	-0.000195	-6.257514E-5	T	29231	2017.09.19 13:38:48.021977632	0000678	
10	0.000212	6.818000E-5	-0.000185	-7.681156E-5	T	29231	2017.09.19 13:38:48.031977632	0000678	
11	0.000184	3.052831E-5	-0.000176	-4.754057E-5	T	29238	2017.09.19 13:38:48.142065132	0000678	
11	0.000214	3.929182E-5	-0.000209	-2.847772E-5	T	29238	2017.09.19 13:38:48.152065132	0000678	
11	0.000188	5.359968E-5	-0.000176	-3.872831E-5	T	29238	2017.09.19 13:38:48.162065132	0000678	
11	0.000201	6.442929E-6	-0.000199	-2.324646E-5	T	29238	2017.09.19 13:38:48.172065132	0000678	
11	0.000218	2.515204E-5	-0.000213	-3.834251E-5	T	29238	2017.09.19 13:38:48.182065132	0000678	
11	0.000178	2.075881E-5	-0.000175	-1.946027E-5	T	29238	2017.09.19 13:38:48.192065132	0000678	
11	0.000207	4.439801E-5	-0.000200	-2.855581E-5	T	29238	2017.09.19 13:38:48.202065132	0000678	
11	0.000196	3.447664E-5	-0.000190	-3.351563E-5	T	29238	2017.09.19 13:38:48.212065132	0000678	
11	0.000200	1.551575E-5	-0.000199	-1.432015E-5	T	29238	2017.09.19 13:38:48.222065132	0000678	
11	0.000189	6.372157E-5	-0.000176	-2.381040E-5	T	29238	2017.09.19 13:38:48.232065132	0000678	
12	0.000188	3.065106E-5	-0.000184	-1.950438E-5	T	29225	2017.09.19 13:38:48.342152632	0000678	
12	0.000199	5.867082E-5	-0.000190	-9.712149E-6	T	29225	2017.09.19 13:38:48.352152632	0000678	
12	0.000207	8.245718E-5	-0.000185	-4.292703E-5	T	29225	2017.09.19 13:38:48.362152632	0000678	
12	0.000195	3.959085E-5	-0.000190	-1.955695E-5	T	29225	2017.09.19 13:38:48.372152632	0000678	
12	0.000198	3.429826E-5	-0.000185	-6.253517E-5	T	29225	2017.09.19 13:38:48.382152632	0000678	
12	0.000222	6.317459E-5	-0.000209	-4.267265E-5	T	29225	2017.09.19 13:38:48.392152632	0000678	
12	0.000200	6.345915E-5	-0.000185	-4.277225E-5	T	29225	2017.09.19 13:38:48.402152632	0000678	
12	0.000176	1.563013E-5	-0.000170	-4.243933E-5	T	29225	2017.09.19 13:38:48.412152632	0000678	
12	0.000217	4.399017E-5	-0.000195	-8.557417E-5	T	29225	2017.09.19 13:38:48.422152632	0000678	
12	0.000196	4.455755E-5	-0.000190	-2.359752E-5	T	29225	2017.09.19 13:38:48.432152632	0000678	
13	0.000189	4.458231E-5	-0.000181	-3.363445E-5	T	29221	2017.09.19 13:38:48.542240132	0000678	
13	0.000204	6.837668E-5	-0.000185	-5.281257E-5	T	29221	2017.09.19 13:38:48.552240132	0000678	
13	0.000192	3.449494E-5	-0.000185	-3.853618E-5	T	29221	2017.09.19 13:38:48.562240132	0000678	
13	0.000203	6.347362E-5	-0.000190	-3.375188E-5	T	29221	2017.09.19 13:38:48.572240132	0000678	
13	0.000195	3.047705E-5	-0.000190	-3.348305E-5	T	29221	2017.09.19 13:38:48.582240132	0000678	
13	0.000210	4.424230E-5	-0.000200	-4.755501E-5	T	29221	2017.09.19 13:38:48.592240132	0000678	
13	0.000192	3.046258E-5	-0.000185	-4.250342E-5	T	29221	2017.09.19 13:38:48.602240132	0000678	
13	0.000198	5.849245E-5	-0.000185	-3.873169E-5	T	29221	2017.09.19 13:38:48.612240132	0000678	
13	0.000190	3.446861E-5	-0.000181	-4.755240E-5	T	29221	2017.09.19 13:38:48.622240132	0000678	
13	0.000195	5.864816E-5	-0.000185	-1.973248E-5	T	29221	2017.09.19 13:38:48.632240132	0000678	
14	0.000178	2.075881E-5	-0.000175	-1.946027E-5	T	29217	2017.09.19 13:38:48.742327632	0000678	
14	0.000181	4.465990E-5	-0.000171	-3.867574E-5	T	29217	2017.09.19 13:38:48.752327632	0000678	
14	0.000188	3.035639E-5	-0.000167	-8.157649E-5	T	29217	2017.09.19 13:38:48.762327632	0000678	
14	0.000196	3.937969E-5	-0.000185	-5.257632E-5	T	29217	2017.09.19 13:38:48.772327632	0000678	
14	0.000207	5.827746E-5	-0.000190	-5.771014E-5	T	29217	2017.09.19 13:38:48.782327632	0000678	
14	0.000182	3.454621E-5	-0.000171	-5.259369E-5	T	29217	2017.09.19 13:38:48.792327632	0000678	
14	0.000219	4.427299E-5	-0.000214	-2.349791E-5	T	29217	2017.09.19 13:38:48.802327632	0000678	
14	0.000191	4.450855E-5	-0.000181	-4.263407E-5	T	29217	2017.09.19 13:38:48.812327632	0000678	
14	0.000178	-2.353529E-6	-0.000175	-3.327232E-5	T	29217	2017.09.19 13:38:48.822327632	0000678	
14	0.000188	1.153831E-5	-0.000184	-3.334902E-5	T	29217	2017.09.19 13:38:48.832327632	0000678	
15	0.000199	4.433820E-5	-0.000185	-5.761685E-5	T	29223	2017.09.19 13:38:48.942415132	0000678	
15	0.000190	3.457689E-5	-0.000185	-2.853659E-5	T	29223	2017.09.19 13:38:48.952415132	0000678	
15	0.000202	5.831042E-5	-0.000181	-6.674712E-5	T	29223	2017.09.19 13:38:48.962415132	0000678	
15	0.000199	3.045874E-5	-0.000194	-2.846251E-5	T	29223	2017.09.19 13:38:48.972415132	0000678	
15	0.000195	4.942608E-5	-0.000181	-5.267439E-5	T	29223	2017.09.19 13:38:48.982415132	0000678	
15	0.000191	5.362235E-5	-0.000181	-2.870797E-5	T	29223	2017.09.19 13:38:48.992415132	0000678	
15	0.000201	3.034401E-5	-0.000195	-4.246192E-5	T	29223	2017.09.19 13:38:49.002415132	0000678	
15	0.000203	5.335993E-5	-0.000190	-4.766983E-5	T	29223	2017.09.19 13:38:49.012415132	0000678	
15	0.000167	4.477044E-5	-0.000152	-5.275401E-5	T	29223	2017.09.19 13:38:49.022415132	0000678	
15	0.000196	-2.537828E-6	-0.000194	-2.819368E-5	T	29223	2017.09.19 13:38:49.032415132	0000678	
16	0.000196	5.857440E-5	-0.000185	-2.873211E-5	T	29239	2017.09.19 13:38:49.142502632	0000678	
16	0.000200	5.841870E-5	-0.000185	-4.773131E-5	T	29239	2017.09.19 13:38:49.152502632	0000678	
16	0.000199	4.443462E-5	-0.000190	-3.859689E-5	T	29239	2017.09.19 13:38:49.162502632	0000678	
16	0.000214	6.317669E-5	-0.000195	-6.272992E-5	T	29239	2017.09.19 13:38:49.172502632	0000678	
16	0.000222	4.919052E-5	-0.000214	-3.353823E-5	T	29239	2017.09.19 13:38:49.182502632	0000678	
16	0.000203	6.347362E-5	-0.000190	-3.375188E-5	T	29239	2017.09.19 13:38:49.192502632	0000678	
16	0.000182	3.454621E-5	-0.000171	-5.259369E-5	T	29239	2017.09.19 13:38:49.202502632	0000678	
16	0.000190	2.046362E-5	-0.000184	-4.242196E-5	T	29239	2017.09.19 13:38:49.212502632	0000678	
16	0.000203	1.536004E-5	-0.000199	-3.331935E-5	T	29239	2017.09.19 13:38:49.222502632	0000678	
16	0.000186	5.875487E-5	-0.000176	-1.976983E-5	T	29239	2017.09.19 13:38:49.232502632	0000678	
17	0.000197	3.933872E-5	-0.000185	-5.757611E-5	T	29220	2017.09.19 13:38:49.342590132	0000678	
17	0.000170	1.575131E-5	-0.000166	-3.345631E-5	T	29220	2017.09.19 13:38:49.352590132	0000678	
17	0.000205	6.339987E-5	-0.000190	-4.275150E-5	T	29220	2017.09.19 13:38:49.362590132	0000678	
17	0.000213	4.423585E-5	-0.000204	-4.253862E-5	T	29220	2017.09.19 13:38:49.372590132	0000678	
17	0.000187	1.547059E-5	-0.000180	-4.739762E-5	T	29220	2017.09.19 13:38:49.382590132	0000678	
17	0.000180	1.560363E-5	-0.000175	-3.841875E-5	T	29220	2017.09.19 13:38:49.392590132	0000678	
17	0.000224	4.403533E-5	-0.000214	-5.249670E-5	T	29220	2017.09.19 13:38:49.402590132	0000678	
17	0.000205	6.357005E-5	-0.000195	-1.473192E-5	T	29220	2017.09.19 13:38:49.412590132	0000678	
17	0.000190	3.961735E-5	-0.000185	-2.357753E-5	T	29220	2017.09.19 13:38:49.422590132	0000678	
17	0.000191	1.134808E-5	-0.000180	-6.236441E-5	T	29220	2017.09.19 13:38:49.432590132	0000678	
18	0.000196	4.946061E-5	-0.000185	-4.265820E-5	T	29230	2017.09.19 13:38:49.542677632	0000678	
18	0.000226	3.895390E-5	-0.000214	-6.245555E-5	T	29230	2017.09.19 13:38:49.552677632	0000678	
18	0.000196	6.350658E-5	-0.000181	-4.278885E-5	T	29230	2017.09.19 13:38:49.562677632	0000678	
18	0.000178	3.066135E-5	-0.000171	-3.856169E-5	T	29230	2017.09.19 13:38:49.572677632	0000678	
18	0.000208	5.834111E-5	-0.000195	-4.269002E-5	T	29230	2017.09.19 13:38:49.582677632	0000678	
18	0.000200	3.441735E-5	-0.000195	-3.349488E-5	T	29230	2017.09.19 13:38:49.592677632	0000678	
18	0.000191	6.561495E-6	-0.000189	-2.328796E-5	T	29230	2017.09.19 13:38:49.602677632	0000678	
18	0.000205	5.849681E-5	-0.000195	-2.369081E-5	T	29230	2017.09.19 13:38:49.612677632	0000678	
18	0.000211	4.414588E-5	-0.000195	-6.657497E-5	T	29230	2017.09.19 13:38:49.622677632	0000678	
18	0.000181	2.560259E-5	-0.000175	-3.850021E-5	T	29230	2017.09.19 13:38:49.632677632	0000678	
19	0.000197	3.440288E-5	-0.000190	-4.251526E-5	T	29216	2017.09.19 13:38:49.742765132	0000678	
19	0.000208	5.330065E-5	-0.000195	-4.764908E-5	T	29216	2017.09.19 13:38:49.752765132	0000678	
19	0.000202	4.431989E-5	-0.000190	-5.259630E-5	T	29216	2017.09.19 13:38:49.762765132	0000678	
19	0.000186	3.966478E-5	-0.000181	-2.359413E-5	T	29216	2017.09.19 13:38:49.772765132	0000678	
19	0.000181	2.060311E-5	-0.000175	-3.845948E-5	T	29216	2017.09.19 13:38:49.782765132	0000678	
19	0.000202	4.441631E-5	-0.000195	-3.357635E-5	T	29216	2017.09.19 13:38:49.792765132	0000678	
19	0.000206	8.657149E-5	-0.000185	-2.896020E-5	T	29216	2017.09.19 13:38:49.802765132	0000678	
19	0.000186	6.365792E-5	-0.000171	-3.883052E-5	T	29216	2017.09.19 13:38:49.812765132	0000678	
19	0.000180	3.072499E-5	-0.000175	-2.354157E-5	T	29216	2017.09.19 13:38:49.822765132	0000678	
19	0.000198	3.940236E-5	-0.000190	-4.255599E-5	T	29216	2017.09.19 13:38:49.832765132	0000678	
20	0.000186	1.580322E-6	-0.000184	-2.826777E-5	T	29218	2017.09.19 13:38:49.942852632	0000678	
20	0.000190	4.958179E-5	-0.000181	-3.367518E-5	T	29218	2017.09.19 13:38:49.952852632	0000678	
20	0.000211	1.102638E-5	-0.000194	-8.130551E-5	T	29218	2017.09.19 13:38:49.962852632	0000678	
20	0.000202	4.431989E-5	-0.000190	-5.259630E-5	T	29218	2017.09.19 13:38:49.972852632	0000678	
20	0.000192	3.942712E-5	-0.000181	-5.259292E-5	T	29218	2017.09.19 13:38:49.982852632	0000678	
20	0.000198	5.341922E-5	-0.000185	-4.769058E-5	T	29218	2017.09.19 13:38:49.992852632	0000678	
20	0.000209	5.339707E-5	-0.000200	-2.862912E-5	T	29218	2017.09.19 13:38:50.002852632	0000678	
20	0.000177	4.974778E-5	-0.000167	-3.373328E-5	T	29218	2017.09.19 13:38:50.012852632	0000678	
20	0.000181	3.451168E-5	-0.000167	-6.260987E-5	T	29218	2017.09.19 13:38:50.022852632	0000678	
20	0.000186	5.862566E-5	-0.000171	-4.278962E-5	T	29218	2017.09.19 13:38:50.032852632	0000678	
21	0.000192	4.964909E-5	-0.000185	-1.965916E-5	T	29231	2017.09.19 13:38:50.142940132	0000678	
21	0.000190	3.961735E-5	-0.000185	-2.357753E-5	T	29231	2017.09.19 13:38:50.152940132	0000678	
21	0.000191	3.442764E-5	-0.000181	-5.255219E-5	T	29231	2017.09.19 13:38:50.162940132	0000678	
21	0.000196	6.353936E-5	-0.000181	-3.878902E-5	T	29231	2017.09.19 13:38:50.172940132	0000678	
21	0.000197	5.367134E-5	-0.000190	-9.671418E-6	T	29231	2017.09.19 13:38:50.182940132	0000678	
21	0.000209	4.417866E-5	-0.000195	-6.257514E-5	T	29231	2017.09.19 13:38:50.192940132	0000678	
21	0.000197	4.451657E-5	-0.000190	-2.859731E-5	T	29231	2017.09.19 13:38:50.202940132	0000678	
21	0.000189	5.859916E-5	-0.000176	-3.876904E-5	T	29231	2017.09.19 13:38:50.212940132	0000678	
21	0.000207	3.024376E-5	-0.000200	-4.744096E-5	T	29231	2017.09.19 13:38:50.222940132	0000678	
21	0.000197	2.550024E-5	-0.000194	-2.342199E-5	T	29231	2017.09.19 13:38:50.232940132	0000678	
22	0.000189	3.057731E-5	-0.000184	-2.850401E-5	T	29234	2017.09.19 13:38:50.343027632	0000678	
22	0.000203	3.020662E-5	-0.000190	-6.648167E-5	T	29234	2017.09.19 13:38:50.353027632	0000678	
22	0.000212	6.325864E-5	-0.000195	-5.273033E-5	T	29234	2017.09.19 13:38:50.363027632	0000678	
22	0.000205	6.339987E-5	-0.000190	-4.275150E-5	T	29234	2017.09.19 13:38:50.373027632	0000678	
22	0.000205	4.455371E-5	-0.000200	-9.556601E-6	T	29234	2017.09.19 13:38:50.383027632	0000678	
22	0.000202	3.434360E-5	-0.000195	-4.249451E-5	T	29234	2017.09.19 13:38:50.393027632	0000678	
22	0.000198	5.363037E-5	-0.000190	-1.467121E-5	T	29234	2017.09.19 13:38:50.403027632	0000678	
22	0.000184	5.387831E-5	-0.000176	-4.729727E-6	T	29234	2017.09.19 13:38:50.413027632	0000678	
22	0.000174	4.966966E-5	-0.000157	-5.777378E-5	T	29234	2017.09.19 13:38:50.423027632	0000678	
22	0.000204	3.930210E-5	-0.000195	-4.753503E-5	T	29234	2017.09.19 13:38:50.433027632	0000678	
23	0.000198	5.358939E-5	-0.000190	-1.967100E-5	T	29231	2017.09.19 13:38:50.543115132	0000678	
23	0.000210	5.820371E-5	-0.000190	-6.670977E-5	T	29231	2017.09.19 13:38:50.553115132	0000678	
23	0.000193	2.555952E-5	-0.000189	-2.344274E-5	T	29231	2017.09.19 13:38:50.563115132	0000678	
23	0.000184	1.548890E-5	-0.000175	-5.241816E-5	T	29231	2017.09.19 13:38:50.573115132	0000678	
23	0.000201	5.851512E-5	-0.000190	-2.871136E-5	T	29231	2017.09.19 13:38:50.583115132	0000678	
23	0.000205	5.327798E-5	-0.000190	-5.766941E-5	T	29231	2017.09.19 13:38:50.593115132	0000678	
23	0.000182	1.146664E-5	-0.000170	-6.240591E-5	T	29231	2017.09.19 13:38:50.603115132	0000678	
23	0.000211	5.835558E-5	-0.000200	-3.366965E-5	T	29231	2017.09.19 13:38:50.613115132	0000678	
23	0.000194	1.140527E-5	-0.000189	-4.232789E-5	T	29231	2017.09.19 13:38:50.623115132	0000678	
23	0.000175	1.159602E-5	-0.000166	-5.242293E-5	T	29231	2017.09.19 13:38:50.633115132	0000678	
24	0.000190	4.469059E-5	-0.000185	-1.461864E-5	T	29226	2017.09.19 13:38:50.743202632	0000678	
24	0.000196	4.455755E-5	-0.000190	-2.359752E-5	T	29226	2017.09.19 13:38:50.753202632	0000678	
24	0.000210	6.329961E-5	-0.000195	-4.773054E-5	T	29226	2017.09.19 13:38:50.763202632	0000678	
24	0.000193	3.042160E-5	-0.000185	-4.750321E-5	T	29226	2017.09.19 13:38:50.773202632	0000678	
24	0.000190	2.046362E-5	-0.000184	-4.242196E-5	T	29226	2017.09.19 13:38:50.783202632	0000678	
24	0.000202	5.833675E-5	-0.000185	-5.773089E-5	T	29226	2017.09.19 13:38:50.793202632	0000678	
24	0.000204	3.930210E-5	-0.000195	-4.753503E-5	T	29226	2017.09.19 13:38:50.803202632	0000678	
24	0.000188	3.948640E-5	-0.000176	-5.261367E-5	T	29226	2017.09.19 13:38:50.813202632	0000678	
24	0.000204	3.420620E-5	-0.000190	-6.651426E-5	T	29226	2017.09.19 13:38:50.823202632	0000678	
24	0.000185	1.569360E-5	-0.000184	-1.438240E-5	T	29226	2017.09.19 13:38:50.833202632	0000678	
25	0.000188	5.350326E-5	-0.000171	-5.774826E-5	T	29227	2017.09.19 13:38:50.943290132	0000678	
25	0.000206	2.518063E-5	-0.000195	-6.242036E-5	T	29227	2017.09.19 13:38:50.953290132	0000678	
25	0.000203	1.131948E-5	-0.000199	-3.828656E-5	T	29227	2017.09.19 13:38:50.963290132	0000678	
25	0.000199	3.045874E-5	-0.000194	-2.846251E-5	T	29227	2017.09.19 13:38:50.973290132	0000678	
25	0.000204	2.522161E-5	-0.000195	-5.742056E-5	T	29227	2017.09.19 13:38:50.983290132	0000678	
25	0.000197	5.842515E-5	-0.000181	-5.274770E-5	T	29227	2017.09.19 13:38:50.993290132	0000678	
25	0.000203	6.337720E-5	-0.000185	-5.277183E-5	T	29227	2017.09.19 13:38:51.003290132	0000678	
25	0.000193	1.547861E-5	-0.000189	-3.336085E-5	T	29227	2017.09.19 13:38:51.013290132	0000678	
25	0.000202	3.927944E-5	-0.000190	-5.755536E-5	T	29227	2017.09.19 13:38:51.023290132	0000678	
25	0.000179	4.967402E-5	-0.000167	-4.273290E-5	T	29227	2017.09.19 13:38:51.033290132	0000678	
26	0.000209	3.414692E-5	-0.000195	-6.649351E-5	T	29232	2017.09.19 13:38:51.143377632	0000678	
26	0.000203	3.447280E-5	-0.000200	-1.947472E-5	T	29232	2017.09.19 13:38:51.153377632	0000678	
26	0.000182	3.958666E-5	-0.000171	-4.763463E-5	T	29232	2017.09.19 13:38:51.163377632	0000678	
26	0.000192	2.034714E-5	-0.000181	-6.243772E-5	T	29232	2017.09.19 13:38:51.173377632	0000678	
26	0.000208	6.852855E-5	-0.000195	-1.977244E-5	T	29232	2017.09.19 13:38:51.183377632	0000678	
26	0.000198	3.461403E-5	-0.000194	-9.495888E-6	T	29232	2017.09.19 13:38:51.193377632	0000678	
26	0.000188	3.454237E-5	-0.000181	-3.855278E-5	T	29232	2017.09.19 13:38:51.203377632	0000678	
26	0.000191	4.450855E-5	-0.000181	-4.263407E-5	T	29232	2017.09.19 13:38:51.213377632	0000678	
26	0.000201	3.945781E-5	-0.000195	-2.853583E-5	T	29232	2017.09.19 13:38:51.223377632	0000678	
26	0.000190	2.031000E-5	-0.000171	-8.147843E-5	T	29232	2017.09.19 13:38:51.233377632	0000678	
27	0.000204	4.941580E-5	-0.000195	-3.361708E-5	T	29224	2017.09.19 13:38:51.343465132	0000678	
27	0.000204	1.128670E-5	-0.000199	-4.228639E-5	T	29224	2017.09.19 13:38:51.353465132	0000678	
27	0.000208	8.241620E-5	-0.000185	-4.792682E-5	T	29224	2017.09.19 13:38:51.363465132	0000678	
27	0.000198	5.849245E-5	-0.000185	-3.873169E-5	T	29224	2017.09.19 13:38:51.373465132	0000678	
27	0.000224	5.805219E-5	-0.000209	-5.763129E-5	T	29224	2017.09.19 13:38:51.383465132	0000678	
27	0.000205	6.361102E-5	-0.000195	-9.732131E-6	T	29224	2017.09.19 13:38:51.393465132	0000678	
27	0.000199	8.256389E-5	-0.000176	-4.296438E-5	T	29224	2017.09.19 13:38:51.403465132	0000678	
27	0.000206	1.514889E-5	-0.000194	-6.633873E-5	T	29224	2017.09.19 13:38:51.413465132	0000678	
27	0.000203	6.347362E-5	-0.000190	-3.375188E-5	T	29224	2017.09.19 13:38:51.423465132	0000678	
27	0.000178	3.062857E-5	-0.000171	-4.256152E-5	T	29224	2017.09.19 13:38:51.433465132	0000678	
28	0.000193	3.042160E-5	-0.000185	-4.750321E-5	T	29231	2017.09.19 13:38:51.543552632	0000678	
28	0.000185	2.558428E-5	-0.000180	-3.347967E-5	T	29231	2017.09.19 13:38:51.553552632	0000678	
28	0.000199	5.867082E-5	-0.000190	-9.712149E-6	T	29231	2017.09.19 13:38:51.563552632	0000678	
28	0.000208	5.823649E-5	-0.000190	-6.270993E-5	T	29231	2017.09.19 13:38:51.573552632	0000678	
28	0.000194	2.547757E-5	-0.000189	-3.344232E-5	T	29231	2017.09.19 13:38:51.583552632	0000678	
28	0.000200	7.250564E-5	-0.000181	-4.286217E-5	T	29231	2017.09.19 13:38:51.593552632	0000678	
28	0.000210	4.424230E-5	-0.000200	-4.755501E-5	T	29231	2017.09.19 13:38:51.603552632	0000678	
28	0.000170	3.498699E-5	-0.000166	-4.612298E-6	T	29231	2017.09.19 13:38:51.613552632	0000678	
28	0.000179	2.068506E-5	-0.000175	-2.845990E-5	T	29231	2017.09.19 13:38:51.623552632	0000678	
28	0.000201	3.037679E-5	-0.000195	-3.846209E-5	T	29231	2017.09.19 13:38:51.633552632	0000678	
29	0.000191	3.453592E-5	-0.000185	-3.353639E-5	T	29230	2017.09.19 13:38:51.743640132	0000678	
29	0.000182	3.972406E-5	-0.000176	-2.361488E-5	T	29230	2017.09.19 13:38:51.753640132	0000678	
29	0.000190	3.440497E-5	-0.000176	-6.257252E-5	T	29230	2017.09.19 13:38:51.763640132	0000678	
29	0.000215	4.408660E-5	-0.000200	-6.655422E-5	T	29230	2017.09.19 13:38:51.773640132	0000678	
29	0.000193	7.267966E-5	-0.000176	-2.888350E-5	T	29230	2017.09.19 13:38:51.783640132	0000678	
29	0.000185	4.460061E-5	-0.000176	-3.865499E-5	T	29230	2017.09.19 13:38:51.793640132	0000678	
29	0.000203	3.044044E-5	-0.000199	-2.344197E-5	T	29230	2017.09.19 13:38:51.803640132	0000678	
29	0.000209	4.412321E-5	-0.000190	-7.659530E-5	T	29230	2017.09.19 13:38:51.813640132	0000678	
29	0.000215	7.225770E-5	-0.000195	-5.280365E-5	T	29230	2017.09.19 13:38:51.823640132	0000678	
29	0.000196	7.273510E-5	-0.000181	-1.486334E-5	T	29230	2017.09.19 13:38:51.833640132	0000678	
30	0.000201	3.427996E-5	-0.000190	-5.751463E-5	T	29235	2017.09.19 13:38:51.943727632	0000678	
30	0.000193	3.042160E-5	-0.000185	-4.750321E-5	T	29235	2017.09.19 13:38:51.953727632	0000678	
30	0.000197	3.943514E-5	-0.000190	-3.855616E-5	T	29235	2017.09.19 13:38:51.963727632	0000678	
30	0.000180	3.962764E-5	-0.000171	-4.263484E-5	T	29235	2017.09.19 13:38:51.973727632	0000678	
30	0.000201	6.842411E-5	-0.000181	-5.282917E-5	T	29235	2017.09.19 13:38:51.983727632	0000678	
30	0.000197	4.963078E-5	-0.000190	-1.463862E-5	T	29235	2017.09.19 13:38:51.993727632	0000678	
30	0.000213	4.926811E-5	-0.000204	-3.857952E-5	T	29235	2017.09.19 13:38:52.003727632	0000678	
30	0.000199	4.427090E-5	-0.000181	-7.163286E-5	T	29235	2017.09.19 13:38:52.013727632	0000678	
30	0.000203	4.945677E-5	-0.000195	-2.861729E-5	T	29235	2017.09.19 13:38:52.023727632	0000678	
30	0.000194	4.953436E-5	-0.000185	-3.365858E-5	T	29235	2017.09.19 13:38:52.033727632	0000678	
31	0.000185	1.577555E-5	-0.000184	-4.382817E-6	T	29228	2017.09.19 13:38:52.143815132	0000678	
31	0.000212	4.930909E-5	-0.000204	-3.357973E-5	T	29228	2017.09.19 13:38:52.153815132	0000678	
31	0.000197	4.451657E-5	-0.000190	-2.859731E-5	T	29228	2017.09.19 13:38:52.163815132	0000678	
31	0.000194	3.938615E-5	-0.000181	-5.759271E-5	T	29228	2017.09.19 13:38:52.173815132	0000678	
31	0.000191	3.437219E-5	-0.000176	-6.657236E-5	T	29228	2017.09.19 13:38:52.183815132	0000678	
31	0.000216	3.920987E-5	-0.000209	-3.847731E-5	T	29228	2017.09.19 13:38:52.193815132	0000678	
31	0.000192	5.866280E-5	-0.000181	-2.374891E-5	T	29228	2017.09.19 13:38:52.203815132	0000678	
31	0.000193	2.555952E-5	-0.000189	-2.344274E-5	T	29228	2017.09.19 13:38:52.213815132	0000678	
31	0.000200	3.041777E-5	-0.000195	-3.346230E-5	T	29228	2017.09.19 13:38:52.223815132	0000678	
31	0.000211	6.320319E-5	-0.000190	-6.675050E-5	T	29228	2017.09.19 13:38:52.233815132	0000678	
32	0.000196	5.337022E-5	-0.000176	-6.672714E-5	T	29224	2017.09.19 13:38:52.343902632	0000678	
32	0.000205	4.430158E-5	-0.000195	-4.757576E-5	T	29224	2017.09.19 13:38:52.353902632	0000678	
32	0.000182	4.965938E-5	-0.000171	-3.871647E-5	T	29224	2017.09.19 13:38:52.363902632	0000678	
32	0.000200	7.757888E-5	-0.000181	-3.390328E-5	T	29224	2017.09.19 13:38:52.373902632	0000678	
32	0.000193	3.949442E-5	-0.000185	-3.857691E-5	T	29224	2017.09.19 13:38:52.383902632	0000678	
32	0.000197	3.947612E-5	-0.000190	-3.355637E-5	T	29224	2017.09.19 13:38:52.393902632	0000678	
32	0.000196	2.029972E-5	-0.000185	-6.242112E-5	T	29224	2017.09.19 13:38:52.403902632	0000678	
32	0.000214	2.017906E-5	-0.000208	-4.232236E-5	T	29224	2017.09.19 13:38:52.413902632	0000678	
32	0.000184	3.052831E-5	-0.000176	-4.754057E-5	T	29224	2017.09.19 13:38:52.423902632	0000678	
32	0.000185	1.554434E-5	-0.000180	-3.839800E-5	T	29224	2017.09.19 13:38:52.433902632	0000678	
33	0.000195	3.934517E-5	-0.000181	-6.259250E-5	T	29225	2017.09.19 13:38:52.543990132	0000678	
33	0.000192	3.942712E-5	-0.000181	-5.259292E-5	T	29225	2017.09.19 13:38:52.553990132	0000678	
33	0.000190	3.457689E-5	-0.000185	-2.853659E-5	T	29225	2017.09.19 13:38:52.563990132	0000678	
33	0.000185	3.062474E-5	-0.000180	-2.852061E-5	T	29225	2017.09.19 13:38:52.573990132	0000678	
33	0.000192	6.863910E-5	-0.000176	-3.385071E-5	T	29225	2017.09.19 13:38:52.583990132	0000678	
33	0.000199	3.936139E-5	-0.000190	-4.755578E-5	T	29225	2017.09.19 13:38:52.593990132	0000678	
33	0.000191	6.347589E-5	-0.000167	-6.684595E-5	T	29225	2017.09.19 13:38:52.603990132	0000678	
33	0.000178	2.075881E-5	-0.000175	-1.946027E-5	T	29225	2017.09.19 13:38:52.613990132	0000678	
33	0.000210	2.544898E-5	-0.000208	-9.364470E-6	T	29225	2017.09.19 13:38:52.623990132	0000678	
33	0.000186	6.369890E-5	-0.000171	-3.383073E-5	T	29225	2017.09.19 13:38:52.633990132	0000678	
34	0.000205	3.920568E-5	-0.000190	-6.655499E-5	T	29235	2017.09.19 13:38:52.744077632	0000678	
34	0.000212	2.025282E-5	-0.000208	-3.332274E-5	T	29235	2017.09.19 13:38:52.754077632	0000678	
34	0.000197	1.546030E-5	-0.000194	-2.834031E-5	T	29235	2017.09.19 13:38:52.764077632	0000678	
34	0.000196	4.442015E-5	-0.000185	-4.761726E-5	T	29235	2017.09.19 13:38:52.774077632	0000678	
34	0.000205	5.826299E-5	-0.000185	-6.673052E-5	T	29235	2017.09.19 13:38:52.784077632	0000678	
34	0.000197	1.532290E-5	-0.000189	-5.236006E-5	T	29235	2017.09.19 13:38:52.794077632	0000678	
34	0.000195	3.955807E-5	-0.000190	-2.355678E-5	T	29235	2017.09.19 13:38:52.804077632	0000678	
34	0.000218	7.223939E-5	-0.000200	-4.778311E-5	T	29235	2017.09.19 13:38:52.814077632	0000678	
34	0.000181	2.050668E-5	-0.000170	-5.747943E-5	T	29235	2017.09.19 13:38:52.824077632	0000678	
34	0.000199	3.957254E-5	-0.000195	-1.453641E-5	T	29235	2017.09.19 13:38:52.834077632	0000678	
35	0.000192	4.950803E-5	-0.000181	-4.267480E-5	T	29229	2017.09.19 13:38:52.944165132	0000678	
35	0.000195	2.534017E-5	-0.000185	-5.746207E-5	T	29229	2017.09.19 13:38:52.954165132	0000678	
35	0.000210	5.825916E-5	-0.000195	-5.268960E-5	T	29229	2017.09.19 13:38:52.964165132	0000678	
35	0.000187	2.551052E-5	-0.000180	-4.247929E-5	T	29229	2017.09.19 13:38:52.974165132	0000678	
35	0.000194	6.856534E-5	-0.000176	-4.285033E-5	T	29229	2017.09.19 13:38:52.984165132	0000678	
35	0.000206	3.431710E-5	-0.000200	-3.847393E-5	T	29229	2017.09.19 13:38:52.994165132	0000678	
35	0.000204	5.852959E-5	-0.000195	-1.969098E-5	T	29229	2017.09.19 13:38:53.004165132	0000678	
35	0.000207	6.829473E-5	-0.000185	-6.281215E-5	T	29229	2017.09.19 13:38:53.014165132	0000678	
35	0.000208	3.917918E-5	-0.000195	-6.253440E-5	T	29229	2017.09.19 13:38:53.024165132	0000678	
35	0.000222	4.401267E-5	-0.000209	-6.251704E-5	T	29229	2017.09.19 13:38:53.034165132	0000678	
36	0.000202	4.936035E-5	-0.000190	-4.763724E-5	T	29227	2017.09.19 13:38:53.144252632	0000678	
36	0.000198	4.937866E-5	-0.000185	-5.265779E-5	T	29227	2017.09.19 13:38:53.154252632	0000678	
36	0.000197	4.437917E-5	-0.000185	-5.261705E-5	T	29227	2017.09.19 13:38:53.164252632	0000678	
36	0.000193	1.547861E-5	-0.000189	-3.336085E-5	T	29227	2017.09.19 13:38:53.174252632	0000678	
36	0.000204	3.930210E-5	-0.000195	-4.753503E-5	T	29227	2017.09.19 13:38:53.184252632	0000678	
36	0.000191	4.461683E-5	-0.000185	-2.361827E-5	T	29227	2017.09.19 13:38:53.194252632	0000678	
36	0.000203	3.030304E-5	-0.000195	-4.746171E-5	T	29227	2017.09.19 13:38:53.204252632	0000678	
36	0.000207	1.520434E-5	-0.000199	-5.231856E-5	T	29227	2017.09.19 13:38:53.214252632	0000678	
36	0.000182	3.968308E-5	-0.000176	-2.861468E-5	T	29227	2017.09.19 13:38:53.224252632	0000678	
36	0.000181	3.468360E-5	-0.000176	-2.857394E-5	T	29227	2017.09.19 13:38:53.234252632	0000678	
37	0.000208	3.928380E-5	-0.000200	-4.251449E-5	T	29224	2017.09.19 13:38:53.344340132	0000678	
37	0.000195	4.446112E-5	-0.000185	-4.261747E-5	T	29224	2017.09.19 13:38:53.354340132	0000678	
37	0.000196	3.043608E-5	-0.000190	-3.848284E-5	T	29224	2017.09.19 13:38:53.364340132	0000678	
37	0.000204	5.835941E-5	-0.000190	-4.771056E-5	T	29224	2017.09.19 13:38:53.374340132	0000678	
37	0.000196	6.364764E-5	-0.000185	-1.977321E-5	T	29224	2017.09.19 13:38:53.384340132	0000678	
37	0.000199	4.424823E-5	-0.000176	-8.165319E-5	T	29224	2017.09.19 13:38:53.394340132	0000678	
37	0.000213	2.521132E-5	-0.000208	-3.836326E-5	T	29224	2017.09.19 13:38:53.404340132	0000678	
37	0.000189	4.952634E-5	-0.000176	-4.769534E-5	T	29224	2017.09.19 13:38:53.414340132	0000678	
37	0.000227	4.389794E-5	-0.000209	-7.651645E-5	T	29224	2017.09.19 13:38:53.424340132	0000678	
37	0.000197	5.853343E-5	-0.000185	-3.373190E-5	T	29224	2017.09.19 13:38:53.434340132	0000678	
38	0.000210	4.435058E-5	-0.000204	-2.853921E-5	T	29222	2017.09.19 13:38:53.544427632	0000678	
38	0.000198	3.036232E-5	-0.000190	-4.748246E-5	T	29222	2017.09.19 13:38:53.554427632	0000678	
38	0.000210	5.825916E-5	-0.000195	-5.268960E-5	T	29222	2017.09.19 13:38:53.564427632	0000678	
38	0.000214	4.419488E-5	-0.000204	-4.753841E-5	T	29222	2017.09.19 13:38:53.574427632	0000678	
38	0.000204	5.326351E-5	-0.000185	-6.668979E-5	T	29222	2017.09.19 13:38:53.584427632	0000678	
38	0.000185	3.977951E-5	-0.000181	-9.594720E-6	T	29222	2017.09.19 13:38:53.594427632	0000678	
38	0.000192	3.038708E-5	-0.000181	-5.751940E-5	T	29222	2017.09.19 13:38:53.604427632	0000678	
38	0.000214	3.915442E-5	-0.000204	-5.249747E-5	T	29222	2017.09.19 13:38:53.614427632	0000678	
38	0.000201	5.333726E-5	-0.000185	-5.769016E-5	T	29222	2017.09.19 13:38:53.624427632	0000678	
38	0.000195	1.365334E-6	-0.000189	-4.724622E-5	T	29222	2017.09.19 13:38:53.634427632	0000678	
39	0.000196	4.434465E-5	-0.000181	-6.263324E-5	T	29228	2017.09.19 13:38:53.744515132	0000678	
39	0.000201	7.240103E-5	-0.000176	-6.288208E-5	T	29228	2017.09.19 13:38:53.754515132	0000678	
39	0.000186	1.551156E-5	-0.000180	-4.239783E-5	T	29228	2017.09.19 13:38:53.764515132	0000678	
39	0.000175	3.461194E-5	-0.000162	-5.763083E-5	T	29228	2017.09.19 13:38:53.774515132	0000678	
39	0.000178	3.066135E-5	-0.000171	-3.856169E-5	T	29228	2017.09.19 13:38:53.784515132	0000678	
39	0.000200	1.534557E-5	-0.000194	-4.233973E-5	T	29228	2017.09.19 13:38:53.794515132	0000678	
39	0.000215	5.323492E-5	-0.000204	-4.261194E-5	T	29228	2017.09.19 13:38:53.804515132	0000678	
39	0.000205	6.339987E-5	-0.000190	-4.275150E-5	T	29228	2017.09.19 13:38:53.814515132	0000678	
39	0.000190	5.366332E-5	-0.000181	-2.370818E-5	T	29228	2017.09.19 13:38:53.824515132	0000678	
39	0.000215	4.408660E-5	-0.000200	-6.655422E-5	T	29228	2017.09.19 13:38:53.834515132	0000678	
40	0.000187	4.469704E-5	-0.000181	-1.963503E-5	T	29242	2017.09.19 13:38:53.944602632	0000678	
40	0.000208	3.917918E-5	-0.000195	-6.253440E-5	T	29242	2017.09.19 13:38:53.954602632	0000678	
40	0.000179	2.068506E-5	-0.000175	-2.845990E-5	T	29242	2017.09.19 13:38:53.964602632	0000678	
40	0.000200	5.347466E-5	-0.000190	-3.367041E-5	T	29242	2017.09.19 13:38:53.974602632	0000678	
40	0.000200	1.524095E-5	-0.000189	-6.235964E-5	T	29242	2017.09.19 13:38:53.984602632	0000678	
40	0.000177	3.059405E-5	-0.000167	-5.257771E-5	T	29242	2017.09.19 13:38:53.994602632	0000678	
40	0.000179	3.966042E-5	-0.000171	-3.863501E-5	T	29242	2017.09.19 13:38:54.004602632	0000678	
40	0.000202	4.441631E-5	-0.000195	-3.357635E-5	T	29242	2017.09.19 13:38:54.014602632	0000678	
40	0.000207	4.435703E-5	-0.000200	-3.355560E-5	T	29242	2017.09.19 13:38:54.024602632	0000678	
40	0.000178	2.075881E-5	-0.000175	-1.946027E-5	T	29242	2017.09.19 13:38:54.034602632	0000678	
41	0.000198	3.940236E-5	-0.000190	-4.255599E-5	T	29240	2017.09.19 13:38:54.144690132	0000678	
41	0.000199	3.449930E-5	-0.000195	-2.349530E-5	T	29240	2017.09.19 13:38:54.154690132	0000678	
41	0.000188	5.359968E-5	-0.000176	-3.872831E-5	T	29240	2017.09.19 13:38:54.164690132	0000678	
41	0.000195	3.429024E-5	-0.000176	-7.657194E-5	T	29240	2017.09.19 13:38:54.174690132	0000678	
41	0.000190	3.457689E-5	-0.000185	-2.853659E-5	T	29240	2017.09.19 13:38:54.184690132	0000678	
41	0.000207	5.323701E-5	-0.000190	-6.266920E-5	T	29240	2017.09.19 13:38:54.194690132	0000678	
41	0.000186	4.450419E-5	-0.000171	-5.767495E-5	T	29240	2017.09.19 13:38:54.204690132	0000678	
41	0.000193	4.946706E-5	-0.000181	-4.767459E-5	T	29240	2017.09.19 13:38:54.214690132	0000678	
41	0.000193	1.143805E-5	-0.000189	-3.832806E-5	T	29240	2017.09.19 13:38:54.224690132	0000678	
41	0.000173	6.897910E-5	-0.000157	-1.993015E-5	T	29240	2017.09.19 13:38:54.234690132	0000678	
42	0.000189	2.553685E-5	-0.000184	-3.346307E-5	T	29229	2017.09.19 13:38:54.344777632	0000678	
42	0.000206	7.237627E-5	-0.000185	-5.284515E-5	T	29229	2017.09.19 13:38:54.354777632	0000678	
42	0.000201	2.018499E-5	-0.000185	-7.642054E-5	T	29229	2017.09.19 13:38:54.364777632	0000678	
42	0.000213	4.423585E-5	-0.000204	-4.253862E-5	T	29229	2017.09.19 13:38:54.374777632	0000678	
42	0.000177	2.062961E-5	-0.000170	-4.248006E-5	T	29229	2017.09.19 13:38:54.384777632	0000678	
42	0.000210	5.839655E-5	-0.000200	-2.866985E-5	T	29229	2017.09.19 13:38:54.394777632	0000678	
42	0.000199	4.427090E-5	-0.000181	-7.163286E-5	T	29229	2017.09.19 13:38:54.404777632	0000678	
42	0.000191	3.049536E-5	-0.000185	-3.850359E-5	T	29229	2017.09.19 13:38:54.414777632	0000678	
42	0.000214	3.929182E-5	-0.000209	-2.847772E-5	T	29229	2017.09.19 13:38:54.424777632	0000678	
42	0.000194	3.459137E-5	-0.000190	-1.951622E-5	T	29229	2017.09.19 13:38:54.434777632	0000678	
43	0.000205	5.327798E-5	-0.000190	-5.766941E-5	T	29234	2017.09.19 13:38:54.544865132	0000678	
43	0.000194	4.449391E-5	-0.000185	-3.861764E-5	T	29234	2017.09.19 13:38:54.554865132	0000678	
43	0.000200	6.853239E-5	-0.000185	-3.381336E-5	T	29234	2017.09.19 13:38:54.564865132	0000678	
43	0.000185	3.452790E-5	-0.000176	-4.757315E-5	T	29234	2017.09.19 13:38:54.574865132	0000678	
43	0.000195	1.527391E-5	-0.000180	-7.139662E-5	T	29234	2017.09.19 13:38:54.584865132	0000678	
43	0.000184	3.486198E-5	-0.000180	4.455938E-7	T	29234	2017.09.19 13:38:54.594865132	0000678	
43	0.000193	4.957534E-5	-0.000185	-2.865879E-5	T	29234	2017.09.19 13:38:54.604865132	0000678	
43	0.000193	3.042160E-5	-0.000185	-4.750321E-5	T	29234	2017.09.19 13:38:54.614865132	0000678	
43	0.000180	2.568454E-5	-0.000175	-2.850063E-5	T	29234	2017.09.19 13:38:54.624865132	0000678	
43	0.000196	6.344294E-5	-0.000176	-5.780898E-5	T	29234	2017.09.19 13:38:54.634865132	0000678	
44	0.000196	4.442015E-5	-0.000185	-4.761726E-5	T	29227	2017.09.19 13:38:54.744952632	0000678	
44	0.000193	3.949442E-5	-0.000185	-3.857691E-5	T	29227	2017.09.19 13:38:54.754952632	0000678	
44	0.000184	-2.550209E-6	-0.000175	-5.727132E-5	T	29227	2017.09.19 13:38:54.764952632	0000678	
44	0.000186	5.875487E-5	-0.000176	-1.976983E-5	T	29227	2017.09.19 13:38:54.774952632	0000678	
44	0.000196	7.759719E-5	-0.000176	-3.892382E-5	T	29227	2017.09.19 13:38:54.784952632	0000678	
44	0.000178	4.970680E-5	-0.000167	-3.873307E-5	T	29227	2017.09.19 13:38:54.794952632	0000678	
44	0.000192	3.046258E-5	-0.000185	-4.250342E-5	T	29227	2017.09.19 13:38:54.804952632	0000678	
44	0.000199	3.961351E-5	-0.000195	-9.536619E-6	T	29227	2017.09.19 13:38:54.814952632	0000678	
44	0.000206	5.831844E-5	-0.000190	-5.271035E-5	T	29227	2017.09.19 13:38:54.824952632	0000678	
44	0.000177	4.461090E-5	-0.000162	-5.771230E-5	T	29227	2017.09.19 13:38:54.834952632	0000678	
45	0.000191	3.946810E-5	-0.000181	-4.759313E-5	T	29220	2017.09.19 13:38:54.945040132	0000678	
45	0.000193	4.453488E-5	-0.000185	-3.361785E-5	T	29220	2017.09.19 13:38:54.955040132	0000678	
45	0.000211	4.924178E-5	-0.000200	-4.759574E-5	T	29220	2017.09.19 13:38:54.965040132	0000678	
45	0.000208	2.508421E-5	-0.000190	-8.144031E-5	T	29220	2017.09.19 13:38:54.975040132	0000678	
45	0.000197	3.933872E-5	-0.000185	-5.757611E-5	T	29220	2017.09.19 13:38:54.985040132	0000678	
45	0.000205	4.423794E-5	-0.000190	-6.259589E-5	T	29220	2017.09.19 13:38:54.995040132	0000678	
45	0.000208	1.123928E-5	-0.000203	-4.226979E-5	T	29220	2017.09.19 13:38:55.005040132	0000678	
45	0.000191	2.546310E-5	-0.000184	-4.246269E-5	T	29220	2017.09.19 13:38:55.015040132	0000678	
45	0.000196	3.447664E-5	-0.000190	-3.351563E-5	T	29220	2017.09.19 13:38:55.025040132	0000678	
45	0.000189	3.046903E-5	-0.000181	-4.751981E-5	T	29220	2017.09.19 13:38:55.035040132	0000678	
46	0.000193	4.957534E-5	-0.000185	-2.865879E-5	T	29228	2017.09.19 13:38:55.145127632	0000678	
46	0.000195	4.949339E-5	-0.000185	-3.865837E-5	T	29228	2017.09.19 13:38:55.155127632	0000678	
46	0.000188	3.469162E-5	-0.000184	-1.453718E-5	T	29228	2017.09.19 13:38:55.165127632	0000678	
46	0.000193	3.042160E-5	-0.000185	-4.750321E-5	T	29228	2017.09.19 13:38:55.175127632	0000678	
46	0.000203	2.526258E-5	-0.000195	-5.242077E-5	T	29228	2017.09.19 13:38:55.185127632	0000678	
46	0.000204	2.022213E-5	-0.000194	-5.737983E-5	T	29228	2017.09.19 13:38:55.195127632	0000678	
46	0.000204	3.930210E-5	-0.000195	-4.753503E-5	T	29228	2017.09.19 13:38:55.205127632	0000678	
46	0.000196	6.344294E-5	-0.000176	-5.780898E-5	T	29228	2017.09.19 13:38:55.215127632	0000678	
46	0.000182	3.972406E-5	-0.000176	-2.361488E-5	T	29228	2017.09.19 13:38:55.225127632	0000678	
46	0.000189	2.053737E-5	-0.000184	-3.342234E-5	T	29228	2017.09.19 13:38:55.235127632	0000678	
47	0.000209	5.325967E-5	-0.000195	-5.264887E-5	T	29229	2017.09.19 13:38:55.345215132	0000678	
47	0.000195	3.959085E-5	-0.000190	-1.955695E-5	T	29229	2017.09.19 13:38:55.355215132	0000678	
47	0.000191	3.442764E-5	-0.000181	-5.255219E-5	T	29229	2017.09.19 13:38:55.365215132	0000678	
47	0.000183	2.066675E-5	-0.000180	-2.343935E-5	T	29229	2017.09.19 13:38:55.375215132	0000678	
47	0.000178	4.478282E-5	-0.000171	-2.367637E-5	T	29229	2017.09.19 13:38:55.385215132	0000678	
47	0.000189	3.461787E-5	-0.000185	-2.353680E-5	T	29229	2017.09.19 13:38:55.395215132	0000678	
47	0.000198	6.346560E-5	-0.000181	-4.778864E-5	T	29229	2017.09.19 13:38:55.405215132	0000678	
47	0.000188	2.557783E-5	-0.000184	-2.846328E-5	T	29229	2017.09.19 13:38:55.415215132	0000678	
47	0.000216	6.828078E-5	-0.000200	-4.275073E-5	T	29229	2017.09.19 13:38:55.425215132	0000678	
47	0.000187	2.061932E-5	-0.000184	-2.342275E-5	T	29229	2017.09.19 13:38:55.435215132	0000678	
48	0.000209	3.914640E-5	-0.000195	-6.653424E-5	T	29232	2017.09.19 13:38:55.545302632	0000678	
48	0.000208	3.435162E-5	-0.000204	-2.845774E-5	T	29232	2017.09.19 13:38:55.555302632	0000678	
48	0.000203	1.536004E-5	-0.000199	-3.331935E-5	T	29232	2017.09.19 13:38:55.565302632	0000678	
48	0.000175	2.070336E-5	-0.000170	-3.348044E-5	T	29232	2017.09.19 13:38:55.575302632	0000678	
48	0.000212	6.213295E-6	-0.000208	-3.820848E-5	T	29232	2017.09.19 13:38:55.585302632	0000678	
48	0.000186	3.952738E-5	-0.000176	-4.761388E-5	T	29232	2017.09.19 13:38:55.595302632	0000678	
48	0.000181	4.970035E-5	-0.000171	-3.371668E-5	T	29232	2017.09.19 13:38:55.605302632	0000678	
48	0.000200	6.345915E-5	-0.000185	-4.277225E-5	T	29232	2017.09.19 13:38:55.615302632	0000678	
48	0.000194	3.455859E-5	-0.000190	-2.351605E-5	T	29232	2017.09.19 13:38:55.625302632	0000678	
48	0.000201	3.941683E-5	-0.000195	-3.353562E-5	T	29232	2017.09.19 13:38:55.635302632	0000678	
49	0.000200	3.923044E-5	-0.000181	-7.659192E-5	T	29237	2017.09.19 13:38:55.745390132	0000678	
49	0.000188	3.958283E-5	-0.000181	-3.359372E-5	T	29237	2017.09.19 13:38:55.755390132	0000678	
49	0.000209	4.916367E-5	-0.000190	-7.163624E-5	T	29237	2017.09.19 13:38:55.765390132	0000678	
49	0.000199	3.929774E-5	-0.000185	-6.257590E-5	T	29237	2017.09.19 13:38:55.775390132	0000678	
49	0.000185	5.375538E-5	-0.000176	-1.972910E-5	T	29237	2017.09.19 13:38:55.785390132	0000678	
49	0.000199	3.426548E-5	-0.000185	-6.653501E-5	T	29237	2017.09.19 13:38:55.795390132	0000678	
49	0.000181	4.970035E-5	-0.000171	-3.371668E-5	T	29237	2017.09.19 13:38:55.805390132	0000678	
49	0.000190	3.053633E-5	-0.000185	-3.350380E-5	T	29237	2017.09.19 13:38:55.815390132	0000678	
49	0.000205	5.341538E-5	-0.000195	-3.364966E-5	T	29237	2017.09.19 13:38:55.825390132	0000678	
49	0.000202	1.126404E-5	-0.000194	-5.230673E-5	T	29237	2017.09.19 13:38:55.835390132	0000678	
50	0.000196	4.946061E-5	-0.000185	-4.265820E-5	T	29229	2017.09.19 13:38:55.945477632	0000678	
50	0.000192	4.964909E-5	-0.000185	-1.965916E-5	T	29229	2017.09.19 13:38:55.955477632	0000678	
50	0.000192	2.542212E-5	-0.000185	-4.746248E-5	T	29229	2017.09.19 13:38:55.965477632	0000678	
50	0.000193	4.453488E-5	-0.000185	-3.361785E-5	T	29229	2017.09.19 13:38:55.975477632	0000678	
50	0.000211	4.414588E-5	-0.000195	-6.657497E-5	T	29229	2017.09.19 13:38:55.985477632	0000678	
50	0.000203	3.430262E-5	-0.000195	-4.749430E-5	T	29229	2017.09.19 13:38:55.995477632	0000678	
50	0.000198	1.541933E-5	-0.000194	-3.334010E-5	T	29229	2017.09.19 13:38:56.005477632	0000678	
50	0.000210	6.329961E-5	-0.000195	-4.773054E-5	T	29229	2017.09.19 13:38:56.015477632	0000678	
50	0.000197	5.842515E-5	-0.000181	-5.274770E-5	T	29229	2017.09.19 13:38:56.025477632	0000678	
50	0.000187	3.054279E-5	-0.000181	-3.852019E-5	T	29229	2017.09.19 13:38:56.035477632	0000678	
51	0.000208	4.416419E-5	-0.000190	-7.159551E-5	T	29230	2017.09.19 13:38:56.145565132	0000678	
51	0.000189	2.553685E-5	-0.000184	-3.346307E-5	T	29230	2017.09.19 13:38:56.155565132	0000678	
51	0.000197	3.947612E-5	-0.000190	-3.355637E-5	T	29230	2017.09.19 13:38:56.165565132	0000678	
51	0.000194	4.953436E-5	-0.000185	-3.365858E-5	T	29230	2017.09.19 13:38:56.175565132	0000678	
51	0.000184	3.960113E-5	-0.000176	-3.861426E-5	T	29230	2017.09.19 13:38:56.185565132	0000678	
51	0.000189	3.057731E-5	-0.000184	-2.850401E-5	T	29230	2017.09.19 13:38:56.195565132	0000678	
51	0.000194	3.051803E-5	-0.000189	-2.848326E-5	T	29230	2017.09.19 13:38:56.205565132	0000678	
51	0.000197	6.340196E-5	-0.000176	-6.280877E-5	T	29230	2017.09.19 13:38:56.215565132	0000678	
51	0.000203	5.840039E-5	-0.000190	-4.271077E-5	T	29230	2017.09.19 13:38:56.225565132	0000678	
51	0.000202	3.059614E-5	-0.000199	-4.442761E-6	T	29230	2017.09.19 13:38:56.235565132	0000678	
52	0.000198	5.358939E-5	-0.000190	-1.967100E-5	T	29228	2017.09.19 13:38:56.345652632	0000678	
52	0.000190	4.444491E-5	-0.000176	-5.765420E-5	T	29228	2017.09.19 13:38:56.355652632	0000678	
52	0.000200	5.347466E-5	-0.000190	-3.367041E-5	T	29228	2017.09.19 13:38:56.365652632	0000678	
52	0.000196	5.337022E-5	-0.000176	-6.672714E-5	T	29228	2017.09.19 13:38:56.375652632	0000678	
52	0.000180	2.568454E-5	-0.000175	-2.850063E-5	T	29228	2017.09.19 13:38:56.385652632	0000678	
52	0.000186	1.165304E-5	-0.000184	-1.934961E-5	T	29228	2017.09.19 13:38:56.395652632	0000678	
52	0.000208	4.431606E-5	-0.000200	-3.855539E-5	T	29228	2017.09.19 13:38:56.405652632	0000678	
52	0.000200	4.933768E-5	-0.000185	-5.765758E-5	T	29228	2017.09.19 13:38:56.415652632	0000678	
52	0.000198	3.924875E-5	-0.000176	-8.161246E-5	T	29228	2017.09.19 13:38:56.425652632	0000678	
52	0.000200	4.429722E-5	-0.000185	-6.261664E-5	T	29228	2017.09.19 13:38:56.435652632	0000678	
53	0.000199	6.840144E-5	-0.000176	-6.284950E-5	T	29225	2017.09.19 13:38:56.545740132	0000678	
53	0.000197	5.842515E-5	-0.000181	-5.274770E-5	T	29225	2017.09.19 13:38:56.555740132	0000678	
53	0.000199	5.334372E-5	-0.000181	-6.270655E-5	T	29225	2017.09.19 13:38:56.565740132	0000678	
53	0.000209	2.516232E-5	-0.000200	-5.739981E-5	T	29225	2017.09.19 13:38:56.575740132	0000678	
53	0.000211	4.924178E-5	-0.000200	-4.759574E-5	T	29225	2017.09.19 13:38:56.585740132	0000678	
53	0.000187	3.081496E-5	-0.000184	4.947792E-7	T	29225	2017.09.19 13:38:56.595740132	0000678	
53	0.000187	3.458335E-5	-0.000181	-3.355299E-5	T	29225	2017.09.19 13:38:56.605740132	0000678	
53	0.000176	2.059509E-5	-0.000166	-5.249624E-5	T	29225	2017.09.19 13:38:56.615740132	0000678	
53	0.000201	3.932041E-5	-0.000190	-5.255557E-5	T	29225	2017.09.19 13:38:56.625740132	0000678	
53	0.000186	3.443148E-5	-0.000171	-6.659311E-5	T	29225	2017.09.19 13:38:56.635740132	0000678	
54	0.000206	4.420516E-5	-0.000190	-6.659572E-5	T	29224	2017.09.19 13:38:56.745827632	0000678	
54	0.000209	5.830013E-5	-0.000195	-4.768981E-5	T	29224	2017.09.19 13:38:56.755827632	0000678	
54	0.000203	5.840039E-5	-0.000190	-4.271077E-5	T	29224	2017.09.19 13:38:56.765827632	0000678	
54	0.000192	4.950803E-5	-0.000181	-4.267480E-5	T	29224	2017.09.19 13:38:56.775827632	0000678	
54	0.000208	3.439259E-5	-0.000204	-2.345795E-5	T	29224	2017.09.19 13:38:56.785827632	0000678	
54	0.000203	3.020662E-5	-0.000190	-6.648167E-5	T	29224	2017.09.19 13:38:56.795827632	0000678	
54	0.000186	2.051104E-5	-0.000180	-4.243856E-5	T	29224	2017.09.19 13:38:56.805827632	0000678	
54	0.000179	1.554818E-5	-0.000170	-5.243891E-5	T	29224	2017.09.19 13:38:56.815827632	0000678	
54	0.000206	5.337440E-5	-0.000195	-3.864946E-5	T	29224	2017.09.19 13:38:56.825827632	0000678	
54	0.000189	3.461787E-5	-0.000185	-2.353680E-5	T	29224	2017.09.19 13:38:56.835827632	0000678	
55	0.000195	2.543660E-5	-0.000189	-3.844211E-5	T	29227	2017.09.19 13:38:56.945915132	0000678	
55	0.000210	5.335610E-5	-0.000200	-3.362891E-5	T	29227	2017.09.19 13:38:56.955915132	0000678	
55	0.000191	2.067477E-5	-0.000189	-9.402590E-6	T	29227	2017.09.19 13:38:56.965915132	0000678	
55	0.000200	6.836866E-5	-0.000176	-6.684933E-5	T	29227	2017.09.19 13:38:56.975915132	0000678	
55	0.000185	2.058480E-5	-0.000180	-3.343894E-5	T	29227	2017.09.19 13:38:56.985915132	0000678	
55	0.000217	5.844555E-5	-0.000209	-9.633299E-6	T	29227	2017.09.19 13:38:56.995915132	0000678	
55	0.000173	3.065333E-5	-0.000162	-5.259846E-5	T	29227	2017.09.19 13:38:57.005915132	0000678	
55	0.000213	5.828182E-5	-0.000200	-4.266927E-5	T	29227	2017.09.19 13:38:57.015915132	0000678	
55	0.000189	3.938998E-5	-0.000171	-7.163363E-5	T	29227	2017.09.19 13:38:57.025915132	0000678	
55	0.000222	6.317459E-5	-0.000209	-4.267265E-5	T	29227	2017.09.19 13:38:57.035915132	0000678	
56	0.000188	3.948640E-5	-0.000176	-5.261367E-5	T	29228	2017.09.19 13:38:57.146002632	0000678	
56	0.000200	3.432093E-5	-0.000190	-5.251484E-5	T	29228	2017.09.19 13:38:57.156002632	0000678	
56	0.000200	3.441735E-5	-0.000195	-3.349488E-5	T	29228	2017.09.19 13:38:57.166002632	0000678	
56	0.000212	2.502493E-5	-0.000195	-8.141956E-5	T	29228	2017.09.19 13:38:57.176002632	0000678	
56	0.000191	3.946810E-5	-0.000181	-4.759313E-5	T	29228	2017.09.19 13:38:57.186002632	0000678	
56	0.000185	6.512498E-6	-0.000180	-4.232451E-5	T	29228	2017.09.19 13:38:57.196002632	0000678	
56	0.000191	3.442764E-5	-0.000181	-5.255219E-5	T	29228	2017.09.19 13:38:57.206002632	0000678	
56	0.000183	5.874039E-5	-0.000171	-2.879021E-5	T	29228	2017.09.19 13:38:57.216002632	0000678	
56	0.000195	2.040434E-5	-0.000189	-4.240121E-5	T	29228	2017.09.19 13:38:57.226002632	0000678	
56	0.000190	6.849368E-5	-0.000162	-7.190722E-5	T	29228	2017.09.19 13:38:57.236002632	0000678	
57	0.000212	5.317772E-5	-0.000195	-6.264845E-5	T	29223	2017.09.19 13:38:57.346090132	0000678	
57	0.000195	5.346664E-5	-0.000181	-4.770718E-5	T	29223	2017.09.19 13:38:57.356090132	0000678	
57	0.000212	5.312228E-5	-0.000190	-7.666862E-5	T	29223	2017.09.19 13:38:57.366090132	0000678	
57	0.000191	3.442764E-5	-0.000181	-5.255219E-5	T	29223	2017.09.19 13:38:57.376090132	0000678	
57	0.000205	5.327798E-5	-0.000190	-5.766941E-5	T	29223	2017.09.19 13:38:57.386090132	0000678	
57	0.000192	3.942712E-5	-0.000181	-5.259292E-5	T	29223	2017.09.19 13:38:57.396090132	0000678	
57	0.000172	3.483129E-5	-0.000167	-2.361150E-5	T	29223	2017.09.19 13:38:57.406090132	0000678	
57	0.000200	6.338365E-5	-0.000181	-5.778823E-5	T	29223	2017.09.19 13:38:57.416090132	0000678	
57	0.000206	1.131303E-5	-0.000203	-3.327017E-5	T	29223	2017.09.19 13:38:57.426090132	0000678	
57	0.000202	-2.638086E-6	-0.000199	-3.317272E-5	T	29223	2017.09.19 13:38:57.436090132	0000678	
58	0.000191	5.362235E-5	-0.000181	-2.870797E-5	T	29235	2017.09.19 13:38:57.546177632	0000678	
58	0.000213	7.741289E-5	-0.000195	-3.384518E-5	T	29235	2017.09.19 13:38:57.556177632	0000678	
58	0.000191	3.042806E-5	-0.000181	-5.251961E-5	T	29235	2017.09.19 13:38:57.566177632	0000678	
58	0.000188	4.956731E-5	-0.000176	-4.269555E-5	T	29235	2017.09.19 13:38:57.576177632	0000678	
58	0.000186	2.039195E-5	-0.000171	-7.147885E-5	T	29235	2017.09.19 13:38:57.586177632	0000678	
58	0.000199	5.351564E-5	-0.000190	-2.867062E-5	T	29235	2017.09.19 13:38:57.596177632	0000678	
58	0.000199	4.433820E-5	-0.000185	-5.761685E-5	T	29235	2017.09.19 13:38:57.606177632	0000678	
58	0.000202	3.434360E-5	-0.000195	-4.249451E-5	T	29235	2017.09.19 13:38:57.616177632	0000678	
58	0.000185	5.372260E-5	-0.000176	-2.372893E-5	T	29235	2017.09.19 13:38:57.626177632	0000678	
58	0.000194	3.938615E-5	-0.000181	-5.759271E-5	T	29235	2017.09.19 13:38:57.636177632	0000678	
59	0.000196	6.862079E-5	-0.000181	-2.883017E-5	T	29231	2017.09.19 13:38:57.746265132	0000678	
59	0.000197	8.267862E-5	-0.000176	-2.896497E-5	T	29231	2017.09.19 13:38:57.756265132	0000678	
59	0.000204	6.851408E-5	-0.000190	-2.879282E-5	T	29231	2017.09.19 13:38:57.766265132	0000678	
59	0.000191	3.957637E-5	-0.000185	-2.857733E-5	T	29231	2017.09.19 13:38:57.776265132	0000678	
59	0.000200	3.926496E-5	-0.000185	-6.657574E-5	T	29231	2017.09.19 13:38:57.786265132	0000678	
59	0.000198	5.830606E-5	-0.000171	-8.178799E-5	T	29231	2017.09.19 13:38:57.796265132	0000678	
59	0.000213	3.415494E-5	-0.000204	-5.245674E-5	T	29231	2017.09.19 13:38:57.806265132	0000678	
59	0.000188	3.469162E-5	-0.000184	-1.453718E-5	T	29231	2017.09.19 13:38:57.816265132	0000678	
59	0.000185	3.452790E-5	-0.000176	-4.757315E-5	T	29231	2017.09.19 13:38:57.826265132	0000678	
59	0.000179	4.961038E-5	-0.000162	-5.775303E-5	T	29231	2017.09.19 13:38:57.836265132	0000678	
60	0.000188	4.466426E-5	-0.000181	-2.363487E-5	T	29231	2017.09.19 13:38:57.946352632	0000678	
60	0.000197	3.040330E-5	-0.000190	-4.248267E-5	T	29231	2017.09.19 13:38:57.956352632	0000678	
60	0.000190	2.542857E-5	-0.000181	-5.247887E-5	T	29231	2017.09.19 13:38:57.966352632	0000678	
60	0.000210	9.650315E-5	-0.000181	-4.305768E-5	T	29231	2017.09.19 13:38:57.976352632	0000678	
60	0.000185	1.554434E-5	-0.000180	-3.839800E-5	T	29231	2017.09.19 13:38:57.986352632	0000678	
60	0.000191	7.254871E-5	-0.000167	-5.791964E-5	T	29231	2017.09.19 13:38:57.996352632	0000678	
60	0.000204	7.262839E-5	-0.000190	-1.482599E-5	T	29231	2017.09.19 13:38:58.006352632	0000678	
60	0.000200	3.441735E-5	-0.000195	-3.349488E-5	T	29231	2017.09.19 13:38:58.016352632	0000678	
60	0.000188	3.061828E-5	-0.000184	-2.350422E-5	T	29231	2017.09.19 13:38:58.026352632	0000678	
60	0.000180	4.974133E-5	-0.000171	-2.871689E-5	T	29231	2017.09.19 13:38:58.036352632	0000678	
61	0.000187	4.960009E-5	-0.000176	-3.869572E-5	T	29231	2017.09.19 13:38:58.146440132	0000678	
61	0.000194	3.946164E-5	-0.000185	-4.257674E-5	T	29231	2017.09.19 13:38:58.156440132	0000678	
61	0.000193	6.438569E-6	-0.000189	-3.828733E-5	T	29231	2017.09.19 13:38:58.166440132	0000678	
61	0.000180	3.983879E-5	-0.000176	-9.615470E-6	T	29231	2017.09.19 13:38:58.176440132	0000678	
61	0.000200	5.331094E-5	-0.000181	-6.670639E-5	T	29231	2017.09.19 13:38:58.186440132	0000678	
61	0.000199	6.349193E-5	-0.000185	-3.877242E-5	T	29231	2017.09.19 13:38:58.196440132	0000678	
61	0.000200	2.034505E-5	-0.000194	-4.238046E-5	T	29231	2017.09.19 13:38:58.206440132	0000678	
61	0.000189	1.717719E-6	-0.000189	-4.248019E-6	T	29231	2017.09.19 13:38:58.216440132	0000678	
61	0.000209	5.830013E-5	-0.000195	-4.768981E-5	T	29231	2017.09.19 13:38:58.226440132	0000678	
61	0.000205	3.920568E-5	-0.000190	-6.655499E-5	T	29231	2017.09.19 13:38:58.236440132	0000678	
62	0.000210	7.231698E-5	-0.000190	-5.282440E-5	T	29239	2017.09.19 13:38:58.346527632	0000678	
62	0.000216	5.311844E-5	-0.000200	-6.262770E-5	T	29239	2017.09.19 13:38:58.356527632	0000678	
62	0.000209	2.510688E-5	-0.000195	-7.141998E-5	T	29239	2017.09.19 13:38:58.366527632	0000678	
62	0.000185	3.469808E-5	-0.000181	-1.955357E-5	T	29239	2017.09.19 13:38:58.376527632	0000678	
62	0.000203	1.522265E-5	-0.000194	-5.733910E-5	T	29239	2017.09.19 13:38:58.386527632	0000678	
62	0.000182	4.965938E-5	-0.000171	-3.871647E-5	T	29239	2017.09.19 13:38:58.396527632	0000678	
62	0.000200	3.041777E-5	-0.000195	-3.346230E-5	T	29239	2017.09.19 13:38:58.406527632	0000678	
62	0.000212	3.923637E-5	-0.000204	-4.249789E-5	T	29239	2017.09.19 13:38:58.416527632	0000678	
62	0.000205	7.745770E-5	-0.000185	-4.288630E-5	T	29239	2017.09.19 13:38:58.426527632	0000678	
62	0.000202	2.530356E-5	-0.000195	-4.742098E-5	T	29239	2017.09.19 13:38:58.436527632	0000678	
63	0.000205	3.035849E-5	-0.000200	-3.344155E-5	T	29223	2017.09.19 13:38:58.546615132	0000678	
63	0.000214	4.419488E-5	-0.000204	-4.753841E-5	T	29223	2017.09.19 13:38:58.556615132	0000678	
63	0.000210	5.321870E-5	-0.000195	-5.764866E-5	T	29223	2017.09.19 13:38:58.566615132	0000678	
63	0.000196	4.442015E-5	-0.000185	-4.761726E-5	T	29223	2017.09.19 13:38:58.576615132	0000678	
63	0.000201	2.018499E-5	-0.000185	-7.642054E-5	T	29223	2017.09.19 13:38:58.586615132	0000678	
63	0.000188	6.865740E-5	-0.000171	-3.887125E-5	T	29223	2017.09.19 13:38:58.596615132	0000678	
63	0.000207	4.426061E-5	-0.000195	-5.257555E-5	T	29223	2017.09.19 13:38:58.606615132	0000678	
63	0.000181	5.378189E-5	-0.000171	-2.374968E-5	T	29223	2017.09.19 13:38:58.616615132	0000678	
63	0.000199	2.019144E-5	-0.000181	-8.143693E-5	T	29223	2017.09.19 13:38:58.626615132	0000678	
63	0.000200	2.528089E-5	-0.000190	-5.744132E-5	T	29223	2017.09.19 13:38:58.636615132	0000678	
64	0.000211	5.835558E-5	-0.000200	-3.366965E-5	T	29235	2017.09.19 13:38:58.746702632	0000678	
64	0.000198	2.041881E-5	-0.000194	-3.338084E-5	T	29235	2017.09.19 13:38:58.756702632	0000678	
64	0.000206	7.247269E-5	-0.000190	-3.382519E-5	T	29235	2017.09.19 13:38:58.766702632	0000678	
64	0.000181	5.889610E-5	-0.000171	-9.791000E-6	T	29235	2017.09.19 13:38:58.776702632	0000678	
64	0.000187	2.569256E-5	-0.000184	-1.446386E-5	T	29235	2017.09.19 13:38:58.786702632	0000678	
64	0.000196	3.937969E-5	-0.000185	-5.257632E-5	T	29235	2017.09.19 13:38:58.796702632	0000678	
64	0.000211	1.515691E-5	-0.000203	-5.230196E-5	T	29235	2017.09.19 13:38:58.806702632	0000678	
64	0.000178	3.957045E-5	-0.000162	-6.267136E-5	T	29235	2017.09.19 13:38:58.816702632	0000678	
64	0.000179	3.075777E-5	-0.000175	-1.954174E-5	T	29235	2017.09.19 13:38:58.826702632	0000678	
64	0.000207	7.728578E-5	-0.000176	-7.692223E-5	T	29235	2017.09.19 13:38:58.836702632	0000678	
65	0.000196	5.857440E-5	-0.000185	-2.873211E-5	T	29231	2017.09.19 13:38:58.946790132	0000678	
65	0.000178	3.466094E-5	-0.000171	-3.859428E-5	T	29231	2017.09.19 13:38:58.956790132	0000678	
65	0.000195	3.451761E-5	-0.000190	-2.851584E-5	T	29231	2017.09.19 13:38:58.966790132	0000678	
65	0.000212	7.237243E-5	-0.000195	-3.880424E-5	T	29231	2017.09.19 13:38:58.976790132	0000678	
65	0.000190	1.546414E-5	-0.000184	-4.238123E-5	T	29231	2017.09.19 13:38:58.986790132	0000678	
65	0.000212	3.419591E-5	-0.000204	-4.745695E-5	T	29231	2017.09.19 13:38:58.996790132	0000678	
65	0.000180	2.564356E-5	-0.000175	-3.350042E-5	T	29231	2017.09.19 13:38:59.006790132	0000678	
65	0.000196	5.846612E-5	-0.000181	-4.774791E-5	T	29231	2017.09.19 13:38:59.016790132	0000678	
65	0.000201	4.453104E-5	-0.000195	-1.957693E-5	T	29231	2017.09.19 13:38:59.026790132	0000678	
65	0.000180	6.386105E-5	-0.000167	-1.984791E-5	T	29231	2017.09.19 13:38:59.036790132	0000678	
66	0.000203	3.430262E-5	-0.000195	-4.749430E-5	T	29225	2017.09.19 13:38:59.146877632	0000678	
66	0.000198	4.951605E-5	-0.000190	-2.863804E-5	T	29225	2017.09.19 13:38:59.156877632	0000678	
66	0.000205	3.031751E-5	-0.000200	-3.844134E-5	T	29225	2017.09.19 13:38:59.166877632	0000678	
66	0.000212	5.324137E-5	-0.000200	-4.762833E-5	T	29225	2017.09.19 13:38:59.176877632	0000678	
66	0.000211	3.006538E-5	-0.000195	-7.646050E-5	T	29225	2017.09.19 13:38:59.186877632	0000678	
66	0.000209	3.939207E-5	-0.000204	-2.349868E-5	T	29225	2017.09.19 13:38:59.196877632	0000678	
66	0.000196	6.857981E-5	-0.000181	-3.382996E-5	T	29225	2017.09.19 13:38:59.206877632	0000678	
66	0.000202	5.369401E-5	-0.000195	3.489145E-7	T	29225	2017.09.19 13:38:59.216877632	0000678	
66	0.000187	3.072482E-5	-0.000184	-1.050476E-5	T	29225	2017.09.19 13:38:59.226877632	0000678	
66	0.000212	5.317772E-5	-0.000195	-6.264845E-5	T	29225	2017.09.19 13:38:59.236877632	0000678	
67	0.000206	5.318801E-5	-0.000181	-8.170576E-5	T	29223	2017.09.19 13:38:59.346965132	0000678	
67	0.000205	4.418249E-5	-0.000185	-7.661605E-5	T	29223	2017.09.19 13:38:59.356965132	0000678	
67	0.000191	3.946810E-5	-0.000181	-4.759313E-5	T	29223	2017.09.19 13:38:59.366965132	0000678	
67	0.000194	3.946164E-5	-0.000185	-4.257674E-5	T	29223	2017.09.19 13:38:59.376965132	0000678	
67	0.000194	4.449391E-5	-0.000185	-3.861764E-5	T	29223	2017.09.19 13:38:59.386965132	0000678	
67	0.000191	3.946810E-5	-0.000181	-4.759313E-5	T	29223	2017.09.19 13:38:59.396965132	0000678	
67	0.000200	4.943410E-5	-0.000190	-3.863762E-5	T	29223	2017.09.19 13:38:59.406965132	0000678	
67	0.000198	5.363037E-5	-0.000190	-1.467121E-5	T	29223	2017.09.19 13:38:59.416965132	0000678	
67	0.000191	5.869558E-5	-0.000181	-1.974908E-5	T	29223	2017.09.19 13:38:59.426965132	0000678	
67	0.000215	7.211228E-5	-0.000181	-9.086016E-5	T	29223	2017.09.19 13:38:59.436965132	0000678	
68	0.000210	2.006642E-5	-0.000195	-7.637904E-5	T	29224	2017.09.19 13:38:59.547052632	0000678	
68	0.000193	1.143805E-5	-0.000189	-3.832806E-5	T	29224	2017.09.19 13:38:59.557052632	0000678	
68	0.000194	3.938615E-5	-0.000181	-5.759271E-5	T	29224	2017.09.19 13:38:59.567052632	0000678	
68	0.000208	3.014733E-5	-0.000195	-6.646092E-5	T	29224	2017.09.19 13:38:59.577052632	0000678	
68	0.000193	2.551855E-5	-0.000189	-2.844253E-5	T	29224	2017.09.19 13:38:59.587052632	0000678	
68	0.000178	3.970139E-5	-0.000171	-3.363522E-5	T	29224	2017.09.19 13:38:59.597052632	0000678	
68	0.000221	6.324835E-5	-0.000209	-3.367303E-5	T	29224	2017.09.19 13:38:59.607052632	0000678	
68	0.000204	6.343265E-5	-0.000190	-3.875167E-5	T	29224	2017.09.19 13:38:59.617052632	0000678	
68	0.000199	5.351564E-5	-0.000190	-2.867062E-5	T	29224	2017.09.19 13:38:59.627052632	0000678	
68	0.000211	5.354633E-5	-0.000204	-4.613526E-6	T	29224	2017.09.19 13:38:59.637052632	0000678	
69	0.000196	5.349297E-5	-0.000185	-3.869096E-5	T	29239	2017.09.19 13:38:59.747140132	0000678	
69	0.000201	5.847414E-5	-0.000190	-3.371115E-5	T	29239	2017.09.19 13:38:59.757140132	0000678	
69	0.000190	4.948536E-5	-0.000176	-5.269514E-5	T	29239	2017.09.19 13:38:59.767140132	0000678	
69	0.000201	5.343369E-5	-0.000190	-3.867021E-5	T	29239	2017.09.19 13:38:59.777140132	0000678	
69	0.000209	5.339707E-5	-0.000200	-2.862912E-5	T	29239	2017.09.19 13:38:59.787140132	0000678	
69	0.000193	7.250773E-5	-0.000167	-6.291943E-5	T	29239	2017.09.19 13:38:59.797140132	0000678	
69	0.000188	4.973749E-5	-0.000181	-1.467597E-5	T	29239	2017.09.19 13:38:59.807140132	0000678	
69	0.000190	1.546414E-5	-0.000184	-4.238123E-5	T	29239	2017.09.19 13:38:59.817140132	0000678	
69	0.000209	2.510688E-5	-0.000195	-7.141998E-5	T	29239	2017.09.19 13:38:59.827140132	0000678	
69	0.000206	3.935755E-5	-0.000200	-3.351487E-5	T	29239	2017.09.19 13:38:59.837140132	0000678	
70	0.000182	2.074050E-5	-0.000180	-1.443973E-5	T	29225	2017.09.19 13:38:59.947227632	0000678	
70	0.000191	4.450855E-5	-0.000181	-4.263407E-5	T	29225	2017.09.19 13:38:59.957227632	0000678	
70	0.000201	4.449826E-5	-0.000195	-2.357677E-5	T	29225	2017.09.19 13:38:59.967227632	0000678	
70	0.000187	2.569256E-5	-0.000184	-1.446386E-5	T	29225	2017.09.19 13:38:59.977227632	0000678	
70	0.000214	4.915983E-5	-0.000200	-5.759533E-5	T	29225	2017.09.19 13:38:59.987227632	0000678	
70	0.000205	4.415617E-5	-0.000181	-8.563228E-5	T	29225	2017.09.19 13:38:59.997227632	0000678	
70	0.000199	5.334372E-5	-0.000181	-6.270655E-5	T	29225	2017.09.19 13:39:00.007227632	0000678	
70	0.000199	4.947508E-5	-0.000190	-3.363783E-5	T	29225	2017.09.19 13:39:00.017227632	0000678	
70	0.000205	4.937482E-5	-0.000195	-3.861687E-5	T	29225	2017.09.19 13:39:00.027227632	0000678	
70	0.000202	4.445729E-5	-0.000195	-2.857656E-5	T	29225	2017.09.19 13:39:00.037227632	0000678	
71	0.000202	4.936035E-5	-0.000190	-4.763724E-5	T	29229	2017.09.19 13:39:00.147315132	0000678	
71	0.000189	6.368059E-5	-0.000176	-2.881019E-5	T	29229	2017.09.19 13:39:00.157315132	0000678	
71	0.000184	2.062577E-5	-0.000180	-2.843915E-5	T	29229	2017.09.19 13:39:00.167315132	0000678	
71	0.000190	4.454133E-5	-0.000181	-3.863424E-5	T	29229	2017.09.19 13:39:00.177315132	0000678	
71	0.000211	4.924178E-5	-0.000200	-4.759574E-5	T	29229	2017.09.19 13:39:00.187315132	0000678	
71	0.000209	-2.800243E-6	-0.000203	-4.715554E-5	T	29229	2017.09.19 13:39:00.197315132	0000678	
71	0.000200	1.534557E-5	-0.000194	-4.233973E-5	T	29229	2017.09.19 13:39:00.207315132	0000678	
71	0.000180	4.974133E-5	-0.000171	-2.871689E-5	T	29229	2017.09.19 13:39:00.217315132	0000678	
71	0.000194	1.534121E-5	-0.000184	-5.738060E-5	T	29229	2017.09.19 13:39:00.227315132	0000678	
71	0.000183	3.460165E-5	-0.000176	-3.857353E-5	T	29229	2017.09.19 13:39:00.237315132	0000678	
72	0.000199	3.032135E-5	-0.000190	-5.248226E-5	T	29231	2017.09.19 13:39:00.347402632	0000678	
72	0.000207	4.439801E-5	-0.000200	-2.855581E-5	T	29231	2017.09.19 13:39:00.357402632	0000678	
72	0.000191	5.362235E-5	-0.000181	-2.870797E-5	T	29231	2017.09.19 13:39:00.367402632	0000678	
72	0.000198	4.934413E-5	-0.000181	-6.267397E-5	T	29231	2017.09.19 13:39:00.377402632	0000678	
72	0.000187	7.277991E-5	-0.000171	-2.390446E-5	T	29231	2017.09.19 13:39:00.387402632	0000678	
72	0.000215	2.513757E-5	-0.000209	-4.736288E-5	T	29231	2017.09.19 13:39:00.397402632	0000678	
72	0.000205	1.355047E-6	-0.000203	-2.818892E-5	T	29231	2017.09.19 13:39:00.407402632	0000678	
72	0.000195	6.869454E-5	-0.000181	-1.983054E-5	T	29231	2017.09.19 13:39:00.417402632	0000678	
72	0.000198	4.937866E-5	-0.000185	-5.265779E-5	T	29231	2017.09.19 13:39:00.427402632	0000678	
72	0.000201	3.037679E-5	-0.000195	-3.846209E-5	T	29231	2017.09.19 13:39:00.437402632	0000678	
73	0.000189	6.465072E-6	-0.000184	-4.230791E-5	T	29223	2017.09.19 13:39:00.547490132	0000678	
73	0.000197	6.361486E-5	-0.000185	-2.377305E-5	T	29223	2017.09.19 13:39:00.557490132	0000678	
73	0.000211	5.835558E-5	-0.000200	-3.366965E-5	T	29223	2017.09.19 13:39:00.567490132	0000678	
73	0.000197	5.346019E-5	-0.000185	-4.269079E-5	T	29223	2017.09.19 13:39:00.577490132	0000678	
73	0.000188	2.057835E-5	-0.000184	-2.842255E-5	T	29223	2017.09.19 13:39:00.587490132	0000678	
73	0.000224	8.630524E-5	-0.000204	-3.388114E-5	T	29223	2017.09.19 13:39:00.597490132	0000678	
73	0.000220	5.307102E-5	-0.000204	-6.261110E-5	T	29223	2017.09.19 13:39:00.607490132	0000678	
73	0.000190	6.875383E-5	-0.000176	-1.985130E-5	T	29223	2017.09.19 13:39:00.617490132	0000678	
73	0.000206	3.422067E-5	-0.000195	-5.749388E-5	T	29223	2017.09.19 13:39:00.627490132	0000678	
73	0.000209	3.027008E-5	-0.000204	-3.842474E-5	T	29223	2017.09.19 13:39:00.637490132	0000678	
74	0.000195	4.942608E-5	-0.000181	-5.267439E-5	T	29230	2017.09.19 13:39:00.747577632	0000678	
74	0.000200	3.949878E-5	-0.000195	-2.353603E-5	T	29230	2017.09.19 13:39:00.757577632	0000678	
74	0.000188	2.557783E-5	-0.000184	-2.846328E-5	T	29230	2017.09.19 13:39:00.767577632	0000678	
74	0.000202	4.431989E-5	-0.000190	-5.259630E-5	T	29230	2017.09.19 13:39:00.777577632	0000678	
74	0.000194	2.034069E-5	-0.000184	-5.742133E-5	T	29230	2017.09.19 13:39:00.787577632	0000678	
74	0.000185	5.865844E-5	-0.000171	-3.878979E-5	T	29230	2017.09.19 13:39:00.797577632	0000678	
74	0.000195	3.451761E-5	-0.000190	-2.851584E-5	T	29230	2017.09.19 13:39:00.807577632	0000678	
74	0.000207	4.920464E-5	-0.000190	-6.663645E-5	T	29230	2017.09.19 13:39:00.817577632	0000678	
74	0.000199	4.931135E-5	-0.000181	-6.667380E-5	T	29230	2017.09.19 13:39:00.827577632	0000678	
74	0.000215	2.013809E-5	-0.000208	-4.732215E-5	T	29230	2017.09.19 13:39:00.837577632	0000678	
75	0.000210	-2.908522E-6	-0.000199	-6.617134E-5	T	29232	2017.09.19 13:39:00.947665132	0000678	
75	0.000189	3.450959E-5	-0.000181	-4.255261E-5	T	29232	2017.09.19 13:39:00.957665132	0000678	
75	0.000186	2.554330E-5	-0.000180	-3.847946E-5	T	29232	2017.09.19 13:39:00.967665132	0000678	
75	0.000193	3.059178E-5	-0.000189	-1.948363E-5	T	29232	2017.09.19 13:39:00.977665132	0000678	
75	0.000210	8.230792E-5	-0.000181	-6.694263E-5	T	29232	2017.09.19 13:39:00.987665132	0000678	
75	0.000202	4.936035E-5	-0.000190	-4.763724E-5	T	29232	2017.09.19 13:39:00.997665132	0000678	
75	0.000192	4.457586E-5	-0.000185	-2.861806E-5	T	29232	2017.09.19 13:39:01.007665132	0000678	
75	0.000194	8.265595E-5	-0.000171	-3.898530E-5	T	29232	2017.09.19 13:39:01.017665132	0000678	
75	0.000208	4.926009E-5	-0.000195	-5.261629E-5	T	29232	2017.09.19 13:39:01.027665132	0000678	
75	0.000197	5.371232E-5	-0.000190	-4.671627E-6	T	29232	2017.09.19 13:39:01.037665132	0000678	
76	0.000197	5.842515E-5	-0.000181	-5.274770E-5	T	29237	2017.09.19 13:39:01.147752632	0000678	
76	0.000197	5.842515E-5	-0.000181	-5.274770E-5	T	29237	2017.09.19 13:39:01.157752632	0000678	
76	0.000195	3.047705E-5	-0.000190	-3.348305E-5	T	29237	2017.09.19 13:39:01.167752632	0000678	
76	0.000182	4.965938E-5	-0.000171	-3.871647E-5	T	29237	2017.09.19 13:39:01.177752632	0000678	
76	0.000195	5.850710E-5	-0.000181	-4.274812E-5	T	29237	2017.09.19 13:39:01.187752632	0000678	
76	0.000209	6.841382E-5	-0.000195	-3.377186E-5	T	29237	2017.09.19 13:39:01.197752632	0000678	
76	0.000195	4.942608E-5	-0.000181	-5.267439E-5	T	29237	2017.09.19 13:39:01.207752632	0000678	
76	0.000206	1.135401E-5	-0.000203	-2.827038E-5	T	29237	2017.09.19 13:39:01.217752632	0000678	
76	0.000212	6.846927E-5	-0.000200	-1.975169E-5	T	29237	2017.09.19 13:39:01.227752632	0000678	
76	0.000201	8.261933E-5	-0.000181	-2.894422E-5	T	29237	2017.09.19 13:39:01.237752632	0000678	
77	0.000207	4.920464E-5	-0.000190	-6.663645E-5	T	29226	2017.09.19 13:39:01.347840132	0000678	
77	0.000191	3.946810E-5	-0.000181	-4.759313E-5	T	29226	2017.09.19 13:39:01.357840132	0000678	
77	0.000205	5.341538E-5	-0.000195	-3.364966E-5	T	29226	2017.09.19 13:39:01.367840132	0000678	
77	0.000198	5.849245E-5	-0.000185	-3.873169E-5	T	29226	2017.09.19 13:39:01.377840132	0000678	
77	0.000196	4.946061E-5	-0.000185	-4.265820E-5	T	29226	2017.09.19 13:39:01.387840132	0000678	
77	0.000204	3.420620E-5	-0.000190	-6.651426E-5	T	29226	2017.09.19 13:39:01.397840132	0000678	
77	0.000196	6.848339E-5	-0.000176	-5.284992E-5	T	29226	2017.09.19 13:39:01.407840132	0000678	
77	0.000212	3.923637E-5	-0.000204	-4.249789E-5	T	29226	2017.09.19 13:39:01.417840132	0000678	
77	0.000203	7.245822E-5	-0.000185	-4.284557E-5	T	29226	2017.09.19 13:39:01.427840132	0000678	
77	0.000184	5.362618E-5	-0.000171	-4.274889E-5	T	29226	2017.09.19 13:39:01.437840132	0000678	
78	0.000195	3.942067E-5	-0.000185	-4.757653E-5	T	29227	2017.09.19 13:39:01.547927632	0000678	
78	0.000189	3.040539E-5	-0.000176	-6.253994E-5	T	29227	2017.09.19 13:39:01.557927632	0000678	
78	0.000193	3.042160E-5	-0.000185	-4.750321E-5	T	29227	2017.09.19 13:39:01.567927632	0000678	
78	0.000185	2.543241E-5	-0.000171	-6.651979E-5	T	29227	2017.09.19 13:39:01.577927632	0000678	
78	0.000198	3.436191E-5	-0.000190	-4.751505E-5	T	29227	2017.09.19 13:39:01.587927632	0000678	
78	0.000210	5.825916E-5	-0.000195	-5.268960E-5	T	29227	2017.09.19 13:39:01.597927632	0000678	
78	0.000224	1.099134E-5	-0.000217	-5.221127E-5	T	29227	2017.09.19 13:39:01.607927632	0000678	
78	0.000182	4.479729E-5	-0.000176	-1.465599E-5	T	29227	2017.09.19 13:39:01.617927632	0000678	
78	0.000189	3.046903E-5	-0.000181	-4.751981E-5	T	29227	2017.09.19 13:39:01.627927632	0000678	
78	0.000216	5.311844E-5	-0.000200	-6.262770E-5	T	29227	2017.09.19 13:39:01.637927632	0000678	
79	0.000209	6.845480E-5	-0.000195	-2.877207E-5	T	29231	2017.09.19 13:39:01.748015132	0000678	
79	0.000199	4.433820E-5	-0.000185	-5.761685E-5	T	29231	2017.09.19 13:39:01.758015132	0000678	
79	0.000200	1.118592E-5	-0.000184	-7.634722E-5	T	29231	2017.09.19 13:39:01.768015132	0000678	
79	0.000209	6.337337E-5	-0.000195	-3.873092E-5	T	29231	2017.09.19 13:39:01.778015132	0000678	
79	0.000186	1.151198E-5	-0.000180	-4.236524E-5	T	29231	2017.09.19 13:39:01.788015132	0000678	
79	0.000198	1.122690E-5	-0.000184	-7.134743E-5	T	29231	2017.09.19 13:39:01.798015132	0000678	
79	0.000216	4.425032E-5	-0.000209	-3.351825E-5	T	29231	2017.09.19 13:39:01.808015132	0000678	
79	0.000183	2.066675E-5	-0.000180	-2.343935E-5	T	29231	2017.09.19 13:39:01.818015132	0000678	
79	0.000202	6.334268E-5	-0.000181	-6.278802E-5	T	29231	2017.09.19 13:39:01.828015132	0000678	
79	0.000232	6.810015E-5	-0.000218	-3.867620E-5	T	29231	2017.09.19 13:39:01.838015132	0000678	
80	0.000206	5.831844E-5	-0.000190	-5.271035E-5	T	29230	2017.09.19 13:39:01.948102632	0000678	
80	0.000224	7.211002E-5	-0.000204	-5.776609E-5	T	29230	2017.09.19 13:39:01.958102632	0000678	
80	0.000193	2.038167E-5	-0.000184	-5.242154E-5	T	29230	2017.09.19 13:39:01.968102632	0000678	
80	0.000213	3.408763E-5	-0.000200	-6.647276E-5	T	29230	2017.09.19 13:39:01.978102632	0000678	
80	0.000204	3.426165E-5	-0.000195	-5.249409E-5	T	29230	2017.09.19 13:39:01.988102632	0000678	
80	0.000192	3.942712E-5	-0.000181	-5.259292E-5	T	29230	2017.09.19 13:39:01.998102632	0000678	
80	0.000215	3.902347E-5	-0.000195	-8.153361E-5	T	29230	2017.09.19 13:39:02.008102632	0000678	
80	0.000190	3.950907E-5	-0.000181	-4.259334E-5	T	29230	2017.09.19 13:39:02.018102632	0000678	
80	0.000185	4.968204E-5	-0.000176	-2.869614E-5	T	29230	2017.09.19 13:39:02.028102632	0000678	
80	0.000200	6.345915E-5	-0.000185	-4.277225E-5	T	29230	2017.09.19 13:39:02.038102632	0000678	
81	0.000207	6.829473E-5	-0.000185	-6.281215E-5	T	29227	2017.09.19 13:39:02.148190132	0000678	
81	0.000201	6.341818E-5	-0.000185	-4.777204E-5	T	29227	2017.09.19 13:39:02.158190132	0000678	
81	0.000207	3.922015E-5	-0.000195	-5.753461E-5	T	29227	2017.09.19 13:39:02.168190132	0000678	
81	0.000206	6.335889E-5	-0.000190	-4.775129E-5	T	29227	2017.09.19 13:39:02.178190132	0000678	
81	0.000205	4.937482E-5	-0.000195	-3.861687E-5	T	29227	2017.09.19 13:39:02.188190132	0000678	
81	0.000189	2.042909E-5	-0.000180	-5.243814E-5	T	29227	2017.09.19 13:39:02.198190132	0000678	
81	0.000213	4.926811E-5	-0.000204	-3.857952E-5	T	29227	2017.09.19 13:39:02.208190132	0000678	
81	0.000192	1.129263E-5	-0.000175	-7.638457E-5	T	29227	2017.09.19 13:39:02.218190132	0000678	
81	0.000193	3.433122E-5	-0.000176	-7.157215E-5	T	29227	2017.09.19 13:39:02.228190132	0000678	
81	0.000207	3.018011E-5	-0.000195	-6.246109E-5	T	29227	2017.09.19 13:39:02.238190132	0000678	
82	0.000215	7.225770E-5	-0.000195	-5.280365E-5	T	29227	2017.09.19 13:39:02.348277632	0000678	
82	0.000199	1.134599E-5	-0.000194	-4.230714E-5	T	29227	2017.09.19 13:39:02.358277632	0000678	
82	0.000199	5.838417E-5	-0.000181	-5.774749E-5	T	29227	2017.09.19 13:39:02.368277632	0000678	
82	0.000187	3.054279E-5	-0.000181	-3.852019E-5	T	29227	2017.09.19 13:39:02.378277632	0000678	
82	0.000230	5.789648E-5	-0.000209	-7.663050E-5	T	29227	2017.09.19 13:39:02.388277632	0000678	
82	0.000209	5.325967E-5	-0.000195	-5.264887E-5	T	29227	2017.09.19 13:39:02.398277632	0000678	
82	0.000191	5.873656E-5	-0.000181	-1.474929E-5	T	29227	2017.09.19 13:39:02.408277632	0000678	
82	0.000195	4.949339E-5	-0.000185	-3.865837E-5	T	29227	2017.09.19 13:39:02.418277632	0000678	
82	0.000200	5.347466E-5	-0.000190	-3.367041E-5	T	29227	2017.09.19 13:39:02.428277632	0000678	
82	0.000190	2.046362E-5	-0.000184	-4.242196E-5	T	29227	2017.09.19 13:39:02.438277632	0000678	
83	0.000216	5.810345E-5	-0.000195	-7.168881E-5	T	29224	2017.09.19 13:39:02.548365132	0000678	
83	0.000200	4.943410E-5	-0.000190	-3.863762E-5	T	29224	2017.09.19 13:39:02.558365132	0000678	
83	0.000202	4.445729E-5	-0.000195	-2.857656E-5	T	29224	2017.09.19 13:39:02.568365132	0000678	
83	0.000221	5.300371E-5	-0.000200	-7.662712E-5	T	29224	2017.09.19 13:39:02.578365132	0000678	
83	0.000195	5.357492E-5	-0.000185	-2.869137E-5	T	29224	2017.09.19 13:39:02.588365132	0000678	
83	0.000191	1.142358E-5	-0.000184	-4.734843E-5	T	29224	2017.09.19 13:39:02.598365132	0000678	
83	0.000192	3.075568E-5	-0.000189	5.155294E-7	T	29224	2017.09.19 13:39:02.608365132	0000678	
83	0.000182	3.454621E-5	-0.000171	-5.259369E-5	T	29224	2017.09.19 13:39:02.618365132	0000678	
83	0.000221	5.313466E-5	-0.000209	-4.759098E-5	T	29224	2017.09.19 13:39:02.628365132	0000678	
83	0.000194	4.449391E-5	-0.000185	-3.861764E-5	T	29224	2017.09.19 13:39:02.638365132	0000678	
84	0.000207	6.856953E-5	-0.000195	-1.477265E-5	T	29223	2017.09.19 13:39:02.748452632	0000678	
84	0.000194	6.856534E-5	-0.000176	-4.285033E-5	T	29223	2017.09.19 13:39:02.758452632	0000678	
84	0.000209	4.921911E-5	-0.000195	-5.761608E-5	T	29223	2017.09.19 13:39:02.768452632	0000678	
84	0.000199	6.846508E-5	-0.000181	-4.782937E-5	T	29223	2017.09.19 13:39:02.778452632	0000678	
84	0.000202	3.937586E-5	-0.000195	-3.853541E-5	T	29223	2017.09.19 13:39:02.788452632	0000678	
84	0.000186	3.048734E-5	-0.000176	-5.254036E-5	T	29223	2017.09.19 13:39:02.798452632	0000678	
84	0.000195	5.861538E-5	-0.000185	-2.373231E-5	T	29223	2017.09.19 13:39:02.808452632	0000678	
84	0.000185	1.573457E-5	-0.000184	-9.382608E-6	T	29223	2017.09.19 13:39:02.818452632	0000678	
84	0.000204	5.331896E-5	-0.000190	-5.266962E-5	T	29223	2017.09.19 13:39:02.828452632	0000678	
84	0.000201	2.534453E-5	-0.000194	-4.242119E-5	T	29223	2017.09.19 13:39:02.838452632	0000678	
85	0.000217	6.823981E-5	-0.000200	-4.775052E-5	T	29227	2017.09.19 13:39:02.948540132	0000678	
85	0.000209	7.249536E-5	-0.000195	-2.380486E-5	T	29227	2017.09.19 13:39:02.958540132	0000678	
85	0.000196	3.033965E-5	-0.000185	-5.750280E-5	T	29227	2017.09.19 13:39:02.968540132	0000678	
85	0.000194	5.340300E-5	-0.000176	-6.272730E-5	T	29227	2017.09.19 13:39:02.978540132	0000678	
85	0.000215	4.919436E-5	-0.000204	-4.757914E-5	T	29227	2017.09.19 13:39:02.988540132	0000678	
85	0.000190	2.549588E-5	-0.000184	-3.846286E-5	T	29227	2017.09.19 13:39:02.998540132	0000678	
85	0.000217	6.823981E-5	-0.000200	-4.775052E-5	T	29227	2017.09.19 13:39:03.008540132	0000678	
85	0.000194	5.340300E-5	-0.000176	-6.272730E-5	T	29227	2017.09.19 13:39:03.018540132	0000678	
85	0.000208	3.424334E-5	-0.000200	-4.747355E-5	T	29227	2017.09.19 13:39:03.028540132	0000678	
85	0.000200	4.461299E-5	-0.000195	-9.577351E-6	T	29227	2017.09.19 13:39:03.038540132	0000678	
86	0.000199	7.253842E-5	-0.000181	-3.886234E-5	T	29229	2017.09.19 13:39:03.148627632	0000678	
86	0.000195	1.527391E-5	-0.000180	-7.139662E-5	T	29229	2017.09.19 13:39:03.158627632	0000678	
86	0.000196	4.938511E-5	-0.000181	-5.767418E-5	T	29229	2017.09.19 13:39:03.168627632	0000678	
86	0.000193	4.453488E-5	-0.000185	-3.361785E-5	T	29229	2017.09.19 13:39:03.178627632	0000678	
86	0.000200	5.834320E-5	-0.000181	-6.274728E-5	T	29229	2017.09.19 13:39:03.188627632	0000678	
86	0.000188	3.439050E-5	-0.000171	-7.159290E-5	T	29229	2017.09.19 13:39:03.198627632	0000678	
86	0.000198	3.036232E-5	-0.000190	-4.748246E-5	T	29229	2017.09.19 13:39:03.208627632	0000678	
86	0.000205	2.531803E-5	-0.000199	-3.840061E-5	T	29229	2017.09.19 13:39:03.218627632	0000678	
86	0.000217	8.229764E-5	-0.000195	-4.788532E-5	T	29229	2017.09.19 13:39:03.228627632	0000678	
86	0.000211	7.222056E-5	-0.000185	-7.184436E-5	T	29229	2017.09.19 13:39:03.238627632	0000678	
87	0.000183	4.458614E-5	-0.000171	-4.767536E-5	T	29235	2017.09.19 13:39:03.348715132	0000678	
87	0.000201	3.037679E-5	-0.000195	-3.846209E-5	T	29235	2017.09.19 13:39:03.358715132	0000678	
87	0.000204	3.026206E-5	-0.000195	-5.246151E-5	T	29235	2017.09.19 13:39:03.368715132	0000678	
87	0.000212	8.239789E-5	-0.000190	-4.290628E-5	T	29235	2017.09.19 13:39:03.378715132	0000678	
87	0.000199	2.541829E-5	-0.000194	-3.342157E-5	T	29235	2017.09.19 13:39:03.388715132	0000678	
87	0.000194	2.034069E-5	-0.000184	-5.742133E-5	T	29235	2017.09.19 13:39:03.398715132	0000678	
87	0.000199	4.440184E-5	-0.000190	-4.259672E-5	T	29235	2017.09.19 13:39:03.408715132	0000678	
87	0.000195	3.438021E-5	-0.000185	-5.253559E-5	T	29235	2017.09.19 13:39:03.418715132	0000678	
87	0.000214	6.312124E-5	-0.000190	-7.675008E-5	T	29235	2017.09.19 13:39:03.428715132	0000678	
87	0.000207	3.412425E-5	-0.000190	-7.651384E-5	T	29235	2017.09.19 13:39:03.438715132	0000678	
88	0.000195	2.543660E-5	-0.000189	-3.844211E-5	T	29227	2017.09.19 13:39:03.548802632	0000678	
88	0.000204	2.535901E-5	-0.000199	-3.340082E-5	T	29227	2017.09.19 13:39:03.558802632	0000678	
88	0.000202	6.838313E-5	-0.000181	-5.782896E-5	T	29227	2017.09.19 13:39:03.568802632	0000678	
88	0.000207	5.323701E-5	-0.000190	-6.266920E-5	T	29227	2017.09.19 13:39:03.578802632	0000678	
88	0.000216	7.720173E-5	-0.000190	-6.686455E-5	T	29227	2017.09.19 13:39:03.588802632	0000678	
88	0.000202	4.441631E-5	-0.000195	-3.357635E-5	T	29227	2017.09.19 13:39:03.598802632	0000678	
88	0.000170	4.979259E-5	-0.000157	-4.277440E-5	T	29227	2017.09.19 13:39:03.608802632	0000678	
88	0.000199	3.032135E-5	-0.000190	-5.248226E-5	T	29227	2017.09.19 13:39:03.618802632	0000678	
88	0.000210	3.426967E-5	-0.000204	-3.845733E-5	T	29227	2017.09.19 13:39:03.628802632	0000678	
88	0.000199	5.845967E-5	-0.000185	-4.273152E-5	T	29227	2017.09.19 13:39:03.638802632	0000678	
89	0.000201	4.940132E-5	-0.000190	-4.263745E-5	T	29237	2017.09.19 13:39:03.748890132	0000678	
89	0.000203	2.526258E-5	-0.000195	-5.242077E-5	T	29237	2017.09.19 13:39:03.758890132	0000678	
89	0.000199	3.936139E-5	-0.000190	-4.755578E-5	T	29237	2017.09.19 13:39:03.768890132	0000678	
89	0.000187	5.364065E-5	-0.000176	-3.372852E-5	T	29237	2017.09.19 13:39:03.778890132	0000678	
89	0.000203	4.926393E-5	-0.000185	-6.665720E-5	T	29237	2017.09.19 13:39:03.788890132	0000678	
89	0.000196	6.842794E-5	-0.000171	-6.687008E-5	T	29237	2017.09.19 13:39:03.798890132	0000678	
89	0.000208	4.421963E-5	-0.000195	-5.757534E-5	T	29237	2017.09.19 13:39:03.808890132	0000678	
89	0.000210	6.837285E-5	-0.000195	-3.877165E-5	T	29237	2017.09.19 13:39:03.818890132	0000678	
89	0.000188	5.868111E-5	-0.000176	-2.876946E-5	T	29237	2017.09.19 13:39:03.828890132	0000678	
89	0.000207	6.331792E-5	-0.000190	-5.275108E-5	T	29237	2017.09.19 13:39:03.838890132	0000678	
90	0.000212	5.317772E-5	-0.000195	-6.264845E-5	T	29224	2017.09.19 13:39:03.948977632	0000678	
90	0.000209	3.914640E-5	-0.000195	-6.653424E-5	T	29224	2017.09.19 13:39:03.958977632	0000678	
90	0.000225	6.803668E-5	-0.000204	-6.673313E-5	T	29224	2017.09.19 13:39:03.968977632	0000678	
90	0.000201	2.523992E-5	-0.000190	-6.244111E-5	T	29224	2017.09.19 13:39:03.978977632	0000678	
90	0.000199	3.032135E-5	-0.000190	-5.248226E-5	T	29224	2017.09.19 13:39:03.988977632	0000678	
90	0.000213	3.429234E-5	-0.000209	-2.843699E-5	T	29224	2017.09.19 13:39:03.998977632	0000678	
90	0.000184	4.464159E-5	-0.000176	-3.365520E-5	T	29224	2017.09.19 13:39:04.008977632	0000678	
90	0.000204	5.326351E-5	-0.000185	-6.668979E-5	T	29224	2017.09.19 13:39:04.018977632	0000678	
90	0.000209	3.420237E-5	-0.000200	-5.247334E-5	T	29224	2017.09.19 13:39:04.028977632	0000678	
90	0.000211	4.942382E-5	-0.000204	-1.958031E-5	T	29224	2017.09.19 13:39:04.038977632	0000678	
91	0.000199	2.017697E-5	-0.000176	-9.045730E-5	T	29230	2017.09.19 13:39:04.149065132	0000678	
91	0.000195	5.346664E-5	-0.000181	-4.770718E-5	T	29230	2017.09.19 13:39:04.159065132	0000678	
91	0.000190	3.961735E-5	-0.000185	-2.357753E-5	T	29230	2017.09.19 13:39:04.169065132	0000678	
91	0.000207	2.031210E-5	-0.000203	-3.334349E-5	T	29230	2017.09.19 13:39:04.179065132	0000678	
91	0.000205	6.339987E-5	-0.000190	-4.275150E-5	T	29230	2017.09.19 13:39:04.189065132	0000678	
91	0.000185	6.860841E-5	-0.000162	-5.790781E-5	T	29230	2017.09.19 13:39:04.199065132	0000678	
91	0.000185	2.058480E-5	-0.000180	-3.343894E-5	T	29230	2017.09.19 13:39:04.209065132	0000678	
91	0.000193	2.047809E-5	-0.000189	-3.340159E-5	T	29230	2017.09.19 13:39:04.219065132	0000678	
91	0.000189	4.458231E-5	-0.000181	-3.363445E-5	T	29230	2017.09.19 13:39:04.229065132	0000678	
91	0.000203	3.430262E-5	-0.000195	-4.749430E-5	T	29230	2017.09.19 13:39:04.239065132	0000678	
92	0.000192	3.449494E-5	-0.000185	-3.853618E-5	T	29221	2017.09.19 13:39:04.349152632	0000678	
92	0.000211	7.227601E-5	-0.000190	-5.782419E-5	T	29221	2017.09.19 13:39:04.359152632	0000678	
92	0.000188	4.466426E-5	-0.000181	-2.363487E-5	T	29221	2017.09.19 13:39:04.369152632	0000678	
92	0.000181	5.374091E-5	-0.000171	-2.874947E-5	T	29221	2017.09.19 13:39:04.379152632	0000678	
92	0.000212	3.406497E-5	-0.000195	-7.649309E-5	T	29221	2017.09.19 13:39:04.389152632	0000678	
92	0.000202	5.831042E-5	-0.000181	-6.674712E-5	T	29221	2017.09.19 13:39:04.399152632	0000678	
92	0.000196	1.324359E-6	-0.000189	-5.224601E-5	T	29221	2017.09.19 13:39:04.409152632	0000678	
92	0.000187	3.458335E-5	-0.000181	-3.355299E-5	T	29221	2017.09.19 13:39:04.419152632	0000678	
92	0.000208	2.520330E-5	-0.000200	-5.240002E-5	T	29221	2017.09.19 13:39:04.429152632	0000678	
92	0.000174	2.567652E-5	-0.000166	-4.253739E-5	T	29221	2017.09.19 13:39:04.439152632	0000678	
93	0.000205	1.518167E-5	-0.000194	-6.233889E-5	T	29232	2017.09.19 13:39:04.549240132	0000678	
93	0.000186	4.964107E-5	-0.000176	-3.369593E-5	T	29232	2017.09.19 13:39:04.559240132	0000678	
93	0.000203	6.855505E-5	-0.000190	-2.379303E-5	T	29232	2017.09.19 13:39:04.569240132	0000678	
93	0.000208	6.327694E-5	-0.000190	-5.775087E-5	T	29232	2017.09.19 13:39:04.579240132	0000678	
93	0.000182	1.552987E-5	-0.000175	-4.741837E-5	T	29232	2017.09.19 13:39:04.589240132	0000678	
93	0.000205	5.327798E-5	-0.000190	-5.766941E-5	T	29232	2017.09.19 13:39:04.599240132	0000678	
93	0.000196	3.447664E-5	-0.000190	-3.351563E-5	T	29232	2017.09.19 13:39:04.609240132	0000678	
93	0.000193	6.352489E-5	-0.000176	-4.780939E-5	T	29232	2017.09.19 13:39:04.619240132	0000678	
93	0.000221	4.909410E-5	-0.000209	-5.255818E-5	T	29232	2017.09.19 13:39:04.629240132	0000678	
93	0.000193	4.961631E-5	-0.000185	-2.365900E-5	T	29232	2017.09.19 13:39:04.639240132	0000678	
94	0.000191	3.946810E-5	-0.000181	-4.759313E-5	T	29238	2017.09.19 13:39:04.749327632	0000678	
94	0.000207	9.661788E-5	-0.000181	-2.905827E-5	T	29238	2017.09.19 13:39:04.759327632	0000678	
94	0.000190	3.950907E-5	-0.000181	-4.259334E-5	T	29238	2017.09.19 13:39:04.769327632	0000678	
94	0.000183	1.162671E-5	-0.000180	-2.836583E-5	T	29238	2017.09.19 13:39:04.779327632	0000678	
94	0.000207	3.916471E-5	-0.000190	-7.155478E-5	T	29238	2017.09.19 13:39:04.789327632	0000678	
94	0.000199	5.845967E-5	-0.000185	-4.273152E-5	T	29238	2017.09.19 13:39:04.799327632	0000678	
94	0.000196	4.442015E-5	-0.000185	-4.761726E-5	T	29238	2017.09.19 13:39:04.809327632	0000678	
94	0.000206	2.024479E-5	-0.000199	-4.735950E-5	T	29238	2017.09.19 13:39:04.819327632	0000678	
94	0.000219	4.907143E-5	-0.000204	-6.257852E-5	T	29238	2017.09.19 13:39:04.829327632	0000678	
94	0.000194	6.348391E-5	-0.000176	-5.280918E-5	T	29238	2017.09.19 13:39:04.839327632	0000678	
95	0.000215	1.509763E-5	-0.000208	-5.228121E-5	T	29235	2017.09.19 13:39:04.949415132	0000678	
95	0.000199	4.440184E-5	-0.000190	-4.259672E-5	T	29235	2017.09.19 13:39:04.959415132	0000678	
95	0.000208	3.424334E-5	-0.000200	-4.747355E-5	T	29235	2017.09.19 13:39:04.969415132	0000678	
95	0.000195	3.047705E-5	-0.000190	-3.348305E-5	T	29235	2017.09.19 13:39:04.979415132	0000678	
95	0.000185	4.447786E-5	-0.000167	-6.669117E-5	T	29235	2017.09.19 13:39:04.989415132	0000678	
95	0.000190	8.297556E-5	-0.000171	1.307055E-8	T	29235	2017.09.19 13:39:04.999415132	0000678	
95	0.000194	4.953436E-5	-0.000185	-3.365858E-5	T	29235	2017.09.19 13:39:05.009415132	0000678	
95	0.000207	4.435703E-5	-0.000200	-3.355560E-5	T	29235	2017.09.19 13:39:05.019415132	0000678	
95	0.000205	4.451274E-5	-0.000200	-1.455639E-5	T	29235	2017.09.19 13:39:05.029415132	0000678	
95	0.000190	4.454133E-5	-0.000181	-3.863424E-5	T	29235	2017.09.19 13:39:05.039415132	0000678	
96	0.000222	4.393089E-5	-0.000200	-8.555342E-5	T	29231	2017.09.19 13:39:05.149502632	0000678	
96	0.000183	3.050565E-5	-0.000171	-5.756090E-5	T	29231	2017.09.19 13:39:05.159502632	0000678	
96	0.000190	4.962276E-5	-0.000181	-2.867539E-5	T	29231	2017.09.19 13:39:05.169502632	0000678	
96	0.000205	3.031751E-5	-0.000200	-3.844134E-5	T	29231	2017.09.19 13:39:05.179502632	0000678	
96	0.000207	4.439801E-5	-0.000200	-2.855581E-5	T	29231	2017.09.19 13:39:05.189502632	0000678	
96	0.000193	3.949442E-5	-0.000185	-3.857691E-5	T	29231	2017.09.19 13:39:05.199502632	0000678	
96	0.000184	3.052831E-5	-0.000176	-4.754057E-5	T	29231	2017.09.19 13:39:05.209502632	0000678	
96	0.000208	4.431606E-5	-0.000200	-3.855539E-5	T	29231	2017.09.19 13:39:05.219502632	0000678	
96	0.000211	3.423689E-5	-0.000204	-4.245716E-5	T	29231	2017.09.19 13:39:05.229502632	0000678	
96	0.000195	3.942067E-5	-0.000185	-4.757653E-5	T	29231	2017.09.19 13:39:05.239502632	0000678	
97	0.000193	5.344397E-5	-0.000176	-5.772751E-5	T	29236	2017.09.19 13:39:05.349590132	0000678	
97	0.000199	2.028141E-5	-0.000189	-5.740058E-5	T	29236	2017.09.19 13:39:05.359590132	0000678	
97	0.000207	3.922015E-5	-0.000195	-5.753461E-5	T	29236	2017.09.19 13:39:05.369590132	0000678	
97	0.000178	2.562909E-5	-0.000170	-4.252079E-5	T	29236	2017.09.19 13:39:05.379590132	0000678	
97	0.000217	6.310293E-5	-0.000195	-7.172954E-5	T	29236	2017.09.19 13:39:05.389590132	0000678	
97	0.000186	4.456783E-5	-0.000176	-4.265482E-5	T	29236	2017.09.19 13:39:05.399590132	0000678	
97	0.000191	5.846176E-5	-0.000171	-6.278879E-5	T	29236	2017.09.19 13:39:05.409590132	0000678	
97	0.000237	8.199041E-5	-0.000214	-5.780605E-5	T	29236	2017.09.19 13:39:05.419590132	0000678	
97	0.000213	7.250983E-5	-0.000200	-1.478449E-5	T	29236	2017.09.19 13:39:05.429590132	0000678	
97	0.000219	4.392653E-5	-0.000190	-0.000101	T	29236	2017.09.19 13:39:05.439590132	0000678	
98	0.000192	4.950803E-5	-0.000181	-4.267480E-5	T	29221	2017.09.19 13:39:05.549677632	0000678	
98	0.000190	5.850274E-5	-0.000171	-5.778899E-5	T	29221	2017.09.19 13:39:05.559677632	0000678	
98	0.000198	3.036232E-5	-0.000190	-4.748246E-5	T	29221	2017.09.19 13:39:05.569677632	0000678	
98	0.000197	4.451657E-5	-0.000190	-2.859731E-5	T	29221	2017.09.19 13:39:05.579677632	0000678	
98	0.000191	1.556056E-5	-0.000189	-2.336127E-5	T	29221	2017.09.19 13:39:05.589677632	0000678	
98	0.000198	6.379287E-6	-0.000194	-3.826658E-5	T	29221	2017.09.19 13:39:05.599677632	0000678	
98	0.000185	4.968204E-5	-0.000176	-2.869614E-5	T	29221	2017.09.19 13:39:05.609677632	0000678	
98	0.000188	5.864013E-5	-0.000176	-3.376925E-5	T	29221	2017.09.19 13:39:05.619677632	0000678	
98	0.000201	5.837772E-5	-0.000185	-5.273110E-5	T	29221	2017.09.19 13:39:05.629677632	0000678	
98	0.000200	6.186442E-6	-0.000184	-7.630649E-5	T	29221	2017.09.19 13:39:05.639677632	0000678	
99	0.000200	3.432093E-5	-0.000190	-5.251484E-5	T	29221	2017.09.19 13:39:05.749765132	0000678	
99	0.000219	6.815786E-5	-0.000200	-5.775011E-5	T	29221	2017.09.19 13:39:05.759765132	0000678	
99	0.000204	7.742317E-5	-0.000181	-5.290248E-5	T	29221	2017.09.19 13:39:05.769765132	0000678	
99	0.000204	1.531907E-5	-0.000199	-3.831915E-5	T	29221	2017.09.19 13:39:05.779765132	0000678	
99	0.000176	2.559457E-5	-0.000167	-5.253697E-5	T	29221	2017.09.19 13:39:05.789765132	0000678	
99	0.000193	3.059178E-5	-0.000189	-1.948363E-5	T	29221	2017.09.19 13:39:05.799765132	0000678	
99	0.000196	4.442015E-5	-0.000185	-4.761726E-5	T	29221	2017.09.19 13:39:05.809765132	0000678	
99	0.000197	3.933872E-5	-0.000185	-5.757611E-5	T	29221	2017.09.19 13:39:05.819765132	0000678	
99	0.000211	6.346979E-5	-0.000200	-1.971096E-5	T	29221	2017.09.19 13:39:05.829765132	0000678	
99	0.000193	1.439089E-6	-0.000189	-3.824660E-5	T	29221	2017.09.19 13:39:05.839765132	0000678	
100	0.000180	3.962764E-5	-0.000171	-4.263484E-5	T	29222	2017.09.19 13:39:05.949852632	0000678	
100	0.000186	4.964107E-5	-0.000176	-3.369593E-5	T	29222	2017.09.19 13:39:05.959852632	0000678	
100	0.000217	5.308566E-5	-0.000200	-6.662754E-5	T	29222	2017.09.19 13:39:05.969852632	0000678	
100	0.000194	3.442119E-5	-0.000185	-4.753580E-5	T	29222	2017.09.19 13:39:05.979852632	0000678	
100	0.000191	-2.615943E-6	-0.000184	-5.223418E-5	T	29222	2017.09.19 13:39:05.989852632	0000678	
100	0.000207	3.922015E-5	-0.000195	-5.753461E-5	T	29222	2017.09.19 13:39:05.999852632	0000678	
100	0.000215	3.911344E-5	-0.000204	-5.749726E-5	T	29222	2017.09.19 13:39:06.009852632	0000678	
100	0.000205	5.849681E-5	-0.000195	-2.369081E-5	T	29222	2017.09.19 13:39:06.019852632	0000678	
100	0.000200	3.949878E-5	-0.000195	-2.353603E-5	T	29222	2017.09.19 13:39:06.029852632	0000678	
100	0.000219	7.727985E-5	-0.000200	-4.282405E-5	T	29222	2017.09.19 13:39:06.039852632	0000678	
101	0.000198	4.934413E-5	-0.000181	-6.267397E-5	T	29221	2017.09.19 13:39:06.149940132	0000678	
101	0.000193	5.344397E-5	-0.000176	-5.772751E-5	T	29221	2017.09.19 13:39:06.159940132	0000678	
101	0.000203	3.030304E-5	-0.000195	-4.746171E-5	T	29221	2017.09.19 13:39:06.169940132	0000678	
101	0.000213	8.643026E-5	-0.000190	-3.893903E-5	T	29221	2017.09.19 13:39:06.179940132	0000678	
101	0.000211	6.320319E-5	-0.000190	-6.675050E-5	T	29221	2017.09.19 13:39:06.189940132	0000678	
101	0.000219	2.001516E-5	-0.000209	-6.232152E-5	T	29221	2017.09.19 13:39:06.199940132	0000678	
101	0.000182	3.464263E-5	-0.000176	-3.357374E-5	T	29221	2017.09.19 13:39:06.209940132	0000678	
101	0.000184	1.449375E-6	-0.000175	-5.730390E-5	T	29221	2017.09.19 13:39:06.219940132	0000678	
101	0.000209	3.431064E-5	-0.000204	-3.345753E-5	T	29221	2017.09.19 13:39:06.229940132	0000678	
101	0.000208	5.330065E-5	-0.000195	-4.764908E-5	T	29221	2017.09.19 13:39:06.239940132	0000678	
