Block	B	Bx	By	Bz	Units	Temperature	Timestamp	Serial No.	Comment
0	0.000215	0.000184	8.652960E-5	-6.986543E-5	T	29550	2017.09.19 14:39:58.747252632	0000678	
0	0.000197	0.000179	6.768782E-5	-4.574685E-5	T	29550	2017.09.19 14:39:58.757252632	0000678	
0	0.000236	0.000214	8.626179E-5	-5.110247E-5	T	29550	2017.09.19 14:39:58.767252632	0000678	
0	0.000176	0.000146	7.802266E-5	-5.951894E-5	T	29550	2017.09.19 14:39:58.777252632	0000678	
0	0.000204	0.000185	8.168401E-5	-3.184627E-5	T	29550	2017.09.19 14:39:58.787252632	0000678	
0	0.000173	0.000138	8.712896E-5	-5.948297E-5	T	29550	2017.09.19 14:39:58.797252632	0000678	
0	0.000175	0.000151	6.396432E-5	-5.950157E-5	T	29550	2017.09.19 14:39:58.807252632	0000678	
0	0.000197	0.000170	7.773730E-5	-5.971445E-5	T	29550	2017.09.19 14:39:58.817252632	0000678	
0	0.000202	0.000184	6.762837E-5	-4.578758E-5	T	29550	2017.09.19 14:39:58.827252632	0000678	
0	0.000199	0.000162	9.682255E-5	-6.471978E-5	T	29550	2017.09.19 14:39:58.837252632	0000678	
1	0.000174	0.000152	7.302440E-5	-4.453955E-5	T	29537	2017.09.19 14:39:58.947340132	0000678	
1	0.000210	0.000184	7.253476E-5	-6.880737E-5	T	29537	2017.09.19 14:39:58.957340132	0000678	
1	0.000182	0.000157	8.702059E-5	-3.063897E-5	T	29537	2017.09.19 14:39:58.967340132	0000678	
1	0.000204	0.000189	5.855342E-5	-4.979080E-5	T	29537	2017.09.19 14:39:58.977340132	0000678	
1	0.000198	0.000176	8.681494E-5	-2.579395E-5	T	29537	2017.09.19 14:39:58.987340132	0000678	
1	0.000186	0.000162	8.192100E-5	-4.065853E-5	T	29537	2017.09.19 14:39:58.997340132	0000678	
1	0.000179	0.000162	6.794237E-5	-3.560064E-5	T	29537	2017.09.19 14:39:59.007340132	0000678	
1	0.000183	0.000171	6.391268E-5	-1.665815E-5	T	29537	2017.09.19 14:39:59.017340132	0000678	
1	0.000172	0.000143	9.220692E-5	-2.554588E-5	T	29537	2017.09.19 14:39:59.027340132	0000678	
1	0.000191	0.000156	8.184670E-5	-7.361642E-5	T	29537	2017.09.19 14:39:59.037340132	0000678	
2	0.000213	0.000194	6.345304E-5	-5.985186E-5	T	29551	2017.09.19 14:39:59.147427632	0000678	
2	0.000181	0.000157	8.199666E-5	-3.661796E-5	T	29551	2017.09.19 14:39:59.157427632	0000678	
2	0.000218	0.000194	6.339225E-5	-7.485124E-5	T	29551	2017.09.19 14:39:59.167427632	0000678	
2	0.000200	0.000165	6.366005E-5	-9.361420E-5	T	29551	2017.09.19 14:39:59.177427632	0000678	
2	0.000206	0.000190	7.262527E-5	-3.184965E-5	T	29551	2017.09.19 14:39:59.187427632	0000678	
2	0.000209	0.000185	9.680441E-5	-1.909775E-6	T	29551	2017.09.19 14:39:59.197427632	0000678	
2	0.000187	0.000165	4.873824E-5	-7.455274E-5	T	29551	2017.09.19 14:39:59.207427632	0000678	
2	0.000205	0.000180	8.668632E-5	-4.582570E-5	T	29551	2017.09.19 14:39:59.217427632	0000678	
2	0.000170	0.000146	6.402377E-5	-5.946084E-5	T	29551	2017.09.19 14:39:59.227427632	0000678	
2	0.000198	0.000166	8.677577E-5	-6.471086E-5	T	29551	2017.09.19 14:39:59.237427632	0000678	
3	0.000183	0.000151	7.290686E-5	-7.353834E-5	T	29546	2017.09.19 14:39:59.347515132	0000678	
3	0.000200	0.000175	7.769811E-5	-5.475539E-5	T	29546	2017.09.19 14:39:59.357515132	0000678	
3	0.000175	0.000142	7.804996E-5	-6.448615E-5	T	29546	2017.09.19 14:39:59.367515132	0000678	
3	0.000185	0.000166	7.287415E-5	-4.065376E-5	T	29546	2017.09.19 14:39:59.377515132	0000678	
3	0.000190	0.000157	8.688279E-5	-6.463754E-5	T	29546	2017.09.19 14:39:59.387515132	0000678	
3	0.000194	0.000180	7.284549E-5	-6.769234E-6	T	29546	2017.09.19 14:39:59.397515132	0000678	
3	0.000161	0.000147	6.417778E-5	-2.146243E-5	T	29546	2017.09.19 14:39:59.407515132	0000678	
3	0.000167	0.000147	7.314059E-5	-3.049940E-5	T	29546	2017.09.19 14:39:59.417515132	0000678	
3	0.000202	0.000185	7.266851E-5	-3.580875E-5	T	29546	2017.09.19 14:39:59.427515132	0000678	
3	0.000183	0.000166	7.801156E-5	-6.675935E-6	T	29546	2017.09.19 14:39:59.437515132	0000678	
4	0.000173	0.000146	7.303927E-5	-5.549836E-5	T	29552	2017.09.19 14:39:59.547602632	0000678	
4	0.000192	0.000156	7.782270E-5	-7.959957E-5	T	29552	2017.09.19 14:39:59.557602632	0000678	
4	0.000181	0.000156	7.292037E-5	-5.557982E-5	T	29552	2017.09.19 14:39:59.567602632	0000678	
4	0.000180	0.000151	6.792347E-5	-6.951775E-5	T	29552	2017.09.19 14:39:59.577602632	0000678	
4	0.000217	0.000179	7.247262E-5	-9.876539E-5	T	29552	2017.09.19 14:39:59.587602632	0000678	
4	0.000197	0.000176	7.773459E-5	-4.575577E-5	T	29552	2017.09.19 14:39:59.597602632	0000678	
4	0.000180	0.000157	7.798077E-5	-4.060120E-5	T	29552	2017.09.19 14:39:59.607602632	0000678	
4	0.000166	0.000133	8.220502E-5	-5.542166E-5	T	29552	2017.09.19 14:39:59.617602632	0000678	
4	0.000214	0.000194	7.248881E-5	-5.088959E-5	T	29552	2017.09.19 14:39:59.627602632	0000678	
4	0.000198	0.000162	9.180268E-5	-6.969882E-5	T	29552	2017.09.19 14:39:59.637602632	0000678	
5	0.000200	0.000171	8.673659E-5	-5.975180E-5	T	29552	2017.09.19 14:39:59.747690132	0000678	
5	0.000172	0.000142	7.808643E-5	-5.548652E-5	T	29552	2017.09.19 14:39:59.757690132	0000678	
5	0.000206	0.000175	7.259718E-5	-7.973360E-5	T	29552	2017.09.19 14:39:59.767690132	0000678	
5	0.000182	0.000146	7.294200E-5	-7.949735E-5	T	29552	2017.09.19 14:39:59.777690132	0000678	
5	0.000173	0.000151	6.398053E-5	-5.550174E-5	T	29552	2017.09.19 14:39:59.787690132	0000678	
5	0.000204	0.000161	8.170619E-5	-9.365631E-5	T	29552	2017.09.19 14:39:59.797690132	0000678	
5	0.000190	0.000171	7.785078E-5	-3.171562E-5	T	29552	2017.09.19 14:39:59.807690132	0000678	
5	0.000169	0.000127	7.315169E-5	-8.334241E-5	T	29552	2017.09.19 14:39:59.817690132	0000678	
5	0.000192	0.000146	8.690441E-5	-8.855508E-5	T	29552	2017.09.19 14:39:59.827690132	0000678	
5	0.000151	0.000123	6.429724E-5	-5.927347E-5	T	29552	2017.09.19 14:39:59.837690132	0000678	
6	0.000183	0.000161	6.786536E-5	-5.459984E-5	T	29537	2017.09.19 14:39:59.947777632	0000678	
6	0.000194	0.000175	6.369922E-5	-5.469729E-5	T	29537	2017.09.19 14:39:59.957777632	0000678	
6	0.000194	0.000175	6.369922E-5	-5.469729E-5	T	29537	2017.09.19 14:39:59.967777632	0000678	
6	0.000197	0.000165	6.770027E-5	-8.363122E-5	T	29537	2017.09.19 14:39:59.977777632	0000678	
6	0.000158	0.000143	6.422534E-5	-2.142984E-5	T	29537	2017.09.19 14:39:59.987777632	0000678	
6	0.000164	0.000143	7.316789E-5	-3.546661E-5	T	29537	2017.09.19 14:39:59.997777632	0000678	
6	0.000192	0.000171	7.781431E-5	-4.071525E-5	T	29537	2017.09.19 14:40:00.007777632	0000678	
6	0.000180	0.000166	6.797182E-5	-1.663402E-5	T	29537	2017.09.19 14:40:00.017777632	0000678	
6	0.000194	0.000180	6.774862E-5	-3.074748E-5	T	29537	2017.09.19 14:40:00.027777632	0000678	
6	0.000160	0.000133	8.228608E-5	-3.542250E-5	T	29537	2017.09.19 14:40:00.037777632	0000678	
7	0.000191	0.000171	7.279444E-5	-4.569429E-5	T	29560	2017.09.19 14:40:00.147865132	0000678	
7	0.000212	0.000184	6.749057E-5	-7.978616E-5	T	29560	2017.09.19 14:40:00.157865132	0000678	
7	0.000179	0.000161	5.888229E-5	-5.056266E-5	T	29560	2017.09.19 14:40:00.167865132	0000678	
7	0.000175	0.000147	8.711517E-5	-3.655725E-5	T	29560	2017.09.19 14:40:00.177865132	0000678	
7	0.000208	0.000156	9.172838E-5	-0.000103	T	29560	2017.09.19 14:40:00.187865132	0000678	
7	0.000190	0.000171	7.281470E-5	-4.069450E-5	T	29560	2017.09.19 14:40:00.197865132	0000678	
7	0.000191	0.000175	6.375596E-5	-4.069788E-5	T	29560	2017.09.19 14:40:00.207865132	0000678	
7	0.000175	0.000152	8.209664E-5	-2.657765E-5	T	29560	2017.09.19 14:40:00.217865132	0000678	
7	0.000204	0.000185	7.766406E-5	-3.682946E-5	T	29560	2017.09.19 14:40:00.227865132	0000678	
7	0.000194	0.000179	5.868853E-5	-4.570950E-5	T	29560	2017.09.19 14:40:00.237865132	0000678	
8	0.000174	0.000146	7.302306E-5	-5.949819E-5	T	29554	2017.09.19 14:40:00.347952632	0000678	
8	0.000203	0.000170	8.167619E-5	-7.473043E-5	T	29554	2017.09.19 14:40:00.357952632	0000678	
8	0.000179	0.000157	7.799698E-5	-3.660136E-5	T	29554	2017.09.19 14:40:00.367952632	0000678	
8	0.000198	0.000179	6.766755E-5	-5.074664E-5	T	29554	2017.09.19 14:40:00.377952632	0000678	
8	0.000193	0.000162	8.684360E-5	-5.967849E-5	T	29554	2017.09.19 14:40:00.387952632	0000678	
8	0.000192	0.000170	6.775430E-5	-5.567312E-5	T	29554	2017.09.19 14:40:00.397952632	0000678	
8	0.000148	0.000123	6.433371E-5	-5.027385E-5	T	29554	2017.09.19 14:40:00.407952632	0000678	
8	0.000237	0.000214	9.128166E-5	-4.612343E-5	T	29554	2017.09.19 14:40:00.417952632	0000678	
8	0.000201	0.000179	6.361113E-5	-6.472946E-5	T	29554	2017.09.19 14:40:00.427952632	0000678	
8	0.000201	0.000180	8.172319E-5	-3.680533E-5	T	29554	2017.09.19 14:40:00.437952632	0000678	
9	0.000186	0.000166	7.789402E-5	-3.567472E-5	T	29538	2017.09.19 14:40:00.548040132	0000678	
9	0.000175	0.000156	6.396566E-5	-4.454293E-5	T	29538	2017.09.19 14:40:00.558040132	0000678	
9	0.000183	0.000162	7.794158E-5	-3.564214E-5	T	29538	2017.09.19 14:40:00.568040132	0000678	
9	0.000184	0.000171	6.387621E-5	-2.565777E-5	T	29538	2017.09.19 14:40:00.578040132	0000678	
9	0.000175	0.000161	5.896335E-5	-3.056350E-5	T	29538	2017.09.19 14:40:00.588040132	0000678	
9	0.000204	0.000185	8.168806E-5	-3.084631E-5	T	29538	2017.09.19 14:40:00.598040132	0000678	
9	0.000182	0.000171	5.906709E-5	2.136101E-5	T	29538	2017.09.19 14:40:00.608040132	0000678	
9	0.000185	0.000166	7.287415E-5	-4.065376E-5	T	29538	2017.09.19 14:40:00.618040132	0000678	
9	0.000213	0.000185	9.664635E-5	-4.090815E-5	T	29538	2017.09.19 14:40:00.628040132	0000678	
9	0.000186	0.000171	7.297277E-5	-1.696126E-6	T	29538	2017.09.19 14:40:00.638040132	0000678	
10	0.000190	0.000170	6.777862E-5	-4.967337E-5	T	29546	2017.09.19 14:40:00.748127632	0000678	
10	0.000191	0.000176	6.779618E-5	-3.071490E-5	T	29546	2017.09.19 14:40:00.758127632	0000678	
10	0.000201	0.000175	7.767785E-5	-5.975518E-5	T	29546	2017.09.19 14:40:00.768127632	0000678	
10	0.000204	0.000180	8.669037E-5	-4.482575E-5	T	29546	2017.09.19 14:40:00.778127632	0000678	
10	0.000190	0.000157	0.000101	-3.569686E-5	T	29546	2017.09.19 14:40:00.788127632	0000678	
10	0.000194	0.000176	7.275525E-5	-4.073523E-5	T	29546	2017.09.19 14:40:00.798127632	0000678	
10	0.000215	0.000199	7.248178E-5	-4.092259E-5	T	29546	2017.09.19 14:40:00.808127632	0000678	
10	0.000187	0.000161	5.878907E-5	-7.356170E-5	T	29546	2017.09.19 14:40:00.818127632	0000678	
10	0.000180	0.000157	7.798077E-5	-4.060120E-5	T	29546	2017.09.19 14:40:00.828127632	0000678	
10	0.000178	0.000162	7.305951E-5	-6.622600E-6	T	29546	2017.09.19 14:40:00.838127632	0000678	
11	0.000190	0.000156	7.784297E-5	-7.459978E-5	T	29555	2017.09.19 14:40:00.948215132	0000678	
11	0.000180	0.000157	7.798077E-5	-4.060120E-5	T	29555	2017.09.19 14:40:00.958215132	0000678	
11	0.000190	0.000170	5.873880E-5	-5.963560E-5	T	29555	2017.09.19 14:40:00.968215132	0000678	
11	0.000198	0.000170	6.365734E-5	-7.965552E-5	T	29555	2017.09.19 14:40:00.978215132	0000678	
11	0.000197	0.000146	8.686388E-5	-9.855466E-5	T	29555	2017.09.19 14:40:00.988215132	0000678	
11	0.000198	0.000156	7.274609E-5	-9.857802E-5	T	29555	2017.09.19 14:40:00.998215132	0000678	
11	0.000173	0.000132	7.309224E-5	-8.338314E-5	T	29555	2017.09.19 14:40:01.008215132	0000678	
11	0.000185	0.000162	7.790105E-5	-4.564172E-5	T	29555	2017.09.19 14:40:01.018215132	0000678	
11	0.000212	0.000185	8.657013E-5	-5.986585E-5	T	29555	2017.09.19 14:40:01.028215132	0000678	
11	0.000180	0.000146	8.200208E-5	-6.453533E-5	T	29555	2017.09.19 14:40:01.038215132	0000678	
12	0.000189	0.000162	8.690440E-5	-4.467911E-5	T	29537	2017.09.19 14:40:01.148302632	0000678	
12	0.000195	0.000171	8.683386E-5	-3.575281E-5	T	29537	2017.09.19 14:40:01.158302632	0000678	
12	0.000174	0.000165	4.895305E-5	-2.155496E-5	T	29537	2017.09.19 14:40:01.168302632	0000678	
12	0.000200	0.000180	8.686465E-5	-1.827543E-6	T	29537	2017.09.19 14:40:01.178302632	0000678	
12	0.000170	0.000152	6.806127E-5	-3.551917E-5	T	29537	2017.09.19 14:40:01.188302632	0000678	
12	0.000192	0.000165	6.374111E-5	-7.361503E-5	T	29537	2017.09.19 14:40:01.198302632	0000678	
12	0.000202	0.000180	7.767082E-5	-4.978819E-5	T	29537	2017.09.19 14:40:01.208302632	0000678	
12	0.000193	0.000180	6.374893E-5	-3.073088E-5	T	29537	2017.09.19 14:40:01.218302632	0000678	
12	0.000184	0.000165	6.383838E-5	-4.961604E-5	T	29537	2017.09.19 14:40:01.228302632	0000678	
12	0.000160	0.000138	7.322734E-5	-3.542588E-5	T	29537	2017.09.19 14:40:01.238302632	0000678	
13	0.000208	0.000176	9.165648E-5	-6.481308E-5	T	29549	2017.09.19 14:40:01.348390132	0000678	
13	0.000175	0.000147	8.709896E-5	-4.055708E-5	T	29549	2017.09.19 14:40:01.358390132	0000678	
13	0.000176	0.000152	7.801995E-5	-4.556026E-5	T	29549	2017.09.19 14:40:01.368390132	0000678	
13	0.000209	0.000179	7.756949E-5	-7.478714E-5	T	29549	2017.09.19 14:40:01.378390132	0000678	
13	0.000178	0.000156	6.392108E-5	-5.554247E-5	T	29549	2017.09.19 14:40:01.388390132	0000678	
13	0.000224	0.000199	9.649610E-5	-3.702236E-5	T	29549	2017.09.19 14:40:01.398390132	0000678	
13	0.000176	0.000161	5.893903E-5	-3.656325E-5	T	29549	2017.09.19 14:40:01.408390132	0000678	
13	0.000212	0.000180	9.160892E-5	-6.484566E-5	T	29549	2017.09.19 14:40:01.418390132	0000678	
13	0.000180	0.000161	6.792211E-5	-4.060043E-5	T	29549	2017.09.19 14:40:01.428390132	0000678	
13	0.000197	0.000175	6.767864E-5	-5.971368E-5	T	29549	2017.09.19 14:40:01.438390132	0000678	
14	0.000192	0.000165	7.779675E-5	-5.967372E-5	T	29534	2017.09.19 14:40:01.548477632	0000678	
14	0.000183	0.000165	6.385865E-5	-4.461625E-5	T	29534	2017.09.19 14:40:01.558477632	0000678	
14	0.000196	0.000171	9.187400E-5	-2.577397E-5	T	29534	2017.09.19 14:40:01.568477632	0000678	
14	0.000181	0.000162	7.798211E-5	-2.564256E-5	T	29534	2017.09.19 14:40:01.578477632	0000678	
14	0.000187	0.000170	5.877933E-5	-4.963602E-5	T	29534	2017.09.19 14:40:01.588477632	0000678	
14	0.000174	0.000152	8.210070E-5	-2.557769E-5	T	29534	2017.09.19 14:40:01.598477632	0000678	
14	0.000185	0.000162	7.790511E-5	-4.464176E-5	T	29534	2017.09.19 14:40:01.608477632	0000678	
14	0.000194	0.000176	8.189234E-5	-6.773999E-6	T	29534	2017.09.19 14:40:01.618477632	0000678	
14	0.000171	0.000142	7.809049E-5	-5.448656E-5	T	29534	2017.09.19 14:40:01.628477632	0000678	
14	0.000171	0.000147	8.213988E-5	-3.053675E-5	T	29534	2017.09.19 14:40:01.638477632	0000678	
15	0.000184	0.000146	8.196155E-5	-7.453491E-5	T	29552	2017.09.19 14:40:01.748565132	0000678	
15	0.000199	0.000175	6.363842E-5	-6.969666E-5	T	29552	2017.09.19 14:40:01.758565132	0000678	
15	0.000196	0.000170	6.769756E-5	-6.967253E-5	T	29552	2017.09.19 14:40:01.768565132	0000678	
15	0.000190	0.000151	7.284607E-5	-8.853771E-5	T	29552	2017.09.19 14:40:01.778565132	0000678	
15	0.000215	0.000194	7.246854E-5	-5.588938E-5	T	29552	2017.09.19 14:40:01.788565132	0000678	
15	0.000186	0.000162	8.695708E-5	-3.167966E-5	T	29552	2017.09.19 14:40:01.798565132	0000678	
15	0.000187	0.000162	8.190074E-5	-4.565832E-5	T	29552	2017.09.19 14:40:01.808565132	0000678	
15	0.000163	0.000137	5.911091E-5	-6.436656E-5	T	29552	2017.09.19 14:40:01.818565132	0000678	
15	0.000194	0.000166	8.683252E-5	-5.071145E-5	T	29552	2017.09.19 14:40:01.828565132	0000678	
15	0.000207	0.000184	6.755136E-5	-6.478679E-5	T	29552	2017.09.19 14:40:01.838565132	0000678	
16	0.000171	0.000147	7.809967E-5	-4.051973E-5	T	29551	2017.09.19 14:40:01.948652632	0000678	
16	0.000202	0.000171	8.671632E-5	-6.475159E-5	T	29551	2017.09.19 14:40:01.958652632	0000678	
16	0.000199	0.000165	8.675551E-5	-6.971065E-5	T	29551	2017.09.19 14:40:01.968652632	0000678	
16	0.000165	0.000138	7.818641E-5	-4.544621E-5	T	29551	2017.09.19 14:40:01.978652632	0000678	
16	0.000169	0.000152	6.807748E-5	-3.151934E-5	T	29551	2017.09.19 14:40:01.988652632	0000678	
16	0.000181	0.000161	6.790184E-5	-4.560022E-5	T	29551	2017.09.19 14:40:01.998652632	0000678	
16	0.000211	0.000185	9.668282E-5	-3.190852E-5	T	29551	2017.09.19 14:40:02.008652632	0000678	
16	0.000177	0.000161	6.393863E-5	-3.658400E-5	T	29551	2017.09.19 14:40:02.018652632	0000678	
16	0.000200	0.000170	7.769677E-5	-6.971403E-5	T	29551	2017.09.19 14:40:02.028652632	0000678	
16	0.000200	0.000180	8.686465E-5	-1.827543E-6	T	29551	2017.09.19 14:40:02.038652632	0000678	
17	0.000174	0.000137	8.208883E-5	-6.946181E-5	T	29552	2017.09.19 14:40:02.148740132	0000678	
17	0.000205	0.000190	6.760540E-5	-3.682869E-5	T	29552	2017.09.19 14:40:02.158740132	0000678	
17	0.000192	0.000161	6.776404E-5	-7.959880E-5	T	29552	2017.09.19 14:40:02.168740132	0000678	
17	0.000200	0.000170	8.171672E-5	-6.473084E-5	T	29552	2017.09.19 14:40:02.178740132	0000678	
17	0.000186	0.000156	7.788350E-5	-6.460019E-5	T	29552	2017.09.19 14:40:02.188740132	0000678	
17	0.000197	0.000175	6.767864E-5	-5.971368E-5	T	29552	2017.09.19 14:40:02.198740132	0000678	
17	0.000173	0.000152	7.809696E-5	-2.656105E-5	T	29552	2017.09.19 14:40:02.208740132	0000678	
17	0.000181	0.000156	6.790455E-5	-5.955890E-5	T	29552	2017.09.19 14:40:02.218740132	0000678	
17	0.000203	0.000180	8.168672E-5	-4.580495E-5	T	29552	2017.09.19 14:40:02.228740132	0000678	
17	0.000177	0.000161	5.892282E-5	-4.056308E-5	T	29552	2017.09.19 14:40:02.238740132	0000678	
18	0.000202	0.000180	8.169077E-5	-4.480500E-5	T	29543	2017.09.19 14:40:02.348827632	0000678	
18	0.000164	0.000133	8.222934E-5	-4.942191E-5	T	29543	2017.09.19 14:40:02.358827632	0000678	
18	0.000194	0.000180	7.282523E-5	-1.176902E-5	T	29543	2017.09.19 14:40:02.368827632	0000678	
18	0.000198	0.000176	8.679468E-5	-3.079375E-5	T	29543	2017.09.19 14:40:02.378827632	0000678	
18	0.000191	0.000171	7.279849E-5	-4.469433E-5	T	29543	2017.09.19 14:40:02.388827632	0000678	
18	0.000205	0.000185	7.763163E-5	-4.482913E-5	T	29543	2017.09.19 14:40:02.398827632	0000678	
18	0.000199	0.000175	6.765837E-5	-6.471347E-5	T	29543	2017.09.19 14:40:02.408827632	0000678	
18	0.000210	0.000195	7.256987E-5	-3.089043E-5	T	29543	2017.09.19 14:40:02.418827632	0000678	
18	0.000174	0.000157	7.305817E-5	-2.158124E-5	T	29543	2017.09.19 14:40:02.428827632	0000678	
18	0.000215	0.000195	8.152863E-5	-4.092736E-5	T	29543	2017.09.19 14:40:02.438827632	0000678	
19	0.000196	0.000171	8.177751E-5	-4.973147E-5	T	29539	2017.09.19 14:40:02.548915132	0000678	
19	0.000196	0.000180	7.274822E-5	-3.076823E-5	T	29539	2017.09.19 14:40:02.558915132	0000678	
19	0.000218	0.000195	8.147189E-5	-5.492677E-5	T	29539	2017.09.19 14:40:02.568915132	0000678	
19	0.000198	0.000170	7.771703E-5	-6.471424E-5	T	29539	2017.09.19 14:40:02.578915132	0000678	
19	0.000199	0.000176	8.173833E-5	-4.477241E-5	T	29539	2017.09.19 14:40:02.588915132	0000678	
19	0.000158	0.000143	6.420913E-5	-2.542968E-5	T	29539	2017.09.19 14:40:02.598915132	0000678	
19	0.000200	0.000180	8.174751E-5	-3.080558E-5	T	29539	2017.09.19 14:40:02.608915132	0000678	
19	0.000187	0.000166	7.787376E-5	-4.067451E-5	T	29539	2017.09.19 14:40:02.618915132	0000678	
19	0.000194	0.000171	8.179778E-5	-4.473168E-5	T	29539	2017.09.19 14:40:02.628915132	0000678	
19	0.000164	0.000142	6.813181E-5	-4.444548E-5	T	29539	2017.09.19 14:40:02.638915132	0000678	
20	0.000178	0.000147	8.705843E-5	-5.055667E-5	T	29552	2017.09.19 14:40:02.749002632	0000678	
20	0.000183	0.000165	6.385460E-5	-4.561620E-5	T	29552	2017.09.19 14:40:02.759002632	0000678	
20	0.000184	0.000146	7.794160E-5	-7.951810E-5	T	29552	2017.09.19 14:40:02.769002632	0000678	
20	0.000187	0.000161	5.878501E-5	-7.456166E-5	T	29552	2017.09.19 14:40:02.779002632	0000678	
20	0.000176	0.000151	6.394405E-5	-6.450136E-5	T	29552	2017.09.19 14:40:02.789002632	0000678	
20	0.000200	0.000176	8.675415E-5	-4.079333E-5	T	29552	2017.09.19 14:40:02.799002632	0000678	
20	0.000170	0.000152	6.805722E-5	-3.651913E-5	T	29552	2017.09.19 14:40:02.809002632	0000678	
20	0.000222	0.000189	8.141380E-5	-8.388483E-5	T	29552	2017.09.19 14:40:02.819002632	0000678	
20	0.000186	0.000161	7.286092E-5	-5.562055E-5	T	29552	2017.09.19 14:40:02.829002632	0000678	
20	0.000180	0.000152	8.703951E-5	-4.059782E-5	T	29552	2017.09.19 14:40:02.839002632	0000678	
21	0.000202	0.000175	7.264177E-5	-6.873406E-5	T	29543	2017.09.19 14:40:02.949090132	0000678	
21	0.000184	0.000156	7.288389E-5	-6.457944E-5	T	29543	2017.09.19 14:40:02.959090132	0000678	
21	0.000180	0.000161	6.792211E-5	-4.060043E-5	T	29543	2017.09.19 14:40:02.969090132	0000678	
21	0.000205	0.000184	6.757163E-5	-5.978700E-5	T	29543	2017.09.19 14:40:02.979090132	0000678	
21	0.000162	0.000143	7.322463E-5	-2.146719E-5	T	29543	2017.09.19 14:40:02.989090132	0000678	
21	0.000160	0.000138	7.826747E-5	-2.544704E-5	T	29543	2017.09.19 14:40:02.999090132	0000678	
21	0.000188	0.000162	8.188452E-5	-4.965815E-5	T	29543	2017.09.19 14:40:03.009090132	0000678	
21	0.000189	0.000165	7.281741E-5	-5.465318E-5	T	29543	2017.09.19 14:40:03.019090132	0000678	
21	0.000167	0.000147	7.314059E-5	-3.049940E-5	T	29543	2017.09.19 14:40:03.029090132	0000678	
21	0.000203	0.000185	7.768838E-5	-3.082971E-5	T	29543	2017.09.19 14:40:03.039090132	0000678	
22	0.000197	0.000171	8.679738E-5	-4.475243E-5	T	29541	2017.09.19 14:40:03.149177632	0000678	
22	0.000170	0.000147	7.308385E-5	-4.449882E-5	T	29541	2017.09.19 14:40:03.159177632	0000678	
22	0.000190	0.000170	6.777862E-5	-4.967337E-5	T	29541	2017.09.19 14:40:03.169177632	0000678	
22	0.000160	0.000142	4.909277E-5	-5.436621E-5	T	29541	2017.09.19 14:40:03.179177632	0000678	
22	0.000164	0.000142	6.411186E-5	-4.942867E-5	T	29541	2017.09.19 14:40:03.189177632	0000678	
22	0.000193	0.000162	9.691982E-5	-4.072078E-5	T	29541	2017.09.19 14:40:03.199177632	0000678	
22	0.000178	0.000162	7.301898E-5	-1.662218E-5	T	29541	2017.09.19 14:40:03.209177632	0000678	
22	0.000161	0.000138	7.320707E-5	-4.042567E-5	T	29541	2017.09.19 14:40:03.219177632	0000678	
22	0.000202	0.000185	7.266851E-5	-3.580875E-5	T	29541	2017.09.19 14:40:03.229177632	0000678	
22	0.000188	0.000176	6.385323E-5	-1.669888E-5	T	29541	2017.09.19 14:40:03.239177632	0000678	
23	0.000219	0.000184	9.150894E-5	-7.488597E-5	T	29552	2017.09.19 14:40:03.349265132	0000678	
23	0.000190	0.000166	8.185318E-5	-4.569091E-5	T	29552	2017.09.19 14:40:03.359265132	0000678	
23	0.000181	0.000157	8.199666E-5	-3.661796E-5	T	29552	2017.09.19 14:40:03.369265132	0000678	
23	0.000196	0.000170	7.271743E-5	-6.469349E-5	T	29552	2017.09.19 14:40:03.379265132	0000678	
23	0.000199	0.000175	6.765837E-5	-6.471347E-5	T	29552	2017.09.19 14:40:03.389265132	0000678	
23	0.000218	0.000194	7.745194E-5	-5.990996E-5	T	29552	2017.09.19 14:40:03.399265132	0000678	
23	0.000182	0.000162	7.292171E-5	-4.062118E-5	T	29552	2017.09.19 14:40:03.409265132	0000678	
23	0.000224	0.000194	7.235506E-5	-8.388821E-5	T	29552	2017.09.19 14:40:03.419265132	0000678	
23	0.000171	0.000156	5.899848E-5	-3.652251E-5	T	29552	2017.09.19 14:40:03.429265132	0000678	
23	0.000186	0.000146	8.696116E-5	-7.455566E-5	T	29552	2017.09.19 14:40:03.439265132	0000678	
24	0.000186	0.000171	7.302951E-5	1.230329E-5	T	29548	2017.09.19 14:40:03.549352632	0000678	
24	0.000216	0.000185	9.154947E-5	-6.488639E-5	T	29548	2017.09.19 14:40:03.559352632	0000678	
24	0.000205	0.000184	7.260771E-5	-5.080813E-5	T	29548	2017.09.19 14:40:03.569352632	0000678	
24	0.000206	0.000175	7.761705E-5	-7.475456E-5	T	29548	2017.09.19 14:40:03.579352632	0000678	
24	0.000183	0.000137	7.799187E-5	-9.344420E-5	T	29548	2017.09.19 14:40:03.589352632	0000678	
24	0.000211	0.000156	8.668824E-5	-0.000113	T	29548	2017.09.19 14:40:03.599352632	0000678	
24	0.000195	0.000170	7.775351E-5	-5.571462E-5	T	29548	2017.09.19 14:40:03.609352632	0000678	
24	0.000176	0.000146	5.894310E-5	-7.943925E-5	T	29548	2017.09.19 14:40:03.619352632	0000678	
24	0.000223	0.000194	5.831563E-5	-9.382969E-5	T	29548	2017.09.19 14:40:03.629352632	0000678	
24	0.000220	0.000198	7.240477E-5	-5.992180E-5	T	29548	2017.09.19 14:40:03.639352632	0000678	
25	0.000198	0.000180	8.180425E-5	-1.680617E-5	T	29541	2017.09.19 14:40:03.749440132	0000678	
25	0.000190	0.000161	7.782404E-5	-6.464093E-5	T	29541	2017.09.19 14:40:03.759440132	0000678	
25	0.000222	0.000195	9.147110E-5	-5.496827E-5	T	29541	2017.09.19 14:40:03.769440132	0000678	
25	0.000195	0.000176	7.273904E-5	-4.473506E-5	T	29541	2017.09.19 14:40:03.779440132	0000678	
25	0.000175	0.000162	6.399943E-5	-2.158462E-5	T	29541	2017.09.19 14:40:03.789440132	0000678	
25	0.000208	0.000185	9.170754E-5	-2.588802E-5	T	29541	2017.09.19 14:40:03.799440132	0000678	
25	0.000194	0.000151	9.188510E-5	-7.861698E-5	T	29541	2017.09.19 14:40:03.809440132	0000678	
25	0.000188	0.000175	5.877662E-5	-3.567734E-5	T	29541	2017.09.19 14:40:03.819440132	0000678	
25	0.000171	0.000133	8.716815E-5	-6.444203E-5	T	29541	2017.09.19 14:40:03.829440132	0000678	
25	0.000179	0.000157	7.800103E-5	-3.560141E-5	T	29541	2017.09.19 14:40:03.839440132	0000678	
26	0.000181	0.000152	8.198316E-5	-5.457648E-5	T	29547	2017.09.19 14:40:03.949527632	0000678	
26	0.000157	0.000138	6.824800E-5	-3.040534E-5	T	29547	2017.09.19 14:40:03.959527632	0000678	
26	0.000201	0.000170	7.768056E-5	-7.371387E-5	T	29547	2017.09.19 14:40:03.969527632	0000678	
26	0.000183	0.000156	7.792403E-5	-5.460061E-5	T	29547	2017.09.19 14:40:03.979527632	0000678	
26	0.000211	0.000185	9.163053E-5	-4.488723E-5	T	29547	2017.09.19 14:40:03.989527632	0000678	
26	0.000178	0.000152	8.202369E-5	-4.457690E-5	T	29547	2017.09.19 14:40:03.999527632	0000678	
26	0.000181	0.000162	7.294198E-5	-3.562139E-5	T	29547	2017.09.19 14:40:04.009527632	0000678	
26	0.000163	0.000137	7.317060E-5	-4.942529E-5	T	29547	2017.09.19 14:40:04.019527632	0000678	
26	0.000196	0.000175	5.865908E-5	-6.467612E-5	T	29547	2017.09.19 14:40:04.029527632	0000678	
26	0.000185	0.000151	8.192642E-5	-6.857590E-5	T	29547	2017.09.19 14:40:04.039527632	0000678	
27	0.000186	0.000162	7.788079E-5	-5.064151E-5	T	29555	2017.09.19 14:40:04.149615132	0000678	
27	0.000178	0.000147	8.202235E-5	-5.953554E-5	T	29555	2017.09.19 14:40:04.159615132	0000678	
27	0.000190	0.000165	6.777727E-5	-6.463201E-5	T	29555	2017.09.19 14:40:04.169615132	0000678	
27	0.000221	0.000194	7.741141E-5	-6.990955E-5	T	29555	2017.09.19 14:40:04.179615132	0000678	
27	0.000214	0.000184	7.751004E-5	-7.482787E-5	T	29555	2017.09.19 14:40:04.189615132	0000678	
27	0.000193	0.000166	8.181265E-5	-5.569049E-5	T	29555	2017.09.19 14:40:04.199615132	0000678	
27	0.000190	0.000161	7.782404E-5	-6.464093E-5	T	29555	2017.09.19 14:40:04.209615132	0000678	
27	0.000163	0.000137	6.814667E-5	-5.540429E-5	T	29555	2017.09.19 14:40:04.219615132	0000678	
27	0.000175	0.000157	7.303790E-5	-2.658103E-5	T	29555	2017.09.19 14:40:04.229615132	0000678	
27	0.000182	0.000157	7.794024E-5	-5.060078E-5	T	29555	2017.09.19 14:40:04.239615132	0000678	
28	0.000195	0.000166	8.681630E-5	-5.471128E-5	T	29539	2017.09.19 14:40:04.349702632	0000678	
28	0.000173	0.000151	6.398458E-5	-5.450178E-5	T	29539	2017.09.19 14:40:04.359702632	0000678	
28	0.000174	0.000157	7.305817E-5	-2.158124E-5	T	29539	2017.09.19 14:40:04.369702632	0000678	
28	0.000149	0.000128	7.340298E-5	-2.134500E-5	T	29539	2017.09.19 14:40:04.379702632	0000678	
28	0.000191	0.000166	8.687305E-5	-4.071186E-5	T	29539	2017.09.19 14:40:04.389702632	0000678	
28	0.000206	0.000179	7.761002E-5	-6.478756E-5	T	29539	2017.09.19 14:40:04.399702632	0000678	
28	0.000182	0.000166	6.789481E-5	-3.563322E-5	T	29539	2017.09.19 14:40:04.409702632	0000678	
28	0.000188	0.000162	9.199722E-5	-2.170082E-5	T	29539	2017.09.19 14:40:04.419702632	0000678	
28	0.000145	0.000132	5.434503E-5	-2.130688E-5	T	29539	2017.09.19 14:40:04.429702632	0000678	
28	0.000203	0.000180	8.167050E-5	-4.980479E-5	T	29539	2017.09.19 14:40:04.439702632	0000678	
29	0.000180	0.000157	8.202098E-5	-3.061822E-5	T	29539	2017.09.19 14:40:04.549790132	0000678	
29	0.000202	0.000185	7.266851E-5	-3.580875E-5	T	29539	2017.09.19 14:40:04.559790132	0000678	
29	0.000170	0.000143	7.811075E-5	-4.948677E-5	T	29539	2017.09.19 14:40:04.569790132	0000678	
29	0.000204	0.000171	9.675607E-5	-5.479351E-5	T	29539	2017.09.19 14:40:04.579790132	0000678	
29	0.000190	0.000166	8.185723E-5	-4.469095E-5	T	29539	2017.09.19 14:40:04.589790132	0000678	
29	0.000180	0.000157	8.709760E-5	-1.163976E-5	T	29539	2017.09.19 14:40:04.599790132	0000678	
29	0.000178	0.000162	6.796264E-5	-3.060085E-5	T	29539	2017.09.19 14:40:04.609790132	0000678	
29	0.000184	0.000166	7.799129E-5	-1.167573E-5	T	29539	2017.09.19 14:40:04.619790132	0000678	
29	0.000186	0.000152	8.694224E-5	-6.459681E-5	T	29539	2017.09.19 14:40:04.629790132	0000678	
29	0.000171	0.000157	6.815584E-5	2.438506E-6	T	29539	2017.09.19 14:40:04.639790132	0000678	
30	0.000182	0.000171	6.397348E-5	-1.658775E-6	T	29550	2017.09.19 14:40:04.749877632	0000678	
30	0.000196	0.000175	5.865908E-5	-6.467612E-5	T	29550	2017.09.19 14:40:04.759877632	0000678	
30	0.000191	0.000175	6.375596E-5	-4.069788E-5	T	29550	2017.09.19 14:40:04.769877632	0000678	
30	0.000173	0.000162	5.899982E-5	-2.156387E-5	T	29550	2017.09.19 14:40:04.779877632	0000678	
30	0.000184	0.000157	8.193992E-5	-5.061738E-5	T	29550	2017.09.19 14:40:04.789877632	0000678	
30	0.000200	0.000166	9.681146E-5	-5.575274E-5	T	29550	2017.09.19 14:40:04.799877632	0000678	
30	0.000197	0.000184	4.860960E-5	-5.070853E-5	T	29550	2017.09.19 14:40:04.809877632	0000678	
30	0.000206	0.000161	7.767003E-5	-0.000103	T	29550	2017.09.19 14:40:04.819877632	0000678	
30	0.000192	0.000176	7.791292E-5	-1.757607E-6	T	29550	2017.09.19 14:40:04.829877632	0000678	
30	0.000190	0.000157	8.688279E-5	-6.463754E-5	T	29550	2017.09.19 14:40:04.839877632	0000678	
31	0.000213	0.000185	9.159000E-5	-5.488681E-5	T	29544	2017.09.19 14:40:04.949965132	0000678	
31	0.000199	0.000175	7.267824E-5	-5.973443E-5	T	29544	2017.09.19 14:40:04.959965132	0000678	
31	0.000168	0.000138	8.216989E-5	-4.946264E-5	T	29544	2017.09.19 14:40:04.969965132	0000678	
31	0.000191	0.000171	7.279849E-5	-4.469433E-5	T	29544	2017.09.19 14:40:04.979965132	0000678	
31	0.000189	0.000171	7.789131E-5	-2.171604E-5	T	29544	2017.09.19 14:40:04.989965132	0000678	
31	0.000199	0.000171	9.179699E-5	-4.477318E-5	T	29544	2017.09.19 14:40:04.999965132	0000678	
31	0.000189	0.000162	8.690440E-5	-4.467911E-5	T	29544	2017.09.19 14:40:05.009965132	0000678	
31	0.000211	0.000176	9.665608E-5	-6.483383E-5	T	29544	2017.09.19 14:40:05.019965132	0000678	
31	0.000172	0.000142	6.803453E-5	-6.844448E-5	T	29544	2017.09.19 14:40:05.029965132	0000678	
31	0.000168	0.000143	8.736133E-5	1.247329E-5	T	29544	2017.09.19 14:40:05.039965132	0000678	
32	0.000209	0.000180	9.668958E-5	-4.486725E-5	T	29541	2017.09.19 14:40:05.150052632	0000678	
32	0.000181	0.000157	7.796456E-5	-4.460103E-5	T	29541	2017.09.19 14:40:05.160052632	0000678	
32	0.000196	0.000176	8.691221E-5	-1.794958E-6	T	29541	2017.09.19 14:40:05.170052632	0000678	
32	0.000210	0.000190	8.158808E-5	-4.088663E-5	T	29541	2017.09.19 14:40:05.180052632	0000678	
32	0.000189	0.000166	8.187344E-5	-4.069111E-5	T	29541	2017.09.19 14:40:05.190052632	0000678	
32	0.000175	0.000152	8.717731E-5	-6.599237E-6	T	29541	2017.09.19 14:40:05.200052632	0000678	
32	0.000180	0.000166	6.797182E-5	-1.663402E-5	T	29541	2017.09.19 14:40:05.210052632	0000678	
32	0.000196	0.000175	7.271877E-5	-4.973485E-5	T	29541	2017.09.19 14:40:05.220052632	0000678	
32	0.000178	0.000161	6.392242E-5	-4.058383E-5	T	29541	2017.09.19 14:40:05.230052632	0000678	
32	0.000204	0.000180	8.670659E-5	-4.082591E-5	T	29541	2017.09.19 14:40:05.240052632	0000678	
33	0.000164	0.000138	7.819047E-5	-4.444625E-5	T	29538	2017.09.19 14:40:05.350140132	0000678	
33	0.000203	0.000171	9.173619E-5	-5.977255E-5	T	29538	2017.09.19 14:40:05.360140132	0000678	
33	0.000153	0.000128	7.836611E-5	-3.036537E-5	T	29538	2017.09.19 14:40:05.370140132	0000678	
33	0.000186	0.000171	6.785563E-5	-3.067416E-5	T	29538	2017.09.19 14:40:05.380140132	0000678	
33	0.000193	0.000170	6.773809E-5	-5.967295E-5	T	29538	2017.09.19 14:40:05.390140132	0000678	
33	0.000181	0.000157	8.198045E-5	-4.061780E-5	T	29538	2017.09.19 14:40:05.400140132	0000678	
33	0.000149	0.000133	6.434424E-5	-2.134838E-5	T	29538	2017.09.19 14:40:05.410140132	0000678	
33	0.000175	0.000152	8.208043E-5	-3.057748E-5	T	29538	2017.09.19 14:40:05.420140132	0000678	
33	0.000180	0.000166	6.799208E-5	-1.163423E-5	T	29538	2017.09.19 14:40:05.430140132	0000678	
33	0.000201	0.000176	8.169780E-5	-5.477199E-5	T	29538	2017.09.19 14:40:05.440140132	0000678	
34	0.000188	0.000165	7.283362E-5	-5.065335E-5	T	29548	2017.09.19 14:40:05.550227632	0000678	
34	0.000180	0.000151	7.294334E-5	-6.453871E-5	T	29548	2017.09.19 14:40:05.560227632	0000678	
34	0.000190	0.000165	7.279714E-5	-5.965297E-5	T	29548	2017.09.19 14:40:05.570227632	0000678	
34	0.000184	0.000166	7.291063E-5	-3.165414E-5	T	29548	2017.09.19 14:40:05.580227632	0000678	
34	0.000166	0.000147	6.811667E-5	-3.647840E-5	T	29548	2017.09.19 14:40:05.590227632	0000678	
34	0.000203	0.000170	7.765624E-5	-7.971362E-5	T	29548	2017.09.19 14:40:05.600227632	0000678	
34	0.000202	0.000185	7.266445E-5	-3.680871E-5	T	29548	2017.09.19 14:40:05.610227632	0000678	
34	0.000177	0.000143	9.210559E-5	-5.054483E-5	T	29548	2017.09.19 14:40:05.620227632	0000678	
34	0.000201	0.000180	7.768703E-5	-4.578835E-5	T	29548	2017.09.19 14:40:05.630227632	0000678	
34	0.000168	0.000142	7.310709E-5	-5.046598E-5	T	29548	2017.09.19 14:40:05.640227632	0000678	
35	0.000189	0.000161	7.784431E-5	-5.964114E-5	T	29554	2017.09.19 14:40:05.750315132	0000678	
35	0.000167	0.000137	7.313007E-5	-5.942487E-5	T	29554	2017.09.19 14:40:05.760315132	0000678	
35	0.000180	0.000157	7.798077E-5	-4.060120E-5	T	29554	2017.09.19 14:40:05.770315132	0000678	
35	0.000221	0.000170	7.248641E-5	-0.000122	T	29554	2017.09.19 14:40:05.780315132	0000678	
35	0.000199	0.000165	8.675551E-5	-6.971065E-5	T	29554	2017.09.19 14:40:05.790315132	0000678	
35	0.000168	0.000137	7.814588E-5	-5.544579E-5	T	29554	2017.09.19 14:40:05.800315132	0000678	
35	0.000232	0.000208	8.128516E-5	-6.004061E-5	T	29554	2017.09.19 14:40:05.810315132	0000678	
35	0.000181	0.000156	6.790455E-5	-5.955890E-5	T	29554	2017.09.19 14:40:05.820315132	0000678	
35	0.000195	0.000170	7.775351E-5	-5.571462E-5	T	29554	2017.09.19 14:40:05.830315132	0000678	
35	0.000194	0.000170	6.771782E-5	-6.467274E-5	T	29554	2017.09.19 14:40:05.840315132	0000678	
36	0.000194	0.000161	7.778351E-5	-7.464051E-5	T	29560	2017.09.19 14:40:05.950402632	0000678	
36	0.000183	0.000162	8.197774E-5	-2.665911E-5	T	29560	2017.09.19 14:40:05.960402632	0000678	
36	0.000191	0.000176	6.779212E-5	-3.171485E-5	T	29560	2017.09.19 14:40:05.970402632	0000678	
36	0.000204	0.000185	7.262798E-5	-4.580834E-5	T	29560	2017.09.19 14:40:05.980402632	0000678	
36	0.000188	0.000161	7.786052E-5	-5.564130E-5	T	29560	2017.09.19 14:40:05.990402632	0000678	
36	0.000199	0.000162	0.000101	-5.573675E-5	T	29560	2017.09.19 14:40:06.000402632	0000678	
36	0.000211	0.000199	6.755918E-5	-2.190264E-5	T	29560	2017.09.19 14:40:06.010402632	0000678	
36	0.000175	0.000146	7.803887E-5	-5.551911E-5	T	29560	2017.09.19 14:40:06.020402632	0000678	
36	0.000194	0.000166	8.179643E-5	-5.969032E-5	T	29560	2017.09.19 14:40:06.030402632	0000678	
36	0.000196	0.000175	6.769485E-5	-5.571385E-5	T	29560	2017.09.19 14:40:06.040402632	0000678	
37	0.000195	0.000170	6.369787E-5	-6.965593E-5	T	29549	2017.09.19 14:40:06.150490132	0000678	
37	0.000203	0.000189	5.354976E-5	-5.077001E-5	T	29549	2017.09.19 14:40:06.160490132	0000678	
37	0.000207	0.000185	8.162727E-5	-4.584569E-5	T	29549	2017.09.19 14:40:06.170490132	0000678	
37	0.000208	0.000175	6.354115E-5	-9.369566E-5	T	29549	2017.09.19 14:40:06.180490132	0000678	
37	0.000205	0.000184	5.853181E-5	-6.974923E-5	T	29549	2017.09.19 14:40:06.190490132	0000678	
37	0.000204	0.000194	3.949141E-5	-5.075264E-5	T	29549	2017.09.19 14:40:06.200490132	0000678	
37	0.000174	0.000152	7.805643E-5	-3.656063E-5	T	29549	2017.09.19 14:40:06.210490132	0000678	
37	0.000192	0.000165	7.277688E-5	-6.465276E-5	T	29549	2017.09.19 14:40:06.220490132	0000678	
37	0.000196	0.000175	6.769485E-5	-5.571385E-5	T	29549	2017.09.19 14:40:06.230490132	0000678	
37	0.000201	0.000157	0.000101	-7.469523E-5	T	29549	2017.09.19 14:40:06.240490132	0000678	
38	0.000167	0.000138	9.228258E-5	-2.150531E-5	T	29552	2017.09.19 14:40:06.350577632	0000678	
38	0.000169	0.000132	8.216854E-5	-6.442128E-5	T	29552	2017.09.19 14:40:06.360577632	0000678	
38	0.000174	0.000147	8.207909E-5	-4.553613E-5	T	29552	2017.09.19 14:40:06.370577632	0000678	
38	0.000181	0.000142	8.702898E-5	-6.952329E-5	T	29552	2017.09.19 14:40:06.380577632	0000678	
38	0.000197	0.000165	7.773595E-5	-7.467309E-5	T	29552	2017.09.19 14:40:06.390577632	0000678	
38	0.000198	0.000151	9.686444E-5	-8.363752E-5	T	29552	2017.09.19 14:40:06.400577632	0000678	
38	0.000197	0.000170	7.773730E-5	-5.971445E-5	T	29552	2017.09.19 14:40:06.410577632	0000678	
38	0.000191	0.000165	7.781296E-5	-5.567389E-5	T	29552	2017.09.19 14:40:06.420577632	0000678	
38	0.000217	0.000179	9.154812E-5	-7.984503E-5	T	29552	2017.09.19 14:40:06.430577632	0000678	
38	0.000195	0.000180	6.774456E-5	-3.174744E-5	T	29552	2017.09.19 14:40:06.440577632	0000678	
39	0.000181	0.000165	6.389107E-5	-3.661658E-5	T	29557	2017.09.19 14:40:06.550665132	0000678	
39	0.000188	0.000165	7.283362E-5	-5.065335E-5	T	29557	2017.09.19 14:40:06.560665132	0000678	
39	0.000206	0.000185	8.164753E-5	-4.084589E-5	T	29557	2017.09.19 14:40:06.570665132	0000678	
39	0.000213	0.000190	8.656742E-5	-4.590717E-5	T	29557	2017.09.19 14:40:06.580665132	0000678	
39	0.000179	0.000162	6.793832E-5	-3.660060E-5	T	29557	2017.09.19 14:40:06.590665132	0000678	
39	0.000200	0.000156	8.678551E-5	-8.863654E-5	T	29557	2017.09.19 14:40:06.600665132	0000678	
39	0.000197	0.000176	7.773459E-5	-4.575577E-5	T	29557	2017.09.19 14:40:06.610665132	0000678	
39	0.000210	0.000176	9.163621E-5	-6.981287E-5	T	29557	2017.09.19 14:40:06.620665132	0000678	
39	0.000167	0.000137	5.405051E-5	-7.934519E-5	T	29557	2017.09.19 14:40:06.630665132	0000678	
39	0.000199	0.000176	8.679062E-5	-3.179370E-5	T	29557	2017.09.19 14:40:06.640665132	0000678	
40	0.000192	0.000165	7.779675E-5	-5.967372E-5	T	29536	2017.09.19 14:40:06.750752632	0000678	
40	0.000185	0.000162	7.790511E-5	-4.464176E-5	T	29536	2017.09.19 14:40:06.760752632	0000678	
40	0.000194	0.000171	9.197127E-5	-1.774976E-6	T	29536	2017.09.19 14:40:06.770752632	0000678	
40	0.000198	0.000162	9.684281E-5	-5.971999E-5	T	29536	2017.09.19 14:40:06.780752632	0000678	
40	0.000183	0.000162	7.794158E-5	-3.564214E-5	T	29536	2017.09.19 14:40:06.790752632	0000678	
40	0.000165	0.000138	8.220636E-5	-4.046302E-5	T	29536	2017.09.19 14:40:06.800752632	0000678	
40	0.000206	0.000180	9.170619E-5	-4.084666E-5	T	29536	2017.09.19 14:40:06.810752632	0000678	
40	0.000177	0.000157	8.209799E-5	-1.161901E-5	T	29536	2017.09.19 14:40:06.820752632	0000678	
40	0.000163	0.000142	6.814802E-5	-4.044565E-5	T	29536	2017.09.19 14:40:06.830752632	0000678	
40	0.000191	0.000157	9.694279E-5	-4.967967E-5	T	29536	2017.09.19 14:40:06.840752632	0000678	
41	0.000220	0.000190	9.149002E-5	-6.492712E-5	T	29564	2017.09.19 14:40:06.950840132	0000678	
41	0.000194	0.000165	7.777648E-5	-6.467351E-5	T	29564	2017.09.19 14:40:06.960840132	0000678	
41	0.000217	0.000185	9.656934E-5	-5.990735E-5	T	29564	2017.09.19 14:40:06.970840132	0000678	
41	0.000188	0.000161	7.282444E-5	-6.462018E-5	T	29564	2017.09.19 14:40:06.980840132	0000678	
41	0.000179	0.000157	7.296090E-5	-4.558024E-5	T	29564	2017.09.19 14:40:06.990840132	0000678	
41	0.000187	0.000166	8.193018E-5	-2.669170E-5	T	29564	2017.09.19 14:40:07.000840132	0000678	
41	0.000174	0.000152	7.302035E-5	-4.553951E-5	T	29564	2017.09.19 14:40:07.010840132	0000678	
41	0.000212	0.000185	8.657013E-5	-5.986585E-5	T	29564	2017.09.19 14:40:07.020840132	0000678	
41	0.000174	0.000133	0.000101	-5.050072E-5	T	29564	2017.09.19 14:40:07.030840132	0000678	
41	0.000197	0.000165	7.271608E-5	-7.965213E-5	T	29564	2017.09.19 14:40:07.040840132	0000678	
42	0.000181	0.000157	7.796456E-5	-4.460103E-5	T	29541	2017.09.19 14:40:07.150927632	0000678	
42	0.000164	0.000133	8.726542E-5	-4.044304E-5	T	29541	2017.09.19 14:40:07.160927632	0000678	
42	0.000186	0.000166	7.789402E-5	-3.567472E-5	T	29541	2017.09.19 14:40:07.170927632	0000678	
42	0.000213	0.000179	6.749733E-5	-9.274489E-5	T	29541	2017.09.19 14:40:07.180927632	0000678	
42	0.000181	0.000166	7.301195E-5	-6.655185E-6	T	29541	2017.09.19 14:40:07.190927632	0000678	
42	0.000193	0.000171	7.779809E-5	-4.471508E-5	T	29541	2017.09.19 14:40:07.200927632	0000678	
42	0.000178	0.000157	7.802130E-5	-3.060162E-5	T	29541	2017.09.19 14:40:07.210927632	0000678	
42	0.000204	0.000190	7.266580E-5	-2.185007E-5	T	29541	2017.09.19 14:40:07.220927632	0000678	
42	0.000162	0.000138	7.319086E-5	-4.442550E-5	T	29541	2017.09.19 14:40:07.230927632	0000678	
42	0.000208	0.000189	6.351249E-5	-5.981113E-5	T	29541	2017.09.19 14:40:07.240927632	0000678	
43	0.000202	0.000185	7.770864E-5	-2.582992E-5	T	29545	2017.09.19 14:40:07.351015132	0000678	
43	0.000189	0.000170	6.377893E-5	-4.965677E-5	T	29545	2017.09.19 14:40:07.361015132	0000678	
43	0.000205	0.000185	7.763163E-5	-4.482913E-5	T	29545	2017.09.19 14:40:07.371015132	0000678	
43	0.000198	0.000176	8.175454E-5	-4.077258E-5	T	29545	2017.09.19 14:40:07.381015132	0000678	
43	0.000204	0.000190	7.268606E-5	-1.685028E-5	T	29545	2017.09.19 14:40:07.391015132	0000678	
43	0.000179	0.000166	6.393566E-5	-2.561704E-5	T	29545	2017.09.19 14:40:07.401015132	0000678	
43	0.000231	0.000214	7.730303E-5	-4.106554E-5	T	29545	2017.09.19 14:40:07.411015132	0000678	
43	0.000177	0.000147	8.204261E-5	-5.453575E-5	T	29545	2017.09.19 14:40:07.421015132	0000678	
43	0.000202	0.000185	7.770864E-5	-2.582992E-5	T	29545	2017.09.19 14:40:07.431015132	0000678	
43	0.000176	0.000152	8.711652E-5	-2.159861E-5	T	29545	2017.09.19 14:40:07.441015132	0000678	
44	0.000178	0.000162	6.796264E-5	-3.060085E-5	T	29544	2017.09.19 14:40:07.551102632	0000678	
44	0.000192	0.000171	8.693113E-5	-1.175381E-5	T	29544	2017.09.19 14:40:07.561102632	0000678	
44	0.000188	0.000166	8.189371E-5	-3.569132E-5	T	29544	2017.09.19 14:40:07.571102632	0000678	
44	0.000182	0.000157	8.196424E-5	-4.461763E-5	T	29544	2017.09.19 14:40:07.581102632	0000678	
44	0.000201	0.000179	6.763108E-5	-5.974627E-5	T	29544	2017.09.19 14:40:07.591102632	0000678	
44	0.000195	0.000166	9.185644E-5	-4.473245E-5	T	29544	2017.09.19 14:40:07.601102632	0000678	
44	0.000190	0.000171	7.785484E-5	-3.071566E-5	T	29544	2017.09.19 14:40:07.611102632	0000678	
44	0.000182	0.000143	0.000106	-3.560356E-5	T	29544	2017.09.19 14:40:07.621102632	0000678	
44	0.000164	0.000138	7.819047E-5	-4.444625E-5	T	29544	2017.09.19 14:40:07.631102632	0000678	
44	0.000176	0.000152	7.802401E-5	-4.456030E-5	T	29544	2017.09.19 14:40:07.641102632	0000678	
45	0.000191	0.000171	7.783052E-5	-3.671541E-5	T	29550	2017.09.19 14:40:07.751190132	0000678	
45	0.000188	0.000166	8.188965E-5	-3.669128E-5	T	29550	2017.09.19 14:40:07.761190132	0000678	
45	0.000236	0.000208	7.720442E-5	-8.002318E-5	T	29550	2017.09.19 14:40:07.771190132	0000678	
45	0.000146	0.000127	5.932708E-5	-4.028610E-5	T	29550	2017.09.19 14:40:07.781190132	0000678	
45	0.000202	0.000175	7.765758E-5	-6.475497E-5	T	29550	2017.09.19 14:40:07.791190132	0000678	
45	0.000176	0.000152	7.801995E-5	-4.556026E-5	T	29550	2017.09.19 14:40:07.801190132	0000678	
45	0.000161	0.000133	8.226581E-5	-4.042229E-5	T	29550	2017.09.19 14:40:07.811190132	0000678	
45	0.000213	0.000194	6.746894E-5	-5.586863E-5	T	29550	2017.09.19 14:40:07.821190132	0000678	
45	0.000191	0.000171	7.279444E-5	-4.569429E-5	T	29550	2017.09.19 14:40:07.831190132	0000678	
45	0.000204	0.000180	8.166645E-5	-5.080474E-5	T	29550	2017.09.19 14:40:07.841190132	0000678	
46	0.000198	0.000179	6.766755E-5	-5.074664E-5	T	29552	2017.09.19 14:40:07.951277632	0000678	
46	0.000188	0.000156	6.782349E-5	-7.955807E-5	T	29552	2017.09.19 14:40:07.961277632	0000678	
46	0.000182	0.000161	6.788158E-5	-5.060001E-5	T	29552	2017.09.19 14:40:07.971277632	0000678	
46	0.000192	0.000171	7.781431E-5	-4.071525E-5	T	29552	2017.09.19 14:40:07.981277632	0000678	
46	0.000187	0.000166	7.787376E-5	-4.067451E-5	T	29552	2017.09.19 14:40:07.991277632	0000678	
46	0.000187	0.000165	4.873824E-5	-7.455274E-5	T	29552	2017.09.19 14:40:08.001277632	0000678	
46	0.000163	0.000147	6.817747E-5	-2.147903E-5	T	29552	2017.09.19 14:40:08.011277632	0000678	
46	0.000207	0.000170	8.163971E-5	-8.373005E-5	T	29552	2017.09.19 14:40:08.021277632	0000678	
46	0.000194	0.000176	7.275525E-5	-4.073523E-5	T	29552	2017.09.19 14:40:08.031277632	0000678	
46	0.000190	0.000157	8.688279E-5	-6.463754E-5	T	29552	2017.09.19 14:40:08.041277632	0000678	
47	0.000194	0.000176	8.187208E-5	-1.177379E-5	T	29533	2017.09.19 14:40:08.151365132	0000678	
47	0.000193	0.000162	9.691982E-5	-4.072078E-5	T	29533	2017.09.19 14:40:08.161365132	0000678	
47	0.000187	0.000162	8.190479E-5	-4.465836E-5	T	29533	2017.09.19 14:40:08.171365132	0000678	
47	0.000206	0.000185	7.761137E-5	-4.982892E-5	T	29533	2017.09.19 14:40:08.181365132	0000678	
47	0.000195	0.000165	7.776027E-5	-6.867334E-5	T	29533	2017.09.19 14:40:08.191365132	0000678	
47	0.000175	0.000161	5.896335E-5	-3.056350E-5	T	29533	2017.09.19 14:40:08.201365132	0000678	
47	0.000173	0.000151	5.896471E-5	-5.948082E-5	T	29533	2017.09.19 14:40:08.211365132	0000678	
47	0.000194	0.000166	9.187265E-5	-4.073261E-5	T	29533	2017.09.19 14:40:08.221365132	0000678	
47	0.000170	0.000152	6.806127E-5	-3.551917E-5	T	29533	2017.09.19 14:40:08.231365132	0000678	
47	0.000178	0.000146	7.800240E-5	-6.451873E-5	T	29533	2017.09.19 14:40:08.241365132	0000678	
48	0.000198	0.000180	7.774783E-5	-3.078898E-5	T	29538	2017.09.19 14:40:08.351452632	0000678	
48	0.000202	0.000184	6.763242E-5	-4.478763E-5	T	29538	2017.09.19 14:40:08.361452632	0000678	
48	0.000224	0.000198	7.736790E-5	-6.894217E-5	T	29538	2017.09.19 14:40:08.371452632	0000678	
48	0.000204	0.000185	8.168806E-5	-3.084631E-5	T	29538	2017.09.19 14:40:08.381452632	0000678	
48	0.000182	0.000166	6.789481E-5	-3.563322E-5	T	29538	2017.09.19 14:40:08.391452632	0000678	
48	0.000181	0.000147	8.702195E-5	-5.955629E-5	T	29538	2017.09.19 14:40:08.401452632	0000678	
48	0.000187	0.000171	7.289171E-5	-2.169529E-5	T	29538	2017.09.19 14:40:08.411452632	0000678	
48	0.000173	0.000147	8.715975E-5	-2.555771E-5	T	29538	2017.09.19 14:40:08.421452632	0000678	
48	0.000190	0.000170	5.873880E-5	-5.963560E-5	T	29538	2017.09.19 14:40:08.431452632	0000678	
48	0.000181	0.000156	7.292442E-5	-5.457986E-5	T	29538	2017.09.19 14:40:08.441452632	0000678	
49	0.000203	0.000171	9.173619E-5	-5.977255E-5	T	29544	2017.09.19 14:40:08.551540132	0000678	
49	0.000187	0.000161	7.284470E-5	-5.962038E-5	T	29544	2017.09.19 14:40:08.561540132	0000678	
49	0.000180	0.000151	7.796321E-5	-5.955967E-5	T	29544	2017.09.19 14:40:08.571540132	0000678	
49	0.000197	0.000179	6.769187E-5	-4.474690E-5	T	29544	2017.09.19 14:40:08.581540132	0000678	
49	0.000184	0.000152	9.200264E-5	-4.961819E-5	T	29544	2017.09.19 14:40:08.591540132	0000678	
49	0.000182	0.000162	7.292171E-5	-4.062118E-5	T	29544	2017.09.19 14:40:08.601540132	0000678	
49	0.000184	0.000151	7.792673E-5	-6.855930E-5	T	29544	2017.09.19 14:40:08.611540132	0000678	
49	0.000201	0.000175	7.265798E-5	-6.473422E-5	T	29544	2017.09.19 14:40:08.621540132	0000678	
49	0.000163	0.000143	7.318815E-5	-3.046682E-5	T	29544	2017.09.19 14:40:08.631540132	0000678	
49	0.000218	0.000199	8.655768E-5	-2.198149E-5	T	29544	2017.09.19 14:40:08.641540132	0000678	
50	0.000198	0.000171	9.181320E-5	-4.077335E-5	T	29548	2017.09.19 14:40:08.751627632	0000678	
50	0.000190	0.000161	7.782404E-5	-6.464093E-5	T	29548	2017.09.19 14:40:08.761627632	0000678	
50	0.000208	0.000175	7.759679E-5	-7.975435E-5	T	29548	2017.09.19 14:40:08.771627632	0000678	
50	0.000167	0.000142	6.808722E-5	-5.544502E-5	T	29548	2017.09.19 14:40:08.781627632	0000678	
50	0.000167	0.000137	7.313007E-5	-5.942487E-5	T	29548	2017.09.19 14:40:08.791627632	0000678	
50	0.000191	0.000171	8.187073E-5	-2.673243E-5	T	29548	2017.09.19 14:40:08.801627632	0000678	
50	0.000204	0.000184	5.855207E-5	-6.474944E-5	T	29548	2017.09.19 14:40:08.811627632	0000678	
50	0.000209	0.000189	7.254826E-5	-5.084886E-5	T	29548	2017.09.19 14:40:08.821627632	0000678	
50	0.000179	0.000143	9.712546E-5	-4.556579E-5	T	29548	2017.09.19 14:40:08.831627632	0000678	
50	0.000151	0.000133	6.850199E-5	1.763339E-5	T	29548	2017.09.19 14:40:08.841627632	0000678	
51	0.000218	0.000204	7.245881E-5	-3.196370E-5	T	29553	2017.09.19 14:40:08.951715132	0000678	
51	0.000192	0.000175	6.775565E-5	-4.071448E-5	T	29553	2017.09.19 14:40:08.961715132	0000678	
51	0.000193	0.000171	7.779404E-5	-4.571504E-5	T	29553	2017.09.19 14:40:08.971715132	0000678	
51	0.000183	0.000166	6.789076E-5	-3.663318E-5	T	29553	2017.09.19 14:40:08.981715132	0000678	
51	0.000205	0.000180	8.668632E-5	-4.582570E-5	T	29553	2017.09.19 14:40:08.991715132	0000678	
51	0.000168	0.000137	7.814588E-5	-5.544579E-5	T	29553	2017.09.19 14:40:09.001715132	0000678	
51	0.000192	0.000179	5.872501E-5	-3.670988E-5	T	29553	2017.09.19 14:40:09.011715132	0000678	
51	0.000197	0.000180	7.272390E-5	-3.676798E-5	T	29553	2017.09.19 14:40:09.021715132	0000678	
51	0.000200	0.000170	7.769677E-5	-6.971403E-5	T	29553	2017.09.19 14:40:09.031715132	0000678	
51	0.000207	0.000185	7.760732E-5	-5.082888E-5	T	29553	2017.09.19 14:40:09.041715132	0000678	
52	0.000192	0.000165	7.779675E-5	-5.967372E-5	T	29551	2017.09.19 14:40:09.151802632	0000678	
52	0.000154	0.000118	7.835558E-5	-5.929084E-5	T	29551	2017.09.19 14:40:09.161802632	0000678	
52	0.000196	0.000175	6.367895E-5	-5.969708E-5	T	29551	2017.09.19 14:40:09.171802632	0000678	
52	0.000175	0.000157	7.813884E-5	-1.602828E-6	T	29551	2017.09.19 14:40:09.181802632	0000678	
52	0.000174	0.000147	9.227284E-5	2.420368E-6	T	29551	2017.09.19 14:40:09.191802632	0000678	
52	0.000198	0.000180	8.188126E-5	2.193040E-6	T	29551	2017.09.19 14:40:09.201802632	0000678	
52	0.000166	0.000152	6.821529E-5	2.479237E-6	T	29551	2017.09.19 14:40:09.211802632	0000678	
52	0.000222	0.000194	8.141109E-5	-6.992615E-5	T	29551	2017.09.19 14:40:09.221802632	0000678	
52	0.000167	0.000143	7.816344E-5	-3.648732E-5	T	29551	2017.09.19 14:40:09.231802632	0000678	
52	0.000192	0.000157	0.000101	-4.569644E-5	T	29551	2017.09.19 14:40:09.241802632	0000678	
53	0.000192	0.000166	8.685683E-5	-4.471170E-5	T	29542	2017.09.19 14:40:09.351890132	0000678	
53	0.000203	0.000180	9.180346E-5	-1.684767E-5	T	29542	2017.09.19 14:40:09.361890132	0000678	
53	0.000180	0.000162	7.803886E-5	-1.164314E-5	T	29542	2017.09.19 14:40:09.371890132	0000678	
53	0.000184	0.000162	7.792132E-5	-4.064193E-5	T	29542	2017.09.19 14:40:09.381890132	0000678	
53	0.000187	0.000171	7.289171E-5	-2.169529E-5	T	29542	2017.09.19 14:40:09.391890132	0000678	
53	0.000208	0.000184	7.759110E-5	-5.482871E-5	T	29542	2017.09.19 14:40:09.401890132	0000678	
53	0.000196	0.000179	6.770809E-5	-4.074706E-5	T	29542	2017.09.19 14:40:09.411890132	0000678	
53	0.000203	0.000176	8.167753E-5	-5.977178E-5	T	29542	2017.09.19 14:40:09.421890132	0000678	
53	0.000190	0.000166	8.185723E-5	-4.469095E-5	T	29542	2017.09.19 14:40:09.431890132	0000678	
53	0.000183	0.000152	9.202290E-5	-4.461840E-5	T	29542	2017.09.19 14:40:09.441890132	0000678	
54	0.000180	0.000165	5.887526E-5	-4.059566E-5	T	29540	2017.09.19 14:40:09.551977632	0000678	
54	0.000153	0.000124	8.239309E-5	-3.534918E-5	T	29540	2017.09.19 14:40:09.561977632	0000678	
54	0.000170	0.000147	8.216015E-5	-2.553696E-5	T	29540	2017.09.19 14:40:09.571977632	0000678	
54	0.000190	0.000161	7.280823E-5	-6.862001E-5	T	29540	2017.09.19 14:40:09.581977632	0000678	
54	0.000177	0.000152	7.800374E-5	-4.956009E-5	T	29540	2017.09.19 14:40:09.591977632	0000678	
54	0.000205	0.000171	9.169972E-5	-6.877218E-5	T	29540	2017.09.19 14:40:09.601977632	0000678	
54	0.000172	0.000151	6.802480E-5	-4.451880E-5	T	29540	2017.09.19 14:40:09.611977632	0000678	
54	0.000170	0.000152	7.310141E-5	-2.554034E-5	T	29540	2017.09.19 14:40:09.621977632	0000678	
54	0.000187	0.000166	8.191397E-5	-3.069153E-5	T	29540	2017.09.19 14:40:09.631977632	0000678	
54	0.000186	0.000171	7.291197E-5	-1.669550E-5	T	29540	2017.09.19 14:40:09.641977632	0000678	
55	0.000224	0.000198	8.138380E-5	-6.495894E-5	T	29542	2017.09.19 14:40:09.752065132	0000678	
55	0.000184	0.000156	7.288389E-5	-6.457944E-5	T	29542	2017.09.19 14:40:09.762065132	0000678	
55	0.000201	0.000180	7.769108E-5	-4.478840E-5	T	29542	2017.09.19 14:40:09.772065132	0000678	
55	0.000173	0.000152	7.304061E-5	-4.053972E-5	T	29542	2017.09.19 14:40:09.782065132	0000678	
55	0.000152	0.000133	6.830745E-5	-3.036460E-5	T	29542	2017.09.19 14:40:09.792065132	0000678	
55	0.000218	0.000195	8.651202E-5	-4.494794E-5	T	29542	2017.09.19 14:40:09.802065132	0000678	
55	0.000169	0.000137	7.812967E-5	-5.944562E-5	T	29542	2017.09.19 14:40:09.812065132	0000678	
55	0.000174	0.000146	6.398729E-5	-6.846046E-5	T	29542	2017.09.19 14:40:09.822065132	0000678	
55	0.000223	0.000194	8.139488E-5	-7.392598E-5	T	29542	2017.09.19 14:40:09.832065132	0000678	
55	0.000198	0.000176	7.771838E-5	-4.975560E-5	T	29542	2017.09.19 14:40:09.842065132	0000678	
56	0.000169	0.000143	7.813102E-5	-4.448698E-5	T	29547	2017.09.19 14:40:09.952152632	0000678	
56	0.000190	0.000176	6.781644E-5	-2.571510E-5	T	29547	2017.09.19 14:40:09.962152632	0000678	
56	0.000179	0.000161	6.390621E-5	-4.458366E-5	T	29547	2017.09.19 14:40:09.972152632	0000678	
56	0.000194	0.000171	7.777783E-5	-4.971487E-5	T	29547	2017.09.19 14:40:09.982152632	0000678	
56	0.000212	0.000185	8.657013E-5	-5.986585E-5	T	29547	2017.09.19 14:40:09.992152632	0000678	
56	0.000217	0.000175	8.152352E-5	-9.777020E-5	T	29547	2017.09.19 14:40:10.002152632	0000678	
56	0.000176	0.000157	7.809831E-5	-1.160241E-5	T	29547	2017.09.19 14:40:10.012152632	0000678	
56	0.000175	0.000152	8.208043E-5	-3.057748E-5	T	29547	2017.09.19 14:40:10.022152632	0000678	
56	0.000192	0.000171	7.781431E-5	-4.071525E-5	T	29547	2017.09.19 14:40:10.032152632	0000678	
56	0.000178	0.000161	6.392242E-5	-4.058383E-5	T	29547	2017.09.19 14:40:10.042152632	0000678	
57	0.000186	0.000157	8.190344E-5	-5.961700E-5	T	29540	2017.09.19 14:40:10.152240132	0000678	
57	0.000173	0.000147	8.715975E-5	-2.555771E-5	T	29540	2017.09.19 14:40:10.162240132	0000678	
57	0.000214	0.000190	8.655121E-5	-4.990700E-5	T	29540	2017.09.19 14:40:10.172240132	0000678	
57	0.000188	0.000166	7.785755E-5	-4.467435E-5	T	29540	2017.09.19 14:40:10.182240132	0000678	
57	0.000203	0.000185	7.263203E-5	-4.480838E-5	T	29540	2017.09.19 14:40:10.192240132	0000678	
57	0.000216	0.000199	7.750165E-5	-3.594355E-5	T	29540	2017.09.19 14:40:10.202240132	0000678	
57	0.000153	0.000133	7.334353E-5	-2.138573E-5	T	29540	2017.09.19 14:40:10.212240132	0000678	
57	0.000220	0.000194	7.741546E-5	-6.890959E-5	T	29540	2017.09.19 14:40:10.222240132	0000678	
57	0.000178	0.000147	8.706248E-5	-4.955671E-5	T	29540	2017.09.19 14:40:10.232240132	0000678	
57	0.000183	0.000156	7.290416E-5	-5.957965E-5	T	29540	2017.09.19 14:40:10.242240132	0000678	
58	0.000188	0.000156	7.284336E-5	-7.457903E-5	T	29553	2017.09.19 14:40:10.352327632	0000678	
58	0.000195	0.000171	8.179373E-5	-4.573164E-5	T	29553	2017.09.19 14:40:10.362327632	0000678	
58	0.000188	0.000156	7.786323E-5	-6.959999E-5	T	29553	2017.09.19 14:40:10.372327632	0000678	
58	0.000196	0.000165	6.370058E-5	-8.361462E-5	T	29553	2017.09.19 14:40:10.382327632	0000678	
58	0.000205	0.000180	8.164619E-5	-5.580454E-5	T	29553	2017.09.19 14:40:10.392327632	0000678	
58	0.000207	0.000184	7.257123E-5	-5.980775E-5	T	29553	2017.09.19 14:40:10.402327632	0000678	
58	0.000164	0.000132	7.316925E-5	-6.438393E-5	T	29553	2017.09.19 14:40:10.412327632	0000678	
58	0.000177	0.000157	7.298116E-5	-4.058045E-5	T	29553	2017.09.19 14:40:10.422327632	0000678	
58	0.000197	0.000176	7.773459E-5	-4.575577E-5	T	29553	2017.09.19 14:40:10.432327632	0000678	
58	0.000199	0.000165	5.866045E-5	-9.359345E-5	T	29553	2017.09.19 14:40:10.442327632	0000678	
59	0.000184	0.000165	6.785833E-5	-4.463285E-5	T	29547	2017.09.19 14:40:10.552415132	0000678	
59	0.000197	0.000171	8.679738E-5	-4.475243E-5	T	29547	2017.09.19 14:40:10.562415132	0000678	
59	0.000168	0.000152	6.810180E-5	-2.551959E-5	T	29547	2017.09.19 14:40:10.572415132	0000678	
59	0.000191	0.000171	7.279849E-5	-4.469433E-5	T	29547	2017.09.19 14:40:10.582415132	0000678	
59	0.000203	0.000180	8.167050E-5	-4.980479E-5	T	29547	2017.09.19 14:40:10.592415132	0000678	
59	0.000198	0.000170	7.771703E-5	-6.471424E-5	T	29547	2017.09.19 14:40:10.602415132	0000678	
59	0.000201	0.000179	6.763108E-5	-5.974627E-5	T	29547	2017.09.19 14:40:10.612415132	0000678	
59	0.000185	0.000166	7.287415E-5	-4.065376E-5	T	29547	2017.09.19 14:40:10.622415132	0000678	
59	0.000195	0.000170	7.775756E-5	-5.471466E-5	T	29547	2017.09.19 14:40:10.632415132	0000678	
59	0.000203	0.000176	9.173754E-5	-4.481391E-5	T	29547	2017.09.19 14:40:10.642415132	0000678	
60	0.000194	0.000165	7.275661E-5	-6.965255E-5	T	29550	2017.09.19 14:40:10.752502632	0000678	
60	0.000177	0.000152	8.709625E-5	-2.659840E-5	T	29550	2017.09.19 14:40:10.762502632	0000678	
60	0.000194	0.000146	8.186428E-5	-9.853391E-5	T	29550	2017.09.19 14:40:10.772502632	0000678	
60	0.000200	0.000170	6.765703E-5	-7.967212E-5	T	29550	2017.09.19 14:40:10.782502632	0000678	
60	0.000189	0.000165	6.377759E-5	-6.461541E-5	T	29550	2017.09.19 14:40:10.792502632	0000678	
60	0.000193	0.000170	7.275391E-5	-5.569387E-5	T	29550	2017.09.19 14:40:10.802502632	0000678	
60	0.000175	0.000151	6.396432E-5	-5.950157E-5	T	29550	2017.09.19 14:40:10.812502632	0000678	
60	0.000200	0.000170	8.171672E-5	-6.473084E-5	T	29550	2017.09.19 14:40:10.822502632	0000678	
60	0.000206	0.000180	8.666606E-5	-5.082550E-5	T	29550	2017.09.19 14:40:10.832502632	0000678	
60	0.000207	0.000184	7.257123E-5	-5.980775E-5	T	29550	2017.09.19 14:40:10.842502632	0000678	
61	0.000191	0.000175	5.871988E-5	-4.967675E-5	T	29546	2017.09.19 14:40:10.952590132	0000678	
61	0.000226	0.000204	9.144109E-5	-3.604238E-5	T	29546	2017.09.19 14:40:10.962590132	0000678	
61	0.000177	0.000152	7.800374E-5	-4.956009E-5	T	29546	2017.09.19 14:40:10.972590132	0000678	
61	0.000177	0.000151	7.298387E-5	-5.453913E-5	T	29546	2017.09.19 14:40:10.982590132	0000678	
61	0.000210	0.000190	8.160834E-5	-3.588683E-5	T	29546	2017.09.19 14:40:10.992590132	0000678	
61	0.000168	0.000137	7.310980E-5	-6.442466E-5	T	29546	2017.09.19 14:40:11.002590132	0000678	
61	0.000190	0.000180	5.880607E-5	-1.671072E-5	T	29546	2017.09.19 14:40:11.012590132	0000678	
61	0.000184	0.000151	8.194263E-5	-6.457606E-5	T	29546	2017.09.19 14:40:11.022590132	0000678	
61	0.000188	0.000162	8.188452E-5	-4.965815E-5	T	29546	2017.09.19 14:40:11.032590132	0000678	
61	0.000190	0.000171	8.198827E-5	2.266357E-6	T	29546	2017.09.19 14:40:11.042590132	0000678	
62	0.000185	0.000156	7.790376E-5	-5.960040E-5	T	29549	2017.09.19 14:40:11.152677632	0000678	
62	0.000210	0.000195	7.256582E-5	-3.189038E-5	T	29549	2017.09.19 14:40:11.162677632	0000678	
62	0.000167	0.000133	8.722489E-5	-5.044262E-5	T	29549	2017.09.19 14:40:11.172677632	0000678	
62	0.000203	0.000170	7.264042E-5	-8.369270E-5	T	29549	2017.09.19 14:40:11.182677632	0000678	
62	0.000208	0.000175	7.759679E-5	-7.975435E-5	T	29549	2017.09.19 14:40:11.192677632	0000678	
62	0.000190	0.000175	5.371622E-5	-5.065596E-5	T	29549	2017.09.19 14:40:11.202677632	0000678	
62	0.000202	0.000166	9.677499E-5	-6.475236E-5	T	29549	2017.09.19 14:40:11.212677632	0000678	
62	0.000219	0.000194	7.743167E-5	-6.490975E-5	T	29549	2017.09.19 14:40:11.222677632	0000678	
62	0.000161	0.000146	5.913765E-5	-3.144126E-5	T	29549	2017.09.19 14:40:11.232677632	0000678	
62	0.000232	0.000214	7.728277E-5	-4.606533E-5	T	29549	2017.09.19 14:40:11.242677632	0000678	
63	0.000198	0.000170	7.771703E-5	-6.471424E-5	T	29552	2017.09.19 14:40:11.352765132	0000678	
63	0.000162	0.000133	7.822560E-5	-5.040527E-5	T	29552	2017.09.19 14:40:11.362765132	0000678	
63	0.000202	0.000175	7.765758E-5	-6.475497E-5	T	29552	2017.09.19 14:40:11.372765132	0000678	
63	0.000199	0.000176	8.173428E-5	-4.577237E-5	T	29552	2017.09.19 14:40:11.382765132	0000678	
63	0.000182	0.000161	6.788158E-5	-5.060001E-5	T	29552	2017.09.19 14:40:11.392765132	0000678	
63	0.000151	0.000118	7.335598E-5	-5.927009E-5	T	29552	2017.09.19 14:40:11.402765132	0000678	
63	0.000180	0.000146	6.794239E-5	-7.947660E-5	T	29552	2017.09.19 14:40:11.412765132	0000678	
63	0.000191	0.000152	0.000101	-5.565529E-5	T	29552	2017.09.19 14:40:11.422765132	0000678	
63	0.000159	0.000132	6.820612E-5	-5.536356E-5	T	29552	2017.09.19 14:40:11.432765132	0000678	
63	0.000194	0.000162	8.682333E-5	-6.467828E-5	T	29552	2017.09.19 14:40:11.442765132	0000678	
64	0.000203	0.000184	6.359221E-5	-5.477061E-5	T	29536	2017.09.19 14:40:11.552852632	0000678	
64	0.000177	0.000157	7.298116E-5	-4.058045E-5	T	29536	2017.09.19 14:40:11.562852632	0000678	
64	0.000211	0.000175	8.660013E-5	-7.879174E-5	T	29536	2017.09.19 14:40:11.572852632	0000678	
64	0.000183	0.000162	7.794158E-5	-3.564214E-5	T	29536	2017.09.19 14:40:11.582852632	0000678	
64	0.000189	0.000171	7.789131E-5	-2.171604E-5	T	29536	2017.09.19 14:40:11.592852632	0000678	
64	0.000172	0.000157	6.805856E-5	-2.156049E-5	T	29536	2017.09.19 14:40:11.602852632	0000678	
64	0.000197	0.000171	9.691008E-5	-1.679510E-5	T	29536	2017.09.19 14:40:11.612852632	0000678	
64	0.000168	0.000152	6.810180E-5	-2.551959E-5	T	29536	2017.09.19 14:40:11.622852632	0000678	
64	0.000195	0.000179	5.867232E-5	-4.970934E-5	T	29536	2017.09.19 14:40:11.632852632	0000678	
64	0.000190	0.000175	6.377623E-5	-3.569809E-5	T	29536	2017.09.19 14:40:11.642852632	0000678	
65	0.000186	0.000161	7.286092E-5	-5.562055E-5	T	29552	2017.09.19 14:40:11.752940132	0000678	
65	0.000192	0.000162	8.685981E-5	-5.567865E-5	T	29552	2017.09.19 14:40:11.762940132	0000678	
65	0.000178	0.000147	9.717518E-5	-2.159938E-5	T	29552	2017.09.19 14:40:11.772940132	0000678	
65	0.000206	0.000175	7.761705E-5	-7.475456E-5	T	29552	2017.09.19 14:40:11.782940132	0000678	
65	0.000189	0.000162	8.186021E-5	-5.565790E-5	T	29552	2017.09.19 14:40:11.792940132	0000678	
65	0.000192	0.000170	6.775430E-5	-5.567312E-5	T	29552	2017.09.19 14:40:11.802940132	0000678	
65	0.000176	0.000157	7.301764E-5	-3.158082E-5	T	29552	2017.09.19 14:40:11.812940132	0000678	
65	0.000166	0.000146	6.408051E-5	-4.546142E-5	T	29552	2017.09.19 14:40:11.822940132	0000678	
65	0.000189	0.000162	8.186021E-5	-5.565790E-5	T	29552	2017.09.19 14:40:11.832940132	0000678	
65	0.000191	0.000171	7.279444E-5	-4.569429E-5	T	29552	2017.09.19 14:40:11.842940132	0000678	
66	0.000191	0.000166	8.689331E-5	-3.571207E-5	T	29544	2017.09.19 14:40:11.953027632	0000678	
66	0.000166	0.000132	6.813317E-5	-7.336281E-5	T	29544	2017.09.19 14:40:11.963027632	0000678	
66	0.000200	0.000179	7.267121E-5	-4.976744E-5	T	29544	2017.09.19 14:40:11.973027632	0000678	
66	0.000181	0.000162	7.294198E-5	-3.562139E-5	T	29544	2017.09.19 14:40:11.983027632	0000678	
66	0.000178	0.000152	8.202369E-5	-4.457690E-5	T	29544	2017.09.19 14:40:11.993027632	0000678	
66	0.000178	0.000162	6.796264E-5	-3.060085E-5	T	29544	2017.09.19 14:40:12.003027632	0000678	
66	0.000167	0.000147	7.314059E-5	-3.049940E-5	T	29544	2017.09.19 14:40:12.013027632	0000678	
66	0.000200	0.000180	8.174751E-5	-3.080558E-5	T	29544	2017.09.19 14:40:12.023027632	0000678	
66	0.000213	0.000195	8.156916E-5	-3.092778E-5	T	29544	2017.09.19 14:40:12.033027632	0000678	
66	0.000167	0.000146	5.402455E-5	-5.941934E-5	T	29544	2017.09.19 14:40:12.043027632	0000678	
67	0.000186	0.000156	7.788350E-5	-6.460019E-5	T	29548	2017.09.19 14:40:12.153115132	0000678	
67	0.000200	0.000176	8.675415E-5	-4.079333E-5	T	29548	2017.09.19 14:40:12.163115132	0000678	
67	0.000172	0.000143	8.210638E-5	-5.050333E-5	T	29548	2017.09.19 14:40:12.173115132	0000678	
67	0.000160	0.000132	6.818991E-5	-5.936339E-5	T	29548	2017.09.19 14:40:12.183115132	0000678	
67	0.000194	0.000156	7.780649E-5	-8.359940E-5	T	29548	2017.09.19 14:40:12.193115132	0000678	
67	0.000207	0.000170	8.163971E-5	-8.373005E-5	T	29548	2017.09.19 14:40:12.203115132	0000678	
67	0.000186	0.000162	7.788079E-5	-5.064151E-5	T	29548	2017.09.19 14:40:12.213115132	0000678	
67	0.000207	0.000175	8.161674E-5	-7.477116E-5	T	29548	2017.09.19 14:40:12.223115132	0000678	
67	0.000191	0.000171	7.279444E-5	-4.569429E-5	T	29548	2017.09.19 14:40:12.233115132	0000678	
67	0.000176	0.000157	7.301764E-5	-3.158082E-5	T	29548	2017.09.19 14:40:12.243115132	0000678	
68	0.000187	0.000157	9.701980E-5	-3.068047E-5	T	29543	2017.09.19 14:40:12.353202632	0000678	
68	0.000200	0.000171	9.177672E-5	-4.977297E-5	T	29543	2017.09.19 14:40:12.363202632	0000678	
68	0.000202	0.000180	7.767082E-5	-4.978819E-5	T	29543	2017.09.19 14:40:12.373202632	0000678	
68	0.000182	0.000151	6.388731E-5	-7.850078E-5	T	29543	2017.09.19 14:40:12.383202632	0000678	
68	0.000202	0.000175	7.765758E-5	-6.475497E-5	T	29543	2017.09.19 14:40:12.393202632	0000678	
68	0.000207	0.000180	9.674633E-5	-3.086783E-5	T	29543	2017.09.19 14:40:12.403202632	0000678	
68	0.000165	0.000151	5.908225E-5	-3.048203E-5	T	29543	2017.09.19 14:40:12.413202632	0000678	
68	0.000193	0.000171	8.183426E-5	-3.573206E-5	T	29543	2017.09.19 14:40:12.423202632	0000678	
68	0.000218	0.000204	7.758000E-5	-1.985704E-6	T	29543	2017.09.19 14:40:12.433202632	0000678	
68	0.000204	0.000185	8.168806E-5	-3.084631E-5	T	29543	2017.09.19 14:40:12.443202632	0000678	
69	0.000182	0.000165	5.883878E-5	-4.959529E-5	T	29544	2017.09.19 14:40:12.553290132	0000678	
69	0.000215	0.000195	7.749247E-5	-4.991038E-5	T	29544	2017.09.19 14:40:12.563290132	0000678	
69	0.000186	0.000166	7.285794E-5	-4.465360E-5	T	29544	2017.09.19 14:40:12.573290132	0000678	
69	0.000185	0.000171	6.385594E-5	-3.065756E-5	T	29544	2017.09.19 14:40:12.583290132	0000678	
69	0.000188	0.000166	7.785755E-5	-4.467435E-5	T	29544	2017.09.19 14:40:12.593290132	0000678	
69	0.000209	0.000195	7.259013E-5	-2.589063E-5	T	29544	2017.09.19 14:40:12.603290132	0000678	
69	0.000198	0.000180	7.776809E-5	-2.578919E-5	T	29544	2017.09.19 14:40:12.613290132	0000678	
69	0.000196	0.000175	6.769890E-5	-5.471389E-5	T	29544	2017.09.19 14:40:12.623290132	0000678	
69	0.000181	0.000157	8.704085E-5	-2.563917E-5	T	29544	2017.09.19 14:40:12.633290132	0000678	
69	0.000181	0.000162	7.294198E-5	-3.562139E-5	T	29544	2017.09.19 14:40:12.643290132	0000678	
70	0.000188	0.000161	7.786052E-5	-5.564130E-5	T	29554	2017.09.19 14:40:12.753377632	0000678	
70	0.000204	0.000180	8.166645E-5	-5.080474E-5	T	29554	2017.09.19 14:40:12.763377632	0000678	
70	0.000168	0.000142	7.310709E-5	-5.046598E-5	T	29554	2017.09.19 14:40:12.773377632	0000678	
70	0.000197	0.000156	8.680578E-5	-8.363675E-5	T	29554	2017.09.19 14:40:12.783377632	0000678	
70	0.000187	0.000161	7.284470E-5	-5.962038E-5	T	29554	2017.09.19 14:40:12.793377632	0000678	
70	0.000173	0.000152	7.807670E-5	-3.156084E-5	T	29554	2017.09.19 14:40:12.803377632	0000678	
70	0.000213	0.000184	7.249017E-5	-7.980691E-5	T	29554	2017.09.19 14:40:12.813377632	0000678	
70	0.000175	0.000157	6.799777E-5	-3.655986E-5	T	29554	2017.09.19 14:40:12.823377632	0000678	
70	0.000169	0.000147	7.310006E-5	-4.049898E-5	T	29554	2017.09.19 14:40:12.833377632	0000678	
70	0.000193	0.000152	0.000106	-5.567604E-5	T	29554	2017.09.19 14:40:12.843377632	0000678	
71	0.000193	0.000171	7.779809E-5	-4.471508E-5	T	29544	2017.09.19 14:40:12.953465132	0000678	
71	0.000173	0.000157	6.802209E-5	-3.056012E-5	T	29544	2017.09.19 14:40:12.963465132	0000678	
71	0.000205	0.000170	8.165998E-5	-7.873026E-5	T	29544	2017.09.19 14:40:12.973465132	0000678	
71	0.000182	0.000162	7.796185E-5	-3.064235E-5	T	29544	2017.09.19 14:40:12.983465132	0000678	
71	0.000222	0.000204	8.144188E-5	-3.600088E-5	T	29544	2017.09.19 14:40:12.993465132	0000678	
71	0.000190	0.000162	9.192021E-5	-4.070003E-5	T	29544	2017.09.19 14:40:13.003465132	0000678	
71	0.000199	0.000184	6.364895E-5	-4.077119E-5	T	29544	2017.09.19 14:40:13.013465132	0000678	
71	0.000191	0.000166	8.183696E-5	-4.969074E-5	T	29544	2017.09.19 14:40:13.023465132	0000678	
71	0.000189	0.000171	7.789131E-5	-2.171604E-5	T	29544	2017.09.19 14:40:13.033465132	0000678	
71	0.000191	0.000162	9.190400E-5	-4.469986E-5	T	29544	2017.09.19 14:40:13.043465132	0000678	
72	0.000183	0.000161	6.786536E-5	-5.459984E-5	T	29546	2017.09.19 14:40:13.153552632	0000678	
72	0.000180	0.000152	8.703951E-5	-4.059782E-5	T	29546	2017.09.19 14:40:13.163552632	0000678	
72	0.000194	0.000171	8.179778E-5	-4.473168E-5	T	29546	2017.09.19 14:40:13.173552632	0000678	
72	0.000161	0.000138	8.236443E-5	-1.464648E-6	T	29546	2017.09.19 14:40:13.183552632	0000678	
72	0.000196	0.000180	7.274822E-5	-3.076823E-5	T	29546	2017.09.19 14:40:13.193552632	0000678	
72	0.000177	0.000161	6.394269E-5	-3.558404E-5	T	29546	2017.09.19 14:40:13.203552632	0000678	
72	0.000181	0.000157	8.198045E-5	-4.061780E-5	T	29546	2017.09.19 14:40:13.213552632	0000678	
72	0.000194	0.000165	7.777648E-5	-6.467351E-5	T	29546	2017.09.19 14:40:13.223552632	0000678	
72	0.000218	0.000198	7.242504E-5	-5.492201E-5	T	29546	2017.09.19 14:40:13.233552632	0000678	
72	0.000156	0.000128	8.234553E-5	-3.538176E-5	T	29546	2017.09.19 14:40:13.243552632	0000678	
73	0.000198	0.000185	6.770943E-5	-2.578842E-5	T	29544	2017.09.19 14:40:13.353640132	0000678	
73	0.000227	0.000213	6.328793E-5	-4.500727E-5	T	29544	2017.09.19 14:40:13.363640132	0000678	
73	0.000165	0.000143	7.820802E-5	-2.548778E-5	T	29544	2017.09.19 14:40:13.373640132	0000678	
73	0.000181	0.000161	6.388594E-5	-4.958345E-5	T	29544	2017.09.19 14:40:13.383640132	0000678	
73	0.000186	0.000156	7.788350E-5	-6.460019E-5	T	29544	2017.09.19 14:40:13.393640132	0000678	
73	0.000177	0.000161	5.892282E-5	-4.056308E-5	T	29544	2017.09.19 14:40:13.403640132	0000678	
73	0.000180	0.000157	7.798077E-5	-4.060120E-5	T	29544	2017.09.19 14:40:13.413640132	0000678	
73	0.000183	0.000162	7.794158E-5	-3.564214E-5	T	29544	2017.09.19 14:40:13.423640132	0000678	
73	0.000170	0.000147	7.811993E-5	-3.551994E-5	T	29544	2017.09.19 14:40:13.433640132	0000678	
73	0.000186	0.000156	7.286768E-5	-6.857928E-5	T	29544	2017.09.19 14:40:13.443640132	0000678	
74	0.000202	0.000185	7.264824E-5	-4.080854E-5	T	29545	2017.09.19 14:40:13.553727632	0000678	
74	0.000225	0.000209	7.234667E-5	-4.500389E-5	T	29545	2017.09.19 14:40:13.563727632	0000678	
74	0.000173	0.000157	6.804235E-5	-2.556032E-5	T	29545	2017.09.19 14:40:13.573727632	0000678	
74	0.000191	0.000171	8.187479E-5	-2.573247E-5	T	29545	2017.09.19 14:40:13.583727632	0000678	
74	0.000186	0.000157	9.197966E-5	-4.065930E-5	T	29545	2017.09.19 14:40:13.593727632	0000678	
74	0.000153	0.000128	7.836611E-5	-3.036537E-5	T	29545	2017.09.19 14:40:13.603727632	0000678	
74	0.000198	0.000161	8.678686E-5	-7.367790E-5	T	29545	2017.09.19 14:40:13.613727632	0000678	
74	0.000165	0.000152	6.421560E-5	2.495837E-6	T	29545	2017.09.19 14:40:13.623727632	0000678	
74	0.000182	0.000162	7.292171E-5	-4.062118E-5	T	29545	2017.09.19 14:40:13.633727632	0000678	
74	0.000190	0.000176	6.783265E-5	-2.171527E-5	T	29545	2017.09.19 14:40:13.643727632	0000678	
75	0.000175	0.000151	6.798021E-5	-5.551834E-5	T	29548	2017.09.19 14:40:13.753815132	0000678	
75	0.000187	0.000165	6.781375E-5	-5.563239E-5	T	29548	2017.09.19 14:40:13.763815132	0000678	
75	0.000188	0.000162	8.188047E-5	-5.065811E-5	T	29548	2017.09.19 14:40:13.773815132	0000678	
75	0.000172	0.000151	6.802074E-5	-4.551876E-5	T	29548	2017.09.19 14:40:13.783815132	0000678	
75	0.000190	0.000161	7.782404E-5	-6.464093E-5	T	29548	2017.09.19 14:40:13.793815132	0000678	
75	0.000221	0.000176	0.000115	-6.990832E-5	T	29548	2017.09.19 14:40:13.803815132	0000678	
75	0.000167	0.000146	5.904037E-5	-5.544026E-5	T	29548	2017.09.19 14:40:13.813815132	0000678	
75	0.000193	0.000157	9.188239E-5	-6.465830E-5	T	29548	2017.09.19 14:40:13.823815132	0000678	
75	0.000197	0.000165	7.271608E-5	-7.965213E-5	T	29548	2017.09.19 14:40:13.833815132	0000678	
75	0.000164	0.000143	7.316384E-5	-3.646657E-5	T	29548	2017.09.19 14:40:13.843815132	0000678	
76	0.000192	0.000165	7.277688E-5	-6.465276E-5	T	29550	2017.09.19 14:40:13.953902632	0000678	
76	0.000176	0.000146	7.802266E-5	-5.951894E-5	T	29550	2017.09.19 14:40:13.963902632	0000678	
76	0.000183	0.000156	7.791997E-5	-5.560057E-5	T	29550	2017.09.19 14:40:13.973902632	0000678	
76	0.000191	0.000175	6.375596E-5	-4.069788E-5	T	29550	2017.09.19 14:40:13.983902632	0000678	
76	0.000184	0.000161	7.288118E-5	-5.062076E-5	T	29550	2017.09.19 14:40:13.993902632	0000678	
76	0.000217	0.000204	7.263714E-5	1.203446E-5	T	29550	2017.09.19 14:40:14.003902632	0000678	
76	0.000159	0.000133	7.826613E-5	-4.040569E-5	T	29550	2017.09.19 14:40:14.013902632	0000678	
76	0.000193	0.000162	9.691982E-5	-4.072078E-5	T	29550	2017.09.19 14:40:14.023902632	0000678	
76	0.000183	0.000165	6.787455E-5	-4.063301E-5	T	29550	2017.09.19 14:40:14.033902632	0000678	
76	0.000199	0.000165	7.269987E-5	-8.365197E-5	T	29550	2017.09.19 14:40:14.043902632	0000678	
77	0.000214	0.000185	9.158595E-5	-5.588677E-5	T	29549	2017.09.19 14:40:14.153990132	0000678	
77	0.000192	0.000161	8.182373E-5	-6.465753E-5	T	29549	2017.09.19 14:40:14.163990132	0000678	
77	0.000184	0.000156	6.786402E-5	-6.955849E-5	T	29549	2017.09.19 14:40:14.173990132	0000678	
77	0.000199	0.000165	7.269987E-5	-8.365197E-5	T	29549	2017.09.19 14:40:14.183990132	0000678	
77	0.000197	0.000171	8.175320E-5	-5.573122E-5	T	29549	2017.09.19 14:40:14.193990132	0000678	
77	0.000193	0.000162	9.691982E-5	-4.072078E-5	T	29549	2017.09.19 14:40:14.203990132	0000678	
77	0.000199	0.000176	8.173428E-5	-4.577237E-5	T	29549	2017.09.19 14:40:14.213990132	0000678	
77	0.000214	0.000190	8.152728E-5	-5.588600E-5	T	29549	2017.09.19 14:40:14.223990132	0000678	
77	0.000156	0.000132	6.824665E-5	-4.536398E-5	T	29549	2017.09.19 14:40:14.233990132	0000678	
77	0.000193	0.000170	6.773809E-5	-5.967295E-5	T	29549	2017.09.19 14:40:14.243990132	0000678	
78	0.000180	0.000146	7.798213E-5	-6.951852E-5	T	29548	2017.09.19 14:40:14.354077632	0000678	
78	0.000197	0.000176	7.773459E-5	-4.575577E-5	T	29548	2017.09.19 14:40:14.364077632	0000678	
78	0.000188	0.000166	8.188965E-5	-3.669128E-5	T	29548	2017.09.19 14:40:14.374077632	0000678	
78	0.000212	0.000195	8.160564E-5	-2.192815E-5	T	29548	2017.09.19 14:40:14.384077632	0000678	
78	0.000215	0.000199	7.249799E-5	-3.692276E-5	T	29548	2017.09.19 14:40:14.394077632	0000678	
78	0.000217	0.000195	9.158458E-5	-2.696944E-5	T	29548	2017.09.19 14:40:14.404077632	0000678	
78	0.000189	0.000165	5.373785E-5	-7.457349E-5	T	29548	2017.09.19 14:40:14.414077632	0000678	
78	0.000200	0.000170	7.267690E-5	-7.469307E-5	T	29548	2017.09.19 14:40:14.424077632	0000678	
78	0.000225	0.000209	7.739896E-5	-3.202518E-5	T	29548	2017.09.19 14:40:14.434077632	0000678	
78	0.000212	0.000199	7.263985E-5	-1.924222E-6	T	29548	2017.09.19 14:40:14.444077632	0000678	
79	0.000202	0.000175	6.761784E-5	-7.471306E-5	T	29549	2017.09.19 14:40:14.554165132	0000678	
79	0.000191	0.000171	8.187073E-5	-2.673243E-5	T	29549	2017.09.19 14:40:14.564165132	0000678	
79	0.000197	0.000165	7.773595E-5	-7.467309E-5	T	29549	2017.09.19 14:40:14.574165132	0000678	
79	0.000197	0.000171	8.679333E-5	-4.575239E-5	T	29549	2017.09.19 14:40:14.584165132	0000678	
79	0.000195	0.000170	7.775351E-5	-5.571462E-5	T	29549	2017.09.19 14:40:14.594165132	0000678	
79	0.000204	0.000180	8.166645E-5	-5.080474E-5	T	29549	2017.09.19 14:40:14.604165132	0000678	
79	0.000182	0.000151	7.794295E-5	-6.455946E-5	T	29549	2017.09.19 14:40:14.614165132	0000678	
79	0.000202	0.000170	7.265663E-5	-7.969287E-5	T	29549	2017.09.19 14:40:14.624165132	0000678	
79	0.000220	0.000185	9.652881E-5	-6.990693E-5	T	29549	2017.09.19 14:40:14.634165132	0000678	
79	0.000195	0.000176	7.779133E-5	-3.175635E-5	T	29549	2017.09.19 14:40:14.644165132	0000678	
80	0.000198	0.000176	8.175454E-5	-4.077258E-5	T	29553	2017.09.19 14:40:14.754252632	0000678	
80	0.000164	0.000143	7.822424E-5	-2.148794E-5	T	29553	2017.09.19 14:40:14.764252632	0000678	
80	0.000173	0.000152	7.304061E-5	-4.053972E-5	T	29553	2017.09.19 14:40:14.774252632	0000678	
80	0.000196	0.000156	7.778622E-5	-8.859919E-5	T	29553	2017.09.19 14:40:14.784252632	0000678	
80	0.000166	0.000143	8.222392E-5	-2.150454E-5	T	29553	2017.09.19 14:40:14.794252632	0000678	
80	0.000192	0.000175	5.369595E-5	-5.565575E-5	T	29553	2017.09.19 14:40:14.804252632	0000678	
80	0.000207	0.000180	9.168593E-5	-4.584645E-5	T	29553	2017.09.19 14:40:14.814252632	0000678	
80	0.000186	0.000162	8.192100E-5	-4.065853E-5	T	29553	2017.09.19 14:40:14.824252632	0000678	
80	0.000164	0.000152	5.911872E-5	-2.148241E-5	T	29553	2017.09.19 14:40:14.834252632	0000678	
80	0.000201	0.000176	8.169375E-5	-5.577195E-5	T	29553	2017.09.19 14:40:14.844252632	0000678	
81	0.000190	0.000147	0.000111	-4.565648E-5	T	29549	2017.09.19 14:40:14.954340132	0000678	
81	0.000216	0.000198	6.744164E-5	-5.090142E-5	T	29549	2017.09.19 14:40:14.964340132	0000678	
81	0.000190	0.000162	9.193642E-5	-3.670020E-5	T	29549	2017.09.19 14:40:14.974340132	0000678	
81	0.000207	0.000185	7.760732E-5	-5.082888E-5	T	29549	2017.09.19 14:40:14.984340132	0000678	
81	0.000200	0.000171	9.177267E-5	-5.077293E-5	T	29549	2017.09.19 14:40:14.994340132	0000678	
81	0.000161	0.000143	6.818450E-5	-3.144603E-5	T	29549	2017.09.19 14:40:15.004340132	0000678	
81	0.000203	0.000176	8.167753E-5	-5.977178E-5	T	29549	2017.09.19 14:40:15.014340132	0000678	
81	0.000226	0.000195	9.141030E-5	-6.996765E-5	T	29549	2017.09.19 14:40:15.024340132	0000678	
81	0.000180	0.000162	7.295819E-5	-3.162156E-5	T	29549	2017.09.19 14:40:15.034340132	0000678	
81	0.000179	0.000157	7.296090E-5	-4.558024E-5	T	29549	2017.09.19 14:40:15.044340132	0000678	
82	0.000213	0.000184	8.152999E-5	-6.984468E-5	T	29548	2017.09.19 14:40:15.154427632	0000678	
82	0.000197	0.000165	8.175590E-5	-6.968990E-5	T	29548	2017.09.19 14:40:15.164427632	0000678	
82	0.000201	0.000176	8.673388E-5	-4.579312E-5	T	29548	2017.09.19 14:40:15.174427632	0000678	
82	0.000192	0.000170	6.775430E-5	-5.567312E-5	T	29548	2017.09.19 14:40:15.184427632	0000678	
82	0.000209	0.000170	8.161945E-5	-8.872984E-5	T	29548	2017.09.19 14:40:15.194427632	0000678	
82	0.000223	0.000195	9.145083E-5	-5.996806E-5	T	29548	2017.09.19 14:40:15.204427632	0000678	
82	0.000166	0.000132	7.314899E-5	-6.938372E-5	T	29548	2017.09.19 14:40:15.214427632	0000678	
82	0.000199	0.000166	0.000101	-4.576976E-5	T	29548	2017.09.19 14:40:15.224427632	0000678	
82	0.000177	0.000162	6.395890E-5	-3.158420E-5	T	29548	2017.09.19 14:40:15.234427632	0000678	
82	0.000221	0.000175	9.653855E-5	-9.383261E-5	T	29548	2017.09.19 14:40:15.244427632	0000678	
83	0.000173	0.000152	8.215744E-5	-1.157828E-5	T	29547	2017.09.19 14:40:15.354515132	0000678	
83	0.000187	0.000162	8.190479E-5	-4.465836E-5	T	29547	2017.09.19 14:40:15.364515132	0000678	
83	0.000181	0.000165	6.389513E-5	-3.561662E-5	T	29547	2017.09.19 14:40:15.374515132	0000678	
83	0.000185	0.000161	6.784510E-5	-5.959963E-5	T	29547	2017.09.19 14:40:15.384515132	0000678	
83	0.000191	0.000176	7.283226E-5	-2.173602E-5	T	29547	2017.09.19 14:40:15.394515132	0000678	
83	0.000207	0.000185	8.666740E-5	-3.586685E-5	T	29547	2017.09.19 14:40:15.404515132	0000678	
83	0.000172	0.000151	6.802480E-5	-4.451880E-5	T	29547	2017.09.19 14:40:15.414515132	0000678	
83	0.000211	0.000189	7.251178E-5	-5.984848E-5	T	29547	2017.09.19 14:40:15.424515132	0000678	
83	0.000173	0.000157	7.309870E-5	-1.158166E-5	T	29547	2017.09.19 14:40:15.434515132	0000678	
83	0.000191	0.000162	9.190400E-5	-4.469986E-5	T	29547	2017.09.19 14:40:15.444515132	0000678	
84	0.000168	0.000147	7.312033E-5	-3.549919E-5	T	29537	2017.09.19 14:40:15.554602632	0000678	
84	0.000185	0.000162	8.194127E-5	-3.565874E-5	T	29537	2017.09.19 14:40:15.564602632	0000678	
84	0.000167	0.000142	6.809128E-5	-5.444506E-5	T	29537	2017.09.19 14:40:15.574602632	0000678	
84	0.000199	0.000161	8.676659E-5	-7.867769E-5	T	29537	2017.09.19 14:40:15.584602632	0000678	
84	0.000211	0.000189	7.251178E-5	-5.984848E-5	T	29537	2017.09.19 14:40:15.594602632	0000678	
84	0.000194	0.000171	8.179778E-5	-4.473168E-5	T	29537	2017.09.19 14:40:15.604602632	0000678	
84	0.000197	0.000166	9.181591E-5	-5.473203E-5	T	29537	2017.09.19 14:40:15.614602632	0000678	
84	0.000190	0.000165	6.376138E-5	-6.861524E-5	T	29537	2017.09.19 14:40:15.624602632	0000678	
84	0.000203	0.000165	8.671903E-5	-7.871028E-5	T	29537	2017.09.19 14:40:15.634602632	0000678	
84	0.000180	0.000161	6.792211E-5	-4.060043E-5	T	29537	2017.09.19 14:40:15.644602632	0000678	
85	0.000199	0.000180	7.772756E-5	-3.578877E-5	T	29546	2017.09.19 14:40:15.754690132	0000678	
85	0.000174	0.000157	7.307843E-5	-1.658145E-5	T	29546	2017.09.19 14:40:15.764690132	0000678	
85	0.000145	0.000114	8.251199E-5	-3.526772E-5	T	29546	2017.09.19 14:40:15.774690132	0000678	
85	0.000166	0.000133	9.228529E-5	-3.546400E-5	T	29546	2017.09.19 14:40:15.784690132	0000678	
85	0.000165	0.000138	8.220636E-5	-4.046302E-5	T	29546	2017.09.19 14:40:15.794690132	0000678	
85	0.000155	0.000128	7.832558E-5	-4.036495E-5	T	29546	2017.09.19 14:40:15.804690132	0000678	
85	0.000192	0.000171	8.691087E-5	-1.675360E-5	T	29546	2017.09.19 14:40:15.814690132	0000678	
85	0.000213	0.000199	7.255879E-5	-2.192339E-5	T	29546	2017.09.19 14:40:15.824690132	0000678	
85	0.000197	0.000166	9.181591E-5	-5.473203E-5	T	29546	2017.09.19 14:40:15.834690132	0000678	
85	0.000173	0.000157	7.317571E-5	7.417547E-6	T	29546	2017.09.19 14:40:15.844690132	0000678	
86	0.000193	0.000166	9.189292E-5	-3.573282E-5	T	29547	2017.09.19 14:40:15.954777632	0000678	
86	0.000196	0.000184	5.868988E-5	-3.075086E-5	T	29547	2017.09.19 14:40:15.964777632	0000678	
86	0.000191	0.000171	7.783457E-5	-3.571545E-5	T	29547	2017.09.19 14:40:15.974777632	0000678	
86	0.000173	0.000147	8.209935E-5	-4.053633E-5	T	29547	2017.09.19 14:40:15.984777632	0000678	
86	0.000210	0.000190	7.757218E-5	-4.486986E-5	T	29547	2017.09.19 14:40:15.994777632	0000678	
86	0.000180	0.000152	8.703951E-5	-4.059782E-5	T	29547	2017.09.19 14:40:16.004777632	0000678	
86	0.000195	0.000171	8.683386E-5	-3.575281E-5	T	29547	2017.09.19 14:40:16.014777632	0000678	
86	0.000150	0.000137	4.922923E-5	-3.532628E-5	T	29547	2017.09.19 14:40:16.024777632	0000678	
86	0.000211	0.000176	9.162000E-5	-7.381270E-5	T	29547	2017.09.19 14:40:16.034777632	0000678	
86	0.000199	0.000190	5.880470E-5	1.220661E-5	T	29547	2017.09.19 14:40:16.044777632	0000678	
87	0.000180	0.000156	7.294063E-5	-5.058003E-5	T	29549	2017.09.19 14:40:16.154865132	0000678	
87	0.000200	0.000179	6.764729E-5	-5.574644E-5	T	29549	2017.09.19 14:40:16.164865132	0000678	
87	0.000184	0.000151	7.792268E-5	-6.955925E-5	T	29549	2017.09.19 14:40:16.174865132	0000678	
87	0.000211	0.000170	8.661905E-5	-8.875059E-5	T	29549	2017.09.19 14:40:16.184865132	0000678	
87	0.000177	0.000152	8.709625E-5	-2.659840E-5	T	29549	2017.09.19 14:40:16.194865132	0000678	
87	0.000194	0.000170	6.771782E-5	-6.467274E-5	T	29549	2017.09.19 14:40:16.204865132	0000678	
87	0.000194	0.000171	7.777378E-5	-5.071483E-5	T	29549	2017.09.19 14:40:16.214865132	0000678	
87	0.000159	0.000133	8.230229E-5	-3.142266E-5	T	29549	2017.09.19 14:40:16.224865132	0000678	
87	0.000190	0.000171	7.808586E-5	2.628195E-5	T	29549	2017.09.19 14:40:16.234865132	0000678	
87	0.000170	0.000142	6.805075E-5	-6.444465E-5	T	29549	2017.09.19 14:40:16.244865132	0000678	
88	0.000197	0.000180	7.778430E-5	-2.178936E-5	T	29545	2017.09.19 14:40:16.354952632	0000678	
88	0.000192	0.000176	6.777591E-5	-3.571469E-5	T	29545	2017.09.19 14:40:16.364952632	0000678	
88	0.000170	0.000143	8.213070E-5	-4.450358E-5	T	29545	2017.09.19 14:40:16.374952632	0000678	
88	0.000213	0.000185	9.159000E-5	-5.488681E-5	T	29545	2017.09.19 14:40:16.384952632	0000678	
88	0.000178	0.000152	8.202369E-5	-4.457690E-5	T	29545	2017.09.19 14:40:16.394952632	0000678	
88	0.000201	0.000171	9.681281E-5	-4.079410E-5	T	29545	2017.09.19 14:40:16.404952632	0000678	
88	0.000220	0.000204	8.151889E-5	-1.700168E-5	T	29545	2017.09.19 14:40:16.414952632	0000678	
88	0.000203	0.000180	8.167050E-5	-4.980479E-5	T	29545	2017.09.19 14:40:16.424952632	0000678	
88	0.000209	0.000195	7.260635E-5	-2.189080E-5	T	29545	2017.09.19 14:40:16.434952632	0000678	
88	0.000169	0.000152	7.315815E-5	-1.154093E-5	T	29545	2017.09.19 14:40:16.444952632	0000678	
89	0.000181	0.000157	8.704085E-5	-2.563917E-5	T	29545	2017.09.19 14:40:16.555040132	0000678	
89	0.000198	0.000176	8.175454E-5	-4.077258E-5	T	29545	2017.09.19 14:40:16.565040132	0000678	
89	0.000200	0.000180	8.174751E-5	-3.080558E-5	T	29545	2017.09.19 14:40:16.575040132	0000678	
89	0.000191	0.000166	9.193345E-5	-2.573324E-5	T	29545	2017.09.19 14:40:16.585040132	0000678	
89	0.000173	0.000157	7.309870E-5	-1.158166E-5	T	29545	2017.09.19 14:40:16.595040132	0000678	
89	0.000137	0.000119	6.451070E-5	-2.123433E-5	T	29545	2017.09.19 14:40:16.605040132	0000678	
89	0.000184	0.000166	7.797103E-5	-1.667552E-5	T	29545	2017.09.19 14:40:16.615040132	0000678	
89	0.000204	0.000190	7.270633E-5	-1.185049E-5	T	29545	2017.09.19 14:40:16.625040132	0000678	
89	0.000155	0.000142	5.420992E-5	-2.538818E-5	T	29545	2017.09.19 14:40:16.635040132	0000678	
89	0.000197	0.000171	8.175725E-5	-5.473126E-5	T	29545	2017.09.19 14:40:16.645040132	0000678	
90	0.000161	0.000143	7.326516E-5	-1.146761E-5	T	29540	2017.09.19 14:40:16.755127632	0000678	
90	0.000168	0.000152	6.810180E-5	-2.551959E-5	T	29540	2017.09.19 14:40:16.765127632	0000678	
90	0.000194	0.000176	7.275525E-5	-4.073523E-5	T	29540	2017.09.19 14:40:16.775127632	0000678	
90	0.000174	0.000143	9.216639E-5	-3.554546E-5	T	29540	2017.09.19 14:40:16.785127632	0000678	
90	0.000158	0.000128	8.736540E-5	-3.040272E-5	T	29540	2017.09.19 14:40:16.795127632	0000678	
90	0.000153	0.000128	8.244280E-5	-1.138277E-5	T	29540	2017.09.19 14:40:16.805127632	0000678	
90	0.000179	0.000151	7.798348E-5	-5.455988E-5	T	29540	2017.09.19 14:40:16.815127632	0000678	
90	0.000178	0.000162	7.301898E-5	-1.662218E-5	T	29540	2017.09.19 14:40:16.825127632	0000678	
90	0.000182	0.000162	8.201827E-5	-1.665953E-5	T	29540	2017.09.19 14:40:16.835127632	0000678	
90	0.000202	0.000180	7.767082E-5	-4.978819E-5	T	29540	2017.09.19 14:40:16.845127632	0000678	
91	0.000209	0.000179	7.255368E-5	-7.876622E-5	T	29545	2017.09.19 14:40:16.955215132	0000678	
91	0.000187	0.000176	6.393024E-5	2.300326E-6	T	29545	2017.09.19 14:40:16.965215132	0000678	
91	0.000187	0.000171	6.783536E-5	-3.567395E-5	T	29545	2017.09.19 14:40:16.975215132	0000678	
91	0.000199	0.000171	9.179699E-5	-4.477318E-5	T	29545	2017.09.19 14:40:16.985215132	0000678	
91	0.000204	0.000190	7.270633E-5	-1.185049E-5	T	29545	2017.09.19 14:40:16.995215132	0000678	
91	0.000212	0.000190	8.155160E-5	-4.988625E-5	T	29545	2017.09.19 14:40:17.005215132	0000678	
91	0.000192	0.000175	6.373975E-5	-4.469771E-5	T	29545	2017.09.19 14:40:17.015215132	0000678	
91	0.000175	0.000152	7.804022E-5	-4.056047E-5	T	29545	2017.09.19 14:40:17.025215132	0000678	
91	0.000205	0.000185	8.672414E-5	-2.186744E-5	T	29545	2017.09.19 14:40:17.035215132	0000678	
91	0.000165	0.000152	6.415886E-5	-1.150358E-5	T	29545	2017.09.19 14:40:17.045215132	0000678	
92	0.000186	0.000166	7.285794E-5	-4.465360E-5	T	29539	2017.09.19 14:40:17.155302632	0000678	
92	0.000178	0.000162	6.796264E-5	-3.060085E-5	T	29539	2017.09.19 14:40:17.165302632	0000678	
92	0.000208	0.000190	7.257258E-5	-4.484911E-5	T	29539	2017.09.19 14:40:17.175302632	0000678	
92	0.000172	0.000137	7.307332E-5	-7.342429E-5	T	29539	2017.09.19 14:40:17.185302632	0000678	
92	0.000163	0.000143	7.318815E-5	-3.046682E-5	T	29539	2017.09.19 14:40:17.195302632	0000678	
92	0.000169	0.000146	6.806398E-5	-4.947786E-5	T	29539	2017.09.19 14:40:17.205302632	0000678	
92	0.000173	0.000152	7.808075E-5	-3.056088E-5	T	29539	2017.09.19 14:40:17.215302632	0000678	
92	0.000195	0.000170	7.775756E-5	-5.471466E-5	T	29539	2017.09.19 14:40:17.225302632	0000678	
92	0.000193	0.000176	7.783186E-5	-2.175677E-5	T	29539	2017.09.19 14:40:17.235302632	0000678	
92	0.000184	0.000156	7.288389E-5	-6.457944E-5	T	29539	2017.09.19 14:40:17.245302632	0000678	
93	0.000203	0.000165	7.767921E-5	-8.867251E-5	T	29551	2017.09.19 14:40:17.355390132	0000678	
93	0.000203	0.000161	6.767082E-5	-0.000103	T	29551	2017.09.19 14:40:17.365390132	0000678	
93	0.000215	0.000195	8.152863E-5	-4.092736E-5	T	29551	2017.09.19 14:40:17.375390132	0000678	
93	0.000171	0.000151	6.402106E-5	-4.550216E-5	T	29551	2017.09.19 14:40:17.385390132	0000678	
93	0.000198	0.000156	7.776596E-5	-9.359898E-5	T	29551	2017.09.19 14:40:17.395390132	0000678	
93	0.000197	0.000170	7.773730E-5	-5.971445E-5	T	29551	2017.09.19 14:40:17.405390132	0000678	
93	0.000204	0.000161	9.174593E-5	-8.369823E-5	T	29551	2017.09.19 14:40:17.415390132	0000678	
93	0.000178	0.000166	6.404914E-5	2.381789E-6	T	29551	2017.09.19 14:40:17.425390132	0000678	
93	0.000194	0.000161	8.180346E-5	-6.965732E-5	T	29551	2017.09.19 14:40:17.435390132	0000678	
93	0.000177	0.000152	8.203990E-5	-4.057707E-5	T	29551	2017.09.19 14:40:17.445390132	0000678	
94	0.000214	0.000198	6.344601E-5	-4.988487E-5	T	29545	2017.09.19 14:40:17.555477632	0000678	
94	0.000204	0.000179	6.759460E-5	-6.874589E-5	T	29545	2017.09.19 14:40:17.565477632	0000678	
94	0.000221	0.000189	8.143406E-5	-7.888504E-5	T	29545	2017.09.19 14:40:17.575477632	0000678	
94	0.000197	0.000180	7.780457E-5	-1.678957E-5	T	29545	2017.09.19 14:40:17.585477632	0000678	
94	0.000165	0.000143	7.820802E-5	-2.548778E-5	T	29545	2017.09.19 14:40:17.595477632	0000678	
94	0.000170	0.000152	7.311762E-5	-2.154051E-5	T	29545	2017.09.19 14:40:17.605477632	0000678	
94	0.000167	0.000142	6.809128E-5	-5.444506E-5	T	29545	2017.09.19 14:40:17.615477632	0000678	
94	0.000181	0.000143	0.000101	-4.458243E-5	T	29545	2017.09.19 14:40:17.625477632	0000678	
94	0.000183	0.000171	6.393295E-5	-1.165836E-5	T	29545	2017.09.19 14:40:17.635477632	0000678	
94	0.000202	0.000175	7.765758E-5	-6.475497E-5	T	29545	2017.09.19 14:40:17.645477632	0000678	
95	0.000200	0.000180	7.770730E-5	-4.078856E-5	T	29536	2017.09.19 14:40:17.755565132	0000678	
95	0.000182	0.000166	7.295116E-5	-2.165456E-5	T	29536	2017.09.19 14:40:17.765565132	0000678	
95	0.000184	0.000162	8.196153E-5	-3.065895E-5	T	29536	2017.09.19 14:40:17.775565132	0000678	
95	0.000209	0.000194	6.351384E-5	-4.485249E-5	T	29536	2017.09.19 14:40:17.785565132	0000678	
95	0.000184	0.000146	8.698547E-5	-6.855591E-5	T	29536	2017.09.19 14:40:17.795565132	0000678	
95	0.000202	0.000190	6.776346E-5	2.169677E-6	T	29536	2017.09.19 14:40:17.805565132	0000678	
95	0.000187	0.000157	9.196345E-5	-4.465913E-5	T	29536	2017.09.19 14:40:17.815565132	0000678	
95	0.000164	0.000143	7.822424E-5	-2.148794E-5	T	29536	2017.09.19 14:40:17.825565132	0000678	
95	0.000166	0.000138	7.817020E-5	-4.944604E-5	T	29536	2017.09.19 14:40:17.835565132	0000678	
95	0.000160	0.000143	6.820881E-5	-2.544628E-5	T	29536	2017.09.19 14:40:17.845565132	0000678	
96	0.000166	0.000138	8.219015E-5	-4.446285E-5	T	29547	2017.09.19 14:40:17.955652632	0000678	
96	0.000185	0.000161	6.382515E-5	-6.458283E-5	T	29547	2017.09.19 14:40:17.965652632	0000678	
96	0.000188	0.000162	8.188452E-5	-4.965815E-5	T	29547	2017.09.19 14:40:17.975652632	0000678	
96	0.000164	0.000142	6.411186E-5	-4.942867E-5	T	29547	2017.09.19 14:40:17.985652632	0000678	
96	0.000169	0.000147	7.310006E-5	-4.049898E-5	T	29547	2017.09.19 14:40:17.995652632	0000678	
96	0.000196	0.000180	7.276849E-5	-2.576844E-5	T	29547	2017.09.19 14:40:18.005652632	0000678	
96	0.000179	0.000152	9.211612E-5	-2.161936E-5	T	29547	2017.09.19 14:40:18.015652632	0000678	
96	0.000159	0.000133	7.826613E-5	-4.040569E-5	T	29547	2017.09.19 14:40:18.025652632	0000678	
96	0.000178	0.000152	8.708004E-5	-3.059823E-5	T	29547	2017.09.19 14:40:18.035652632	0000678	
96	0.000203	0.000185	7.768838E-5	-3.082971E-5	T	29547	2017.09.19 14:40:18.045652632	0000678	
97	0.000201	0.000179	6.361113E-5	-6.472946E-5	T	29556	2017.09.19 14:40:18.155740132	0000678	
97	0.000187	0.000170	5.877528E-5	-5.063598E-5	T	29556	2017.09.19 14:40:18.165740132	0000678	
97	0.000175	0.000151	6.396432E-5	-5.950157E-5	T	29556	2017.09.19 14:40:18.175740132	0000678	
97	0.000205	0.000180	8.164619E-5	-5.580454E-5	T	29556	2017.09.19 14:40:18.185740132	0000678	
97	0.000193	0.000151	8.184536E-5	-8.857506E-5	T	29556	2017.09.19 14:40:18.195740132	0000678	
97	0.000198	0.000166	8.677577E-5	-6.471086E-5	T	29556	2017.09.19 14:40:18.205740132	0000678	
97	0.000182	0.000171	6.397348E-5	-1.658775E-6	T	29556	2017.09.19 14:40:18.215740132	0000678	
97	0.000193	0.000170	6.773809E-5	-5.967295E-5	T	29556	2017.09.19 14:40:18.225740132	0000678	
97	0.000189	0.000165	5.875772E-5	-6.959445E-5	T	29556	2017.09.19 14:40:18.235740132	0000678	
97	0.000208	0.000170	9.167540E-5	-7.477193E-5	T	29556	2017.09.19 14:40:18.245740132	0000678	
98	0.000170	0.000147	8.216015E-5	-2.553696E-5	T	29546	2017.09.19 14:40:18.355827632	0000678	
98	0.000160	0.000137	6.819126E-5	-4.440475E-5	T	29546	2017.09.19 14:40:18.365827632	0000678	
98	0.000178	0.000166	6.397213E-5	-1.661742E-5	T	29546	2017.09.19 14:40:18.375827632	0000678	
98	0.000176	0.000156	6.796534E-5	-4.455953E-5	T	29546	2017.09.19 14:40:18.385827632	0000678	
98	0.000186	0.000171	7.293224E-5	-1.169571E-5	T	29546	2017.09.19 14:40:18.395827632	0000678	
98	0.000184	0.000156	6.786807E-5	-6.855853E-5	T	29546	2017.09.19 14:40:18.405827632	0000678	
98	0.000170	0.000143	8.214691E-5	-4.050375E-5	T	29546	2017.09.19 14:40:18.415827632	0000678	
98	0.000181	0.000157	7.796456E-5	-4.460103E-5	T	29546	2017.09.19 14:40:18.425827632	0000678	
98	0.000188	0.000157	9.699953E-5	-3.568026E-5	T	29546	2017.09.19 14:40:18.435827632	0000678	
98	0.000191	0.000175	5.871988E-5	-4.967675E-5	T	29546	2017.09.19 14:40:18.445827632	0000678	
99	0.000196	0.000170	7.271743E-5	-6.469349E-5	T	29558	2017.09.19 14:40:18.555915132	0000678	
99	0.000160	0.000137	6.818720E-5	-4.540471E-5	T	29558	2017.09.19 14:40:18.565915132	0000678	
99	0.000222	0.000195	9.650718E-5	-4.598940E-5	T	29558	2017.09.19 14:40:18.575915132	0000678	
99	0.000169	0.000133	8.718841E-5	-5.944224E-5	T	29558	2017.09.19 14:40:18.585915132	0000678	
99	0.000175	0.000138	9.718492E-5	-4.552506E-5	T	29558	2017.09.19 14:40:18.595915132	0000678	
99	0.000202	0.000185	8.180560E-5	-1.847524E-6	T	29558	2017.09.19 14:40:18.605915132	0000678	
99	0.000217	0.000194	6.741220E-5	-6.986804E-5	T	29558	2017.09.19 14:40:18.615915132	0000678	
99	0.000203	0.000180	8.672280E-5	-3.682608E-5	T	29558	2017.09.19 14:40:18.625915132	0000678	
99	0.000175	0.000156	5.894174E-5	-5.052193E-5	T	29558	2017.09.19 14:40:18.635915132	0000678	
99	0.000193	0.000170	7.275391E-5	-5.569387E-5	T	29558	2017.09.19 14:40:18.645915132	0000678	
100	0.000183	0.000137	7.799187E-5	-9.344420E-5	T	29549	2017.09.19 14:40:18.756002632	0000678	
100	0.000184	0.000151	7.792268E-5	-6.955925E-5	T	29549	2017.09.19 14:40:18.766002632	0000678	
100	0.000195	0.000170	7.273769E-5	-5.969370E-5	T	29549	2017.09.19 14:40:18.776002632	0000678	
100	0.000191	0.000165	7.781296E-5	-5.567389E-5	T	29549	2017.09.19 14:40:18.786002632	0000678	
100	0.000192	0.000165	7.779675E-5	-5.967372E-5	T	29549	2017.09.19 14:40:18.796002632	0000678	
100	0.000185	0.000157	8.695979E-5	-4.563834E-5	T	29549	2017.09.19 14:40:18.806002632	0000678	
100	0.000174	0.000142	6.801022E-5	-7.444423E-5	T	29549	2017.09.19 14:40:18.816002632	0000678	
100	0.000208	0.000180	8.662958E-5	-5.982512E-5	T	29549	2017.09.19 14:40:18.826002632	0000678	
100	0.000187	0.000166	7.787376E-5	-4.067451E-5	T	29549	2017.09.19 14:40:18.836002632	0000678	
100	0.000174	0.000146	7.302306E-5	-5.949819E-5	T	29549	2017.09.19 14:40:18.846002632	0000678	
101	0.000188	0.000165	5.876177E-5	-6.859449E-5	T	29546	2017.09.19 14:40:18.956090132	0000678	
101	0.000180	0.000166	6.391539E-5	-3.061683E-5	T	29546	2017.09.19 14:40:18.966090132	0000678	
101	0.000178	0.000151	7.296361E-5	-5.953892E-5	T	29546	2017.09.19 14:40:18.976090132	0000678	
101	0.000176	0.000157	7.300143E-5	-3.558066E-5	T	29546	2017.09.19 14:40:18.986090132	0000678	
101	0.000187	0.000166	8.191397E-5	-3.069153E-5	T	29546	2017.09.19 14:40:18.996090132	0000678	
101	0.000184	0.000156	7.288389E-5	-6.457944E-5	T	29546	2017.09.19 14:40:19.006090132	0000678	
101	0.000203	0.000176	9.679389E-5	-3.083525E-5	T	29546	2017.09.19 14:40:19.016090132	0000678	
101	0.000152	0.000133	6.830745E-5	-3.036460E-5	T	29546	2017.09.19 14:40:19.026090132	0000678	
101	0.000196	0.000165	8.177617E-5	-6.469011E-5	T	29546	2017.09.19 14:40:19.036090132	0000678	
101	0.000198	0.000176	8.175454E-5	-4.077258E-5	T	29546	2017.09.19 14:40:19.046090132	0000678	
102	0.000198	0.000179	5.863179E-5	-5.970892E-5	T	29544	2017.09.19 14:40:19.156177632	0000678	
102	0.000201	0.000176	8.169780E-5	-5.477199E-5	T	29544	2017.09.19 14:40:19.166177632	0000678	
102	0.000210	0.000185	8.157052E-5	-5.984510E-5	T	29544	2017.09.19 14:40:19.176177632	0000678	
102	0.000182	0.000166	7.295116E-5	-2.165456E-5	T	29544	2017.09.19 14:40:19.186177632	0000678	
102	0.000216	0.000195	8.654850E-5	-3.594832E-5	T	29544	2017.09.19 14:40:19.196177632	0000678	
102	0.000189	0.000165	7.281741E-5	-5.465318E-5	T	29544	2017.09.19 14:40:19.206177632	0000678	
102	0.000217	0.000199	8.152160E-5	-3.096036E-5	T	29544	2017.09.19 14:40:19.216177632	0000678	
102	0.000163	0.000147	6.817747E-5	-2.147903E-5	T	29544	2017.09.19 14:40:19.226177632	0000678	
102	0.000203	0.000176	9.679389E-5	-3.083525E-5	T	29544	2017.09.19 14:40:19.236177632	0000678	
102	0.000186	0.000171	7.295250E-5	-6.695917E-6	T	29544	2017.09.19 14:40:19.246177632	0000678	
