{
    "_name": "5-2-2-euc-3",
    "_nodes": [
        0,
        1,
        2,
        3,
        4,
        5
    ],
    "_customers": [
        1,
        2,
        3,
        4,
        5
    ],
    "_clusters": [
        0,
        1
    ],
    "_depot": 0,
    "_cluster_nodes": [
        [
            1,
            2,
            3
        ],
        [
            4,
            5
        ]
    ],
    "_cluster_nodes_depot": [
        [
            0,
            1,
            2,
            3
        ],
        [
            0,
            4,
            5
        ]
    ],
    "_distance_type": "euc",
    "_x": {
        "0": -5,
        "1": 30,
        "2": 69,
        "3": 47,
        "4": 60,
        "5": 74
    },
    "_y": {
        "0": -5,
        "1": 75,
        "2": 16,
        "3": 77,
        "4": 80,
        "5": 8
    },
    "_num_pickers": 2
}