{
    "_name": "14-3-2-whs-1",
    "_nodes": [
        0,
        1,
        2,
        3,
        4,
        5,
        6,
        7,
        8,
        9,
        10,
        11,
        12,
        13,
        14
    ],
    "_customers": [
        1,
        2,
        3,
        4,
        5,
        6,
        7,
        8,
        9,
        10,
        11,
        12,
        13,
        14
    ],
    "_clusters": [
        0,
        1,
        2
    ],
    "_depot": 0,
    "_cluster_nodes": [
        [
            1,
            2,
            3,
            4,
            5
        ],
        [
            6,
            7,
            8,
            9,
            10
        ],
        [
            11,
            12,
            13,
            14
        ]
    ],
    "_cluster_nodes_depot": [
        [
            0,
            1,
            2,
            3,
            4,
            5
        ],
        [
            0,
            6,
            7,
            8,
            9,
            10
        ],
        [
            0,
            11,
            12,
            13,
            14
        ]
    ],
    "_distance_type": "whs",
    "_x": {
        "0": -5,
        "1": 17,
        "2": 97,
        "3": 32,
        "4": 63,
        "5": 57,
        "6": 83,
        "7": 100,
        "8": 12,
        "9": 3,
        "10": 55,
        "11": 97,
        "12": 0,
        "13": 57,
        "14": 92
    },
    "_y": {
        "0": -5,
        "1": 72,
        "2": 8,
        "3": 15,
        "4": 97,
        "5": 60,
        "6": 48,
        "7": 26,
        "8": 62,
        "9": 49,
        "10": 77,
        "11": 98,
        "12": 89,
        "13": 34,
        "14": 29
    },
    "_num_pickers": 2
}