{
    "_name": "11-4-1-euc-2",
    "_nodes": [
        0,
        1,
        2,
        3,
        4,
        5,
        6,
        7,
        8,
        9,
        10,
        11
    ],
    "_customers": [
        1,
        2,
        3,
        4,
        5,
        6,
        7,
        8,
        9,
        10,
        11
    ],
    "_clusters": [
        0,
        1,
        2,
        3
    ],
    "_depot": 0,
    "_cluster_nodes": [
        [
            1,
            2,
            3
        ],
        [
            4,
            5,
            6
        ],
        [
            7,
            8,
            9
        ],
        [
            10,
            11
        ]
    ],
    "_cluster_nodes_depot": [
        [
            0,
            1,
            2,
            3
        ],
        [
            0,
            4,
            5,
            6
        ],
        [
            0,
            7,
            8,
            9
        ],
        [
            0,
            10,
            11
        ]
    ],
    "_distance_type": "euc",
    "_x": {
        "0": -5,
        "1": 7,
        "2": 10,
        "3": 21,
        "4": 85,
        "5": 32,
        "6": 27,
        "7": 4,
        "8": 87,
        "9": 55,
        "10": 50,
        "11": 65
    },
    "_y": {
        "0": -5,
        "1": 11,
        "2": 46,
        "3": 94,
        "4": 39,
        "5": 77,
        "6": 77,
        "7": 74,
        "8": 20,
        "9": 81,
        "10": 92,
        "11": 47
    },
    "_num_pickers": 1
}