{
    "_name": "6-3-2-euc-1",
    "_nodes": [
        0,
        1,
        2,
        3,
        4,
        5,
        6
    ],
    "_customers": [
        1,
        2,
        3,
        4,
        5,
        6
    ],
    "_clusters": [
        0,
        1,
        2
    ],
    "_depot": 0,
    "_cluster_nodes": [
        [
            1,
            2
        ],
        [
            3,
            4
        ],
        [
            5,
            6
        ]
    ],
    "_cluster_nodes_depot": [
        [
            0,
            1,
            2
        ],
        [
            0,
            3,
            4
        ],
        [
            0,
            5,
            6
        ]
    ],
    "_distance_type": "euc",
    "_x": {
        "0": -5,
        "1": 17,
        "2": 97,
        "3": 32,
        "4": 63,
        "5": 57,
        "6": 83
    },
    "_y": {
        "0": -5,
        "1": 72,
        "2": 8,
        "3": 15,
        "4": 97,
        "5": 60,
        "6": 48
    },
    "_num_pickers": 2
}