{
    "_name": "10-3-3-whs-3",
    "_nodes": [
        0,
        1,
        2,
        3,
        4,
        5,
        6,
        7,
        8,
        9,
        10
    ],
    "_customers": [
        1,
        2,
        3,
        4,
        5,
        6,
        7,
        8,
        9,
        10
    ],
    "_clusters": [
        0,
        1,
        2
    ],
    "_depot": 0,
    "_cluster_nodes": [
        [
            1,
            2,
            3,
            4
        ],
        [
            5,
            6,
            7
        ],
        [
            8,
            9,
            10
        ]
    ],
    "_cluster_nodes_depot": [
        [
            0,
            1,
            2,
            3,
            4
        ],
        [
            0,
            5,
            6,
            7
        ],
        [
            0,
            8,
            9,
            10
        ]
    ],
    "_distance_type": "whs",
    "_x": {
        "0": -5,
        "1": 30,
        "2": 69,
        "3": 47,
        "4": 60,
        "5": 74,
        "6": 77,
        "7": 60,
        "8": 70,
        "9": 24,
        "10": 60
    },
    "_y": {
        "0": -5,
        "1": 75,
        "2": 16,
        "3": 77,
        "4": 80,
        "5": 8,
        "6": 1,
        "7": 33,
        "8": 29,
        "9": 91,
        "10": 69
    },
    "_num_pickers": 3
}