\BOOKMARK [0][-]{section*.2}{Abk\374rzungsverzeichnis}{}% 1
\BOOKMARK [0][-]{chapter.1}{Einleitung}{}% 2
\BOOKMARK [1][-]{section.1.1}{Motivation}{chapter.1}% 3
\BOOKMARK [0][-]{chapter.2}{Literatur\374berblick}{}% 4
\BOOKMARK [0][-]{chapter.3}{Modellierung}{}% 5
\BOOKMARK [1][-]{section.3.1}{Problemdefinition}{chapter.3}% 6
\BOOKMARK [1][-]{section.3.2}{Distanzmatrix des Warenhaus-Layouts}{chapter.3}% 7
\BOOKMARK [0][-]{chapter.4}{Mathematische Formulierungen}{}% 8
\BOOKMARK [1][-]{section.4.1}{Modellbeschreibung}{chapter.4}% 9
\BOOKMARK [1][-]{section.4.2}{Modell M1}{chapter.4}% 10
\BOOKMARK [1][-]{section.4.3}{Modell M2}{chapter.4}% 11
\BOOKMARK [1][-]{section.4.4}{Modell M3}{chapter.4}% 12
\BOOKMARK [0][-]{chapter.5}{Numerische Studien}{}% 13
\BOOKMARK [1][-]{section.5.1}{L\366sung von Modell M1}{chapter.5}% 14
\BOOKMARK [1][-]{section.5.2}{L\366sung von Modell M2}{chapter.5}% 15
\BOOKMARK [1][-]{section.5.3}{L\366sung von Modell M3}{chapter.5}% 16
\BOOKMARK [0][-]{chapter.6}{Zusammenfassung}{}% 17
