{
    "_name": "9-3-2-whs-3",
    "_nodes": [
        0,
        1,
        2,
        3,
        4,
        5,
        6,
        7,
        8,
        9
    ],
    "_customers": [
        1,
        2,
        3,
        4,
        5,
        6,
        7,
        8,
        9
    ],
    "_clusters": [
        0,
        1,
        2
    ],
    "_depot": 0,
    "_cluster_nodes": [
        [
            1,
            2,
            3
        ],
        [
            4,
            5,
            6
        ],
        [
            7,
            8,
            9
        ]
    ],
    "_cluster_nodes_depot": [
        [
            0,
            1,
            2,
            3
        ],
        [
            0,
            4,
            5,
            6
        ],
        [
            0,
            7,
            8,
            9
        ]
    ],
    "_distance_type": "whs",
    "_x": {
        "0": -5,
        "1": 30,
        "2": 69,
        "3": 47,
        "4": 60,
        "5": 74,
        "6": 77,
        "7": 60,
        "8": 70,
        "9": 24
    },
    "_y": {
        "0": -5,
        "1": 75,
        "2": 16,
        "3": 77,
        "4": 80,
        "5": 8,
        "6": 1,
        "7": 33,
        "8": 29,
        "9": 91
    },
    "_num_pickers": 2
}