{
    "_name": "5-1-3-whs-2",
    "_nodes": [
        0,
        1,
        2,
        3,
        4,
        5
    ],
    "_customers": [
        1,
        2,
        3,
        4,
        5
    ],
    "_clusters": [
        0
    ],
    "_depot": 0,
    "_cluster_nodes": [
        [
            1,
            2,
            3,
            4,
            5
        ]
    ],
    "_cluster_nodes_depot": [
        [
            0,
            1,
            2,
            3,
            4,
            5
        ]
    ],
    "_distance_type": "whs",
    "_x": {
        "0": -5,
        "1": 7,
        "2": 10,
        "3": 21,
        "4": 85,
        "5": 32
    },
    "_y": {
        "0": -5,
        "1": 11,
        "2": 46,
        "3": 94,
        "4": 39,
        "5": 77
    },
    "_num_pickers": 3
}