\relax 
\providecommand\hyper@newdestlabel[2]{}
\bbl@cs{beforestart}
\catcode `"\active 
\providecommand\HyperFirstAtBeginDocument{\AtBeginDocument}
\HyperFirstAtBeginDocument{\ifx\hyper@anchor\@undefined
\global\let\oldcontentsline\contentsline
\gdef\contentsline#1#2#3#4{\oldcontentsline{#1}{#2}{#3}}
\global\let\oldnewlabel\newlabel
\gdef\newlabel#1#2{\newlabelxx{#1}#2}
\gdef\newlabelxx#1#2#3#4#5#6{\oldnewlabel{#1}{{#2}{#3}}}
\AtEndDocument{\ifx\hyper@anchor\@undefined
\let\contentsline\oldcontentsline
\let\newlabel\oldnewlabel
\fi}
\fi}
\global\let\hyper@last\relax 
\gdef\HyperFirstAtBeginDocument#1{#1}
\providecommand\HyField@AuxAddToFields[1]{}
\providecommand\HyField@AuxAddToCoFields[2]{}
\providecommand\@newglossary[4]{}
\@newglossary{main}{glg}{gls}{glo}
\@newglossary{abbreviations}{glg-abr}{gls-abr}{glo-abr}
\providecommand\@glsxtr@savepreloctag[2]{}
\providecommand*{\glsxtr@fields}[1]{}
\providecommand*{\glsxtr@resource}[2]{}
\providecommand*{\glsxtr@pluralsuffixes}[4]{}
\providecommand*{\glsxtr@shortcutsval}[1]{}
\providecommand*{\glsxtr@linkprefix}[1]{}
\glsxtr@fields{{name}{name},{sort}{sortvalue},{type}{type},{first}{first},{firstplural}{firstpl},{text}{text},{plural}{plural},{description}{desc},{descriptionplural}{descplural},{symbol}{symbol},{symbolplural}{symbolplural},{user1}{useri},{user2}{userii},{user3}{useriii},{user4}{useriv},{user5}{userv},{user6}{uservi},{long}{long},{longplural}{longpl},{short}{short},{shortplural}{shortpl},{counter}{counter},{parent}{parent},{loclist}{loclist},{location}{location},{group}{group},{see}{see},{alias}{alias},{seealso}{seealso},{category}{category}}
\providecommand*{\glsxtr@record}[5]{}
\glsxtr@langtag{de-1996}
\glsxtr@pluralsuffixes{s}{s}{s}{s}
\glsxtr@texencoding{utf8}
\glsxtr@shortcutsval{none}
\glsxtr@resource{src={glossary_main, abbrvs}}{thesis}
\babel@aux{ngerman}{}
\providecommand{\@glsxtr@prefixlabellist}[1]{}
\@glsxtr@prefixlabellist{}
\glsxtr@linkprefix{glo:}
\gdef \LT@i {\LT@entry 
    {1}{86.97578pt}\LT@entry 
    {1}{288.61333pt}}
\@writefile{toc}{\contentsline {chapter}{Abkürzungsverzeichnis}{ii}{section*.2}\protected@file@percent }
\citation{fisher1981}
\glsxtr@record{vrp}{}{page}{glsnumberformat}{iv}
\citation{furmans2009}
\citation{furmans2009}
\citation{ullrich2015automated}
\@writefile{toc}{\contentsline {chapter}{\numberline {1}Einleitung}{1}{chapter.1}\protected@file@percent }
\@writefile{lof}{\addvspace {10\p@ }}
\@writefile{lot}{\addvspace {10\p@ }}
\newlabel{chap:intro}{{1}{1}{Einleitung}{chapter.1}{}}
\newlabel{chap:intro@cref}{{[chapter][1][]1}{[1][1][]1}}
\glsxtr@record{sku}{}{page}{glsnumberformat}{1}
\glsxtr@record{sku}{}{page}{glsnumberformat}{1}
\glsxtr@record{sku}{}{page}{glsnumberformat}{1}
\glsxtr@record{sku}{}{page}{glsnumberformat}{1}
\glsxtr@record{agv}{}{page}{glsnumberformat}{1}
\glsxtr@record{agv}{}{page}{glsnumberformat}{1}
\glsxtr@record{sme}{}{page}{glsnumberformat}{1}
\glsxtr@record{sme}{}{page}{glsnumberformat}{2}
\glsxtr@record{sme}{}{page}{glsnumberformat}{2}
\glsxtr@record{agv}{}{page}{glsnumberformat}{2}
\glsxtr@record{agv}{}{page}{glsnumberformat}{2}
\glsxtr@record{agv}{}{page}{glsnumberformat}{2}
\@writefile{toc}{\contentsline {section}{\numberline {1.1}Motivation}{2}{section.1.1}\protected@file@percent }
\newlabel{sec:motiv}{{1.1}{2}{Motivation}{section.1.1}{}}
\newlabel{sec:motiv@cref}{{[section][1][1]1.1}{[1][2][]2}}
\glsxtr@record{agv}{}{page}{glsnumberformat}{2}
\glsxtr@record{agv}{}{page}{glsnumberformat}{2}
\glsxtr@record{agv}{}{page}{glsnumberformat}{2}
\glsxtr@record{agv}{}{page}{glsnumberformat}{2}
\glsxtr@record{agv}{}{page}{glsnumberformat}{3}
\glsxtr@record{agv}{}{page}{glsnumberformat}{3}
\citation{vis2006survey}
\citation{vis2006survey}
\citation{soylu2000self}
\citation{miller1960}
\@writefile{toc}{\contentsline {chapter}{\numberline {2}Literaturüberblick}{4}{chapter.2}\protected@file@percent }
\@writefile{lof}{\addvspace {10\p@ }}
\@writefile{lot}{\addvspace {10\p@ }}
\newlabel{chap:lit}{{2}{4}{Literaturüberblick}{chapter.2}{}}
\newlabel{chap:lit@cref}{{[chapter][2][]2}{[1][4][]4}}
\glsxtr@record{agv}{}{page}{glsnumberformat}{4}
\glsxtr@record{agv}{}{page}{glsnumberformat}{4}
\glsxtr@record{agv}{}{page}{glsnumberformat}{4}
\glsxtr@record{agv}{}{page}{glsnumberformat}{4}
\glsxtr@record{agv}{}{page}{glsnumberformat}{4}
\glsxtr@record{tsp}{}{page}{glsnumberformat}{4}
\glsxtr@record{tsp}{}{page}{glsnumberformat}{4}
\glsxtr@record{tsp}{}{page}{glsnumberformat}{4}
\glsxtr@record{tsp}{}{page}{glsnumberformat}{4}
\citation{ratliff1983order}
\citation{dantzig1959truck}
\citation{fisher1981}
\citation{fisher1981}
\citation{fisher1981}
\newlabel{eq:2.2}{{2.2}{5}{Literaturüberblick}{equation.2.0.2}{}}
\newlabel{eq:2.2@cref}{{[equation][2][2]2.2}{[1][5][]5}}
\newlabel{eq:2.3}{{2.3}{5}{Literaturüberblick}{equation.2.0.3}{}}
\newlabel{eq:2.3@cref}{{[equation][3][2]2.3}{[1][5][]5}}
\newlabel{eq:2.4}{{2.4}{5}{Literaturüberblick}{equation.2.0.4}{}}
\newlabel{eq:2.4@cref}{{[equation][4][2]2.4}{[1][5][]5}}
\newlabel{eq:2.5}{{2.5}{5}{Literaturüberblick}{equation.2.0.5}{}}
\newlabel{eq:2.5@cref}{{[equation][5][2]2.5}{[1][5][]5}}
\newlabel{eq:2.6}{{2.6}{5}{Literaturüberblick}{equation.2.0.6}{}}
\newlabel{eq:2.6@cref}{{[equation][6][2]2.6}{[1][5][]5}}
\glsxtr@record{agv}{}{page}{glsnumberformat}{5}
\glsxtr@record{tsp}{}{page}{glsnumberformat}{5}
\glsxtr@record{agv}{}{page}{glsnumberformat}{5}
\glsxtr@record{tsp}{}{page}{glsnumberformat}{5}
\glsxtr@record{agv}{}{page}{glsnumberformat}{5}
\glsxtr@record{vrp}{}{page}{glsnumberformat}{5}
\glsxtr@record{vrp}{}{page}{glsnumberformat}{5}
\glsxtr@record{vrp}{}{page}{glsnumberformat}{5}
\glsxtr@record{vrp}{}{page}{glsnumberformat}{5}
\citation{dantzig1959truck}
\citation{tothandvigo2002}
\@writefile{lot}{\contentsline {table}{\numberline {2.1}{\ignorespaces Notation des \gls {vrp} nach \citet  {fisher1981}\relax }}{6}{table.caption.7}\protected@file@percent }
\glsxtr@record{vrp}{}{page}{glsnumberformat}{6}
\providecommand*\caption@xref[2]{\@setref\relax\@undefined{#1}}
\newlabel{tab:notation_vrp}{{2.1}{6}{Notation des \gls {vrp} nach \citet {fisher1981}\relax }{table.caption.7}{}}
\newlabel{tab:notation_vrp@cref}{{[table][1][2]2.1}{[1][5][]6}}
\newlabel{eq:2.7}{{2.7}{6}{Literaturüberblick}{equation.2.0.7}{}}
\newlabel{eq:2.7@cref}{{[equation][7][2]2.7}{[1][6][]6}}
\newlabel{eq:2.8}{{2.8}{6}{Literaturüberblick}{equation.2.0.8}{}}
\newlabel{eq:2.8@cref}{{[equation][8][2]2.8}{[1][6][]6}}
\newlabel{eq:2.10}{{2.10}{6}{Literaturüberblick}{equation.2.0.10}{}}
\newlabel{eq:2.10@cref}{{[equation][10][2]2.10}{[1][6][]6}}
\newlabel{eq:2.11}{{2.11}{6}{Literaturüberblick}{equation.2.0.11}{}}
\newlabel{eq:2.11@cref}{{[equation][11][2]2.11}{[1][6][]6}}
\newlabel{eq:2.12}{{2.12}{6}{Literaturüberblick}{equation.2.0.12}{}}
\newlabel{eq:2.12@cref}{{[equation][12][2]2.12}{[1][6][]6}}
\newlabel{eq:2.13}{{2.13}{6}{Literaturüberblick}{equation.2.0.13}{}}
\newlabel{eq:2.13@cref}{{[equation][13][2]2.13}{[1][6][]6}}
\newlabel{eq:2.14}{{2.14}{6}{Literaturüberblick}{equation.2.0.14}{}}
\newlabel{eq:2.14@cref}{{[equation][14][2]2.14}{[1][6][]6}}
\glsxtr@record{vrp}{}{page}{glsnumberformat}{6}
\glsxtr@record{tsp}{}{page}{glsnumberformat}{6}
\glsxtr@record{vrp}{}{page}{glsnumberformat}{6}
\glsxtr@record{tsp}{}{page}{glsnumberformat}{6}
\glsxtr@record{vrp}{}{page}{glsnumberformat}{6}
\glsxtr@record{vrp}{}{page}{glsnumberformat}{6}
\citation{tothandvigo2002}
\citation{tothandvigo2002}
\citation{solomon1988survey}
\citation{bibid}
\citation{pisuchpen2012}
\citation{huang2012}
\glsxtr@record{cvrp}{}{page}{glsnumberformat}{7}
\glsxtr@record{dcvrp}{}{page}{glsnumberformat}{7}
\glsxtr@record{vrpb}{}{page}{glsnumberformat}{7}
\glsxtr@record{vrptw}{}{page}{glsnumberformat}{7}
\glsxtr@record{vrpbtw}{}{page}{glsnumberformat}{7}
\glsxtr@record{vrpb}{}{page}{glsnumberformat}{7}
\glsxtr@record{vrptw}{}{page}{glsnumberformat}{7}
\glsxtr@record{vrppd}{}{page}{glsnumberformat}{7}
\glsxtr@record{vrppdtw}{}{page}{glsnumberformat}{7}
\glsxtr@record{vrptw}{}{page}{glsnumberformat}{7}
\glsxtr@record{vrppd}{}{page}{glsnumberformat}{7}
\glsxtr@record{cvrp}{}{page}{glsnumberformat}{7}
\glsxtr@record{vrptw}{}{page}{glsnumberformat}{7}
\glsxtr@record{vrp}{}{page}{glsnumberformat}{7}
\glsxtr@record{lp}{}{page}{glsnumberformat}{7}
\glsxtr@record{ip}{}{page}{glsnumberformat}{7}
\glsxtr@record{lp}{}{page}{glsnumberformat}{7}
\glsxtr@record{ip}{}{page}{glsnumberformat}{7}
\glsxtr@record{milp}{}{page}{glsnumberformat}{7}
\glsxtr@record{agv}{}{page}{glsnumberformat}{7}
\glsxtr@record{vrptw}{}{page}{glsnumberformat}{7}
\glsxtr@record{vrptw}{}{page}{glsnumberformat}{7}
\glsxtr@record{agv}{}{page}{glsnumberformat}{7}
\glsxtr@record{agv}{}{page}{glsnumberformat}{7}
\glsxtr@record{vsp}{}{page}{glsnumberformat}{7}
\citation{wang2014multi}
\citation{ganesharajah1998design}
\citation{wang2014multi}
\citation{vis2006survey}
\citation{wang2014multi}
\citation{wang2014multi}
\citation{wang2014multi}
\glsxtr@record{agv}{}{page}{glsnumberformat}{8}
\glsxtr@record{agv}{}{page}{glsnumberformat}{8}
\glsxtr@record{agv}{}{page}{glsnumberformat}{8}
\glsxtr@record{agv}{}{page}{glsnumberformat}{8}
\glsxtr@record{sme}{}{page}{glsnumberformat}{8}
\glsxtr@record{agv}{}{page}{glsnumberformat}{8}
\glsxtr@record{agv}{}{page}{glsnumberformat}{8}
\glsxtr@record{agv}{}{page}{glsnumberformat}{8}
\glsxtr@record{agv}{}{page}{glsnumberformat}{8}
\glsxtr@record{agv}{}{page}{glsnumberformat}{8}
\glsxtr@record{agv}{}{page}{glsnumberformat}{8}
\glsxtr@record{agv}{}{page}{glsnumberformat}{8}
\glsxtr@record{agv}{}{page}{glsnumberformat}{8}
\glsxtr@record{agv}{}{page}{glsnumberformat}{8}
\glsxtr@record{vrp}{}{page}{glsnumberformat}{8}
\glsxtr@record{vrptw}{}{page}{glsnumberformat}{8}
\glsxtr@record{vrppd}{}{page}{glsnumberformat}{8}
\glsxtr@record{agv}{}{page}{glsnumberformat}{8}
\glsxtr@record{vrppdtw}{}{page}{glsnumberformat}{9}
\glsxtr@record{milp}{}{page}{glsnumberformat}{9}
\glsxtr@record{vrp}{}{page}{glsnumberformat}{9}
\glsxtr@record{vrp}{}{page}{glsnumberformat}{9}
\glsxtr@record{agv}{}{page}{glsnumberformat}{9}
\@writefile{toc}{\contentsline {chapter}{\numberline {3}Modellierung}{10}{chapter.3}\protected@file@percent }
\@writefile{lof}{\addvspace {10\p@ }}
\@writefile{lot}{\addvspace {10\p@ }}
\newlabel{chap:problem}{{3}{10}{Modellierung}{chapter.3}{}}
\newlabel{chap:problem@cref}{{[chapter][3][]3}{[1][10][]10}}
\glsxtr@record{agv}{}{page}{glsnumberformat}{10}
\glsxtr@record{agv}{}{page}{glsnumberformat}{10}
\glsxtr@record{agv}{}{page}{glsnumberformat}{10}
\glsxtr@record{agv}{}{page}{glsnumberformat}{10}
\glsxtr@record{agv}{}{page}{glsnumberformat}{10}
\glsxtr@record{agv}{}{page}{glsnumberformat}{10}
\@writefile{toc}{\contentsline {section}{\numberline {3.1}Problemdefinition}{10}{section.3.1}\protected@file@percent }
\newlabel{sec:defproblem}{{3.1}{10}{Problemdefinition}{section.3.1}{}}
\newlabel{sec:defproblem@cref}{{[section][1][3]3.1}{[1][10][]10}}
\glsxtr@record{agv}{}{page}{glsnumberformat}{10}
\glsxtr@record{agv}{}{page}{glsnumberformat}{10}
\@writefile{lof}{\contentsline {figure}{\numberline {3.1}{\ignorespaces Das Warenhaus-Layout mit 6 Inseln und 5 Gängen.\relax }}{11}{figure.caption.8}\protected@file@percent }
\newlabel{fig1:ware_layout}{{3.1}{11}{Das Warenhaus-Layout mit 6 Inseln und 5 Gängen.\relax }{figure.caption.8}{}}
\newlabel{fig1:ware_layout@cref}{{[figure][1][3]3.1}{[1][10][]11}}
\glsxtr@record{agv}{}{page}{glsnumberformat}{11}
\glsxtr@record{agv}{}{page}{glsnumberformat}{11}
\glsxtr@record{agv}{}{page}{glsnumberformat}{11}
\glsxtr@record{agv}{}{page}{glsnumberformat}{11}
\glsxtr@record{agv}{}{page}{glsnumberformat}{11}
\glsxtr@record{agv}{}{page}{glsnumberformat}{11}
\glsxtr@record{agv}{}{page}{glsnumberformat}{11}
\glsxtr@record{agv}{}{page}{glsnumberformat}{11}
\glsxtr@record{agv}{}{page}{glsnumberformat}{11}
\glsxtr@record{agv}{}{page}{glsnumberformat}{12}
\glsxtr@record{agv}{}{page}{glsnumberformat}{12}
\glsxtr@record{agv}{}{page}{glsnumberformat}{12}
\glsxtr@record{agv}{}{page}{glsnumberformat}{12}
\glsxtr@record{agv}{}{page}{glsnumberformat}{12}
\glsxtr@record{agv}{}{page}{glsnumberformat}{12}
\glsxtr@record{agv}{}{page}{glsnumberformat}{12}
\glsxtr@record{agv}{}{page}{glsnumberformat}{12}
\glsxtr@record{agv}{}{page}{glsnumberformat}{12}
\glsxtr@record{agv}{}{page}{glsnumberformat}{12}
\glsxtr@record{agv}{}{page}{glsnumberformat}{12}
\glsxtr@record{agv}{}{page}{glsnumberformat}{12}
\glsxtr@record{agv}{}{page}{glsnumberformat}{12}
\glsxtr@record{vrp}{}{page}{glsnumberformat}{12}
\glsxtr@record{tsp}{}{page}{glsnumberformat}{12}
\glsxtr@record{agv}{}{page}{glsnumberformat}{12}
\glsxtr@record{agv}{}{page}{glsnumberformat}{12}
\glsxtr@record{agv}{}{page}{glsnumberformat}{12}
\glsxtr@record{cvrp}{}{page}{glsnumberformat}{12}
\glsxtr@record{agv}{}{page}{glsnumberformat}{12}
\citation{tothandvigo2002}
\glsxtr@record{agv}{}{page}{glsnumberformat}{13}
\glsxtr@record{agv}{}{page}{glsnumberformat}{13}
\glsxtr@record{vrptw}{}{page}{glsnumberformat}{13}
\newlabel{eq:6}{{3.2}{13}{Problemdefinition}{equation.3.1.2}{}}
\newlabel{eq:6@cref}{{[equation][2][3]3.2}{[1][13][]13}}
\@writefile{toc}{\contentsline {section}{\numberline {3.2}Distanzmatrix des Warenhaus-Layouts}{13}{section.3.2}\protected@file@percent }
\newlabel{sec:matrix}{{3.2}{13}{Distanzmatrix des Warenhaus-Layouts}{section.3.2}{}}
\newlabel{sec:matrix@cref}{{[section][2][3]3.2}{[1][13][]13}}
\glsxtr@record{agv}{}{page}{glsnumberformat}{13}
\glsxtr@record{agv}{}{page}{glsnumberformat}{14}
\citation{jianyang2003conflict}
\@writefile{toc}{\contentsline {chapter}{\numberline {4}Mathematische Formulierungen}{15}{chapter.4}\protected@file@percent }
\@writefile{lof}{\addvspace {10\p@ }}
\@writefile{lot}{\addvspace {10\p@ }}
\newlabel{chap:Math}{{4}{15}{Mathematische Formulierungen}{chapter.4}{}}
\newlabel{chap:Math@cref}{{[chapter][4][]4}{[1][15][]15}}
\@writefile{toc}{\contentsline {section}{\numberline {4.1}Modellbeschreibung}{15}{section.4.1}\protected@file@percent }
\newlabel{sec:modeldesc}{{4.1}{15}{Modellbeschreibung}{section.4.1}{}}
\newlabel{sec:modeldesc@cref}{{[section][1][4]4.1}{[1][15][]15}}
\glsxtr@record{agv}{}{page}{glsnumberformat}{15}
\glsxtr@record{agv}{}{page}{glsnumberformat}{15}
\glsxtr@record{agv}{}{page}{glsnumberformat}{15}
\@writefile{toc}{\contentsline {section}{\numberline {4.2}Modell M\textsubscript  {1}}{16}{section.4.2}\protected@file@percent }
\newlabel{sec:M1}{{4.2}{16}{Modell M\textsubscript {1}}{section.4.2}{}}
\newlabel{sec:M1@cref}{{[section][2][4]4.2}{[1][15][]16}}
\glsxtr@record{agv}{}{page}{glsnumberformat}{16}
\glsxtr@record{agv}{}{page}{glsnumberformat}{16}
\glsxtr@record{tsp}{}{page}{glsnumberformat}{16}
\glsxtr@record{agv}{}{page}{glsnumberformat}{16}
\glsxtr@record{vrp}{}{page}{glsnumberformat}{16}
\@writefile{lot}{\contentsline {table}{\numberline {4.1}{\ignorespaces Notation des Modells M\textsubscript  {1}\relax }}{16}{table.caption.10}\protected@file@percent }
\newlabel{tab:notation_grund}{{4.1}{16}{Notation des Modells M\textsubscript {1}\relax }{table.caption.10}{}}
\newlabel{tab:notation_grund@cref}{{[table][1][4]4.1}{[1][15][]16}}
\glsxtr@record{agv}{}{page}{glsnumberformat}{16}
\glsxtr@record{agv}{}{page}{glsnumberformat}{16}
\citation{domschke2015}
\@writefile{lob}{\contentsline {model}{\numberline {1}{\ignorespaces M\textsubscript  {1}:\relax }}{17}{model.1}\protected@file@percent }
\newlabel{model:M1}{{1}{17}{M\textsubscript {1}:\relax }{model.1}{}}
\newlabel{model:M1@cref}{{[model][1][]1}{[1][15][]17}}
\newlabel{eq:obj1}{{4.1}{17}{M\textsubscript {1}:\relax }{equation.4.2.1}{}}
\newlabel{eq:obj1@cref}{{[equation][1][4]4.1}{[1][15][]17}}
\newlabel{eq:4.2}{{4.2}{17}{M\textsubscript {1}:\relax }{equation.4.2.2}{}}
\newlabel{eq:4.2@cref}{{[equation][2][4]4.2}{[1][15][]17}}
\newlabel{eq:4.3}{{4.3}{17}{M\textsubscript {1}:\relax }{equation.4.2.3}{}}
\newlabel{eq:4.3@cref}{{[equation][3][4]4.3}{[1][15][]17}}
\newlabel{eq:4.4}{{4.4}{17}{M\textsubscript {1}:\relax }{equation.4.2.4}{}}
\newlabel{eq:4.4@cref}{{[equation][4][4]4.4}{[1][15][]17}}
\newlabel{eq:4.5}{{4.5}{17}{M\textsubscript {1}:\relax }{equation.4.2.5}{}}
\newlabel{eq:4.5@cref}{{[equation][5][4]4.5}{[1][15][]17}}
\newlabel{eq:4.6}{{4.6}{17}{M\textsubscript {1}:\relax }{equation.4.2.6}{}}
\newlabel{eq:4.6@cref}{{[equation][6][4]4.6}{[1][15][]17}}
\newlabel{eq:4.7}{{4.7}{17}{M\textsubscript {1}:\relax }{equation.4.2.7}{}}
\newlabel{eq:4.7@cref}{{[equation][7][4]4.7}{[1][15][]17}}
\newlabel{eq:4.8}{{4.8}{17}{M\textsubscript {1}:\relax }{equation.4.2.8}{}}
\newlabel{eq:4.8@cref}{{[equation][8][4]4.8}{[1][15][]17}}
\newlabel{eq:4.9}{{4.9}{17}{M\textsubscript {1}:\relax }{equation.4.2.9}{}}
\newlabel{eq:4.9@cref}{{[equation][9][4]4.9}{[1][15][]17}}
\newlabel{eq:4.10}{{4.10}{17}{M\textsubscript {1}:\relax }{equation.4.2.10}{}}
\newlabel{eq:4.10@cref}{{[equation][10][4]4.10}{[1][15][]17}}
\newlabel{eq:4.11}{{4.11}{17}{M\textsubscript {1}:\relax }{equation.4.2.11}{}}
\newlabel{eq:4.11@cref}{{[equation][11][4]4.11}{[1][15][]17}}
\newlabel{eq:4.12}{{4.12}{17}{M\textsubscript {1}:\relax }{equation.4.2.12}{}}
\newlabel{eq:4.12@cref}{{[equation][12][4]4.12}{[1][15][]17}}
\newlabel{eq:4.13}{{4.13}{17}{M\textsubscript {1}:\relax }{equation.4.2.13}{}}
\newlabel{eq:4.13@cref}{{[equation][13][4]4.13}{[1][15][]17}}
\newlabel{eq:4.14}{{4.14}{17}{M\textsubscript {1}:\relax }{equation.4.2.14}{}}
\newlabel{eq:4.14@cref}{{[equation][14][4]4.14}{[1][15][]17}}
\newlabel{eq:4.15}{{4.15}{17}{M\textsubscript {1}:\relax }{equation.4.2.15}{}}
\newlabel{eq:4.15@cref}{{[equation][15][4]4.15}{[1][15][]17}}
\newlabel{eq:4.16}{{4.16}{17}{M\textsubscript {1}:\relax }{equation.4.2.16}{}}
\newlabel{eq:4.16@cref}{{[equation][16][4]4.16}{[1][15][]17}}
\newlabel{eq:4.17}{{4.17}{17}{M\textsubscript {1}:\relax }{equation.4.2.17}{}}
\newlabel{eq:4.17@cref}{{[equation][17][4]4.17}{[1][15][]17}}
\newlabel{eq:4.18}{{4.18}{17}{M\textsubscript {1}:\relax }{equation.4.2.18}{}}
\newlabel{eq:4.18@cref}{{[equation][18][4]4.18}{[1][15][]17}}
\newlabel{eq:4.19}{{4.19}{17}{M\textsubscript {1}:\relax }{equation.4.2.19}{}}
\newlabel{eq:4.19@cref}{{[equation][19][4]4.19}{[1][15][]17}}
\newlabel{eq:4.20}{{4.20}{17}{M\textsubscript {1}:\relax }{equation.4.2.20}{}}
\newlabel{eq:4.20@cref}{{[equation][20][4]4.20}{[1][15][]17}}
\citation{bibid}
\glsxtr@record{agv}{}{page}{glsnumberformat}{18}
\glsxtr@record{agv}{}{page}{glsnumberformat}{18}
\glsxtr@record{agv}{}{page}{glsnumberformat}{18}
\glsxtr@record{agv}{}{page}{glsnumberformat}{18}
\glsxtr@record{agv}{}{page}{glsnumberformat}{18}
\glsxtr@record{agv}{}{page}{glsnumberformat}{18}
\glsxtr@record{agv}{}{page}{glsnumberformat}{18}
\glsxtr@record{agv}{}{page}{glsnumberformat}{18}
\glsxtr@record{agv}{}{page}{glsnumberformat}{18}
\glsxtr@record{agv}{}{page}{glsnumberformat}{18}
\glsxtr@record{agv}{}{page}{glsnumberformat}{18}
\glsxtr@record{agv}{}{page}{glsnumberformat}{19}
\@writefile{toc}{\contentsline {section}{\numberline {4.3}Modell M\textsubscript  {2}}{19}{section.4.3}\protected@file@percent }
\newlabel{sec:M2}{{4.3}{19}{Modell M\textsubscript {2}}{section.4.3}{}}
\newlabel{sec:M2@cref}{{[section][3][4]4.3}{[1][19][]19}}
\glsxtr@record{agv}{}{page}{glsnumberformat}{19}
\@writefile{lot}{\contentsline {table}{\numberline {4.2}{\ignorespaces Notation des Modells M\textsubscript  {2}\relax }}{19}{table.caption.12}\protected@file@percent }
\newlabel{tab:notation_flow}{{4.2}{19}{Notation des Modells M\textsubscript {2}\relax }{table.caption.12}{}}
\newlabel{tab:notation_flow@cref}{{[table][2][4]4.2}{[1][19][]19}}
\glsxtr@record{agv}{}{page}{glsnumberformat}{19}
\@writefile{lob}{\contentsline {model}{\numberline {2}{\ignorespaces M\textsubscript  {2}:\relax }}{20}{model.2}\protected@file@percent }
\newlabel{model:M2}{{2}{20}{M\textsubscript {2}:\relax }{model.2}{}}
\newlabel{model:M2@cref}{{[model][2][]2}{[1][19][]20}}
\newlabel{eq:obj2}{{4.21}{20}{M\textsubscript {2}:\relax }{equation.4.3.21}{}}
\newlabel{eq:obj2@cref}{{[equation][21][4]4.21}{[1][19][]20}}
\newlabel{eq:4.22}{{4.22}{20}{M\textsubscript {2}:\relax }{equation.4.3.22}{}}
\newlabel{eq:4.22@cref}{{[equation][22][4]4.22}{[1][19][]20}}
\newlabel{eq:4.23}{{4.23}{20}{M\textsubscript {2}:\relax }{equation.4.3.23}{}}
\newlabel{eq:4.23@cref}{{[equation][23][4]4.23}{[1][19][]20}}
\newlabel{eq:4.24}{{4.24}{20}{M\textsubscript {2}:\relax }{equation.4.3.24}{}}
\newlabel{eq:4.24@cref}{{[equation][24][4]4.24}{[1][19][]20}}
\newlabel{eq:4.25}{{4.25}{20}{M\textsubscript {2}:\relax }{equation.4.3.25}{}}
\newlabel{eq:4.25@cref}{{[equation][25][4]4.25}{[1][19][]20}}
\newlabel{eq:4.26}{{4.26}{20}{M\textsubscript {2}:\relax }{equation.4.3.26}{}}
\newlabel{eq:4.26@cref}{{[equation][26][4]4.26}{[1][19][]20}}
\newlabel{eq:4.27}{{4.27}{20}{M\textsubscript {2}:\relax }{equation.4.3.27}{}}
\newlabel{eq:4.27@cref}{{[equation][27][4]4.27}{[1][19][]20}}
\newlabel{eq:4.28}{{4.28}{20}{M\textsubscript {2}:\relax }{equation.4.3.28}{}}
\newlabel{eq:4.28@cref}{{[equation][28][4]4.28}{[1][19][]20}}
\newlabel{eq:4.29}{{4.29}{20}{M\textsubscript {2}:\relax }{equation.4.3.29}{}}
\newlabel{eq:4.29@cref}{{[equation][29][4]4.29}{[1][19][]20}}
\newlabel{eq:4.30}{{4.30}{20}{M\textsubscript {2}:\relax }{equation.4.3.30}{}}
\newlabel{eq:4.30@cref}{{[equation][30][4]4.30}{[1][19][]20}}
\newlabel{eq:4.31}{{4.31}{20}{M\textsubscript {2}:\relax }{equation.4.3.31}{}}
\newlabel{eq:4.31@cref}{{[equation][31][4]4.31}{[1][19][]20}}
\glsxtr@record{agv}{}{page}{glsnumberformat}{20}
\glsxtr@record{agv}{}{page}{glsnumberformat}{20}
\glsxtr@record{agv}{}{page}{glsnumberformat}{20}
\glsxtr@record{agv}{}{page}{glsnumberformat}{20}
\glsxtr@record{agv}{}{page}{glsnumberformat}{20}
\glsxtr@record{agv}{}{page}{glsnumberformat}{20}
\glsxtr@record{sec}{}{page}{glsnumberformat}{21}
\@writefile{toc}{\contentsline {section}{\numberline {4.4}Modell M\textsubscript  {3}}{21}{section.4.4}\protected@file@percent }
\newlabel{sec:M3}{{4.4}{21}{Modell M\textsubscript {3}}{section.4.4}{}}
\newlabel{sec:M3@cref}{{[section][4][4]4.4}{[1][21][]21}}
\glsxtr@record{agv}{}{page}{glsnumberformat}{21}
\@writefile{lof}{\contentsline {figure}{\numberline {4.1}{\ignorespaces Implementierung der Zeit in den Modellen \ref  {model:M1} bis \ref  {model:M3}.\relax }}{21}{figure.caption.13}\protected@file@percent }
\newlabel{fig:timeM1toM3}{{4.1}{21}{Implementierung der Zeit in den Modellen \ref {model:M1} bis \ref {model:M3}.\relax }{figure.caption.13}{}}
\newlabel{fig:timeM1toM3@cref}{{[figure][1][4]4.1}{[1][21][]21}}
\glsxtr@record{agv}{}{page}{glsnumberformat}{21}
\glsxtr@record{agv}{}{page}{glsnumberformat}{21}
\glsxtr@record{agv}{}{page}{glsnumberformat}{22}
\glsxtr@record{agv}{}{page}{glsnumberformat}{22}
\glsxtr@record{agv}{}{page}{glsnumberformat}{22}
\glsxtr@record{agv}{}{page}{glsnumberformat}{22}
\@writefile{lof}{\contentsline {figure}{\numberline {4.2}{\ignorespaces Darstellung der Reihenfolge\relax }}{23}{figure.caption.14}\protected@file@percent }
\newlabel{fig:reihenfolge}{{4.2}{23}{Darstellung der Reihenfolge\relax }{figure.caption.14}{}}
\newlabel{fig:reihenfolge@cref}{{[figure][2][4]4.2}{[1][22][]23}}
\glsxtr@record{agv}{}{page}{glsnumberformat}{23}
\glsxtr@record{agv}{}{page}{glsnumberformat}{23}
\glsxtr@record{agv}{}{page}{glsnumberformat}{23}
\glsxtr@record{agv}{}{page}{glsnumberformat}{23}
\@writefile{lot}{\contentsline {table}{\numberline {4.3}{\ignorespaces Notation des zeitdiskreten Modells M\textsubscript  {3}\relax }}{24}{table.caption.16}\protected@file@percent }
\newlabel{tab:notation_M3}{{4.3}{24}{Notation des zeitdiskreten Modells M\textsubscript {3}\relax }{table.caption.16}{}}
\newlabel{tab:notation_M3@cref}{{[table][3][4]4.3}{[1][23][]24}}
\glsxtr@record{agv}{}{page}{glsnumberformat}{24}
\@writefile{lob}{\contentsline {model}{\numberline {3}{\ignorespaces M\textsubscript  {3}:\relax }}{25}{model.3}\protected@file@percent }
\newlabel{model:M3}{{3}{25}{M\textsubscript {3}:\relax }{model.3}{}}
\newlabel{model:M3@cref}{{[model][3][]3}{[1][23][]25}}
\newlabel{eq:obj33}{{4.32}{25}{M\textsubscript {3}:\relax }{equation.4.4.32}{}}
\newlabel{eq:obj33@cref}{{[equation][32][4]4.32}{[1][23][]25}}
\newlabel{eq:MIP34}{{4.33}{25}{M\textsubscript {3}:\relax }{equation.4.4.33}{}}
\newlabel{eq:MIP34@cref}{{[equation][33][4]4.33}{[1][23][]25}}
\newlabel{eq:MIP35}{{4.34}{25}{M\textsubscript {3}:\relax }{equation.4.4.34}{}}
\newlabel{eq:MIP35@cref}{{[equation][34][4]4.34}{[1][23][]25}}
\newlabel{eq:4.35}{{4.35}{25}{M\textsubscript {3}:\relax }{equation.4.4.35}{}}
\newlabel{eq:4.35@cref}{{[equation][35][4]4.35}{[1][23][]25}}
\newlabel{eq:MIP36}{{4.36}{25}{M\textsubscript {3}:\relax }{equation.4.4.36}{}}
\newlabel{eq:MIP36@cref}{{[equation][36][4]4.36}{[1][23][]25}}
\newlabel{eq:4.37}{{4.37}{25}{M\textsubscript {3}:\relax }{equation.4.4.37}{}}
\newlabel{eq:4.37@cref}{{[equation][37][4]4.37}{[1][23][]25}}
\newlabel{eq:MIP37}{{4.38}{25}{M\textsubscript {3}:\relax }{equation.4.4.38}{}}
\newlabel{eq:MIP37@cref}{{[equation][38][4]4.38}{[1][23][]25}}
\newlabel{eq:MIP38}{{4.39}{25}{M\textsubscript {3}:\relax }{equation.4.4.39}{}}
\newlabel{eq:MIP38@cref}{{[equation][39][4]4.39}{[1][23][]25}}
\newlabel{eq:MIP39}{{4.40}{25}{M\textsubscript {3}:\relax }{equation.4.4.40}{}}
\newlabel{eq:MIP39@cref}{{[equation][40][4]4.40}{[1][23][]25}}
\newlabel{eq:4.41}{{4.41}{25}{M\textsubscript {3}:\relax }{equation.4.4.41}{}}
\newlabel{eq:4.41@cref}{{[equation][41][4]4.41}{[1][23][]25}}
\newlabel{eq:4.42}{{4.42}{25}{M\textsubscript {3}:\relax }{equation.4.4.42}{}}
\newlabel{eq:4.42@cref}{{[equation][42][4]4.42}{[1][23][]25}}
\newlabel{eq:4.43}{{4.43}{25}{M\textsubscript {3}:\relax }{equation.4.4.43}{}}
\newlabel{eq:4.43@cref}{{[equation][43][4]4.43}{[1][23][]25}}
\newlabel{eq:4.47}{{4.44}{25}{M\textsubscript {3}:\relax }{equation.4.4.44}{}}
\newlabel{eq:4.47@cref}{{[equation][44][4]4.44}{[1][23][]25}}
\newlabel{eq:4.48}{{4.45}{25}{M\textsubscript {3}:\relax }{equation.4.4.45}{}}
\newlabel{eq:4.48@cref}{{[equation][45][4]4.45}{[1][23][]25}}
\newlabel{eq:4.49}{{4.46}{25}{M\textsubscript {3}:\relax }{equation.4.4.46}{}}
\newlabel{eq:4.49@cref}{{[equation][46][4]4.46}{[1][23][]25}}
\@writefile{toc}{\contentsline {chapter}{\numberline {5}Numerische Studien}{26}{chapter.5}\protected@file@percent }
\@writefile{lof}{\addvspace {10\p@ }}
\@writefile{lot}{\addvspace {10\p@ }}
\newlabel{chap:calculations}{{5}{26}{Numerische Studien}{chapter.5}{}}
\newlabel{chap:calculations@cref}{{[chapter][5][]5}{[1][26][]26}}
\glsxtr@record{agv}{}{page}{glsnumberformat}{26}
\glsxtr@record{agv}{}{page}{glsnumberformat}{26}
\glsxtr@record{agv}{}{page}{glsnumberformat}{26}
\glsxtr@record{agv}{}{page}{glsnumberformat}{26}
\glsxtr@record{agv}{}{page}{glsnumberformat}{26}
\glsxtr@record{agv}{}{page}{glsnumberformat}{26}
\glsxtr@record{agv}{}{page}{glsnumberformat}{26}
\@writefile{toc}{\contentsline {section}{\numberline {5.1}Lösung von Modell M\textsubscript  {\ref  {model:M1}}}{26}{section.5.1}\protected@file@percent }
\glsxtr@record{agv}{}{page}{glsnumberformat}{27}
\glsxtr@record{agv}{}{page}{glsnumberformat}{27}
\glsxtr@record{agv}{}{page}{glsnumberformat}{27}
\glsxtr@record{agv}{}{page}{glsnumberformat}{27}
\glsxtr@record{agv}{}{page}{glsnumberformat}{27}
\@writefile{lof}{\contentsline {figure}{\numberline {5.1}{\ignorespaces Grafische Darstellung der Lösung einer kleinen Instanz von Modell M\textsubscript  {~\ref  {model:M1}}\relax }}{27}{figure.caption.17}\protected@file@percent }
\newlabel{fig:example_min_M1}{{5.1}{27}{Grafische Darstellung der Lösung einer kleinen Instanz von Modell M\textsubscript {~\ref {model:M1}}\relax }{figure.caption.17}{}}
\newlabel{fig:example_min_M1@cref}{{[figure][1][5]5.1}{[1][26][]27}}
\@writefile{lof}{\contentsline {figure}{\numberline {5.2}{\ignorespaces Grafische Darstellung der Lösung einer Instanz von Modell M\textsubscript  {~\ref  {model:M1}}\relax }}{28}{figure.caption.18}\protected@file@percent }
\newlabel{fig:example_M1}{{5.2}{28}{Grafische Darstellung der Lösung einer Instanz von Modell M\textsubscript {~\ref {model:M1}}\relax }{figure.caption.18}{}}
\newlabel{fig:example_M1@cref}{{[figure][2][5]5.2}{[1][27][]28}}
\glsxtr@record{agv}{}{page}{glsnumberformat}{28}
\@writefile{lof}{\contentsline {figure}{\numberline {5.3}{\ignorespaces Grafische Darstellung der Lösung einer Beispielinstanz von Modell M\textsubscript  {~\ref  {model:M1}}\relax }}{29}{figure.caption.19}\protected@file@percent }
\newlabel{fig:example_2_M1}{{5.3}{29}{Grafische Darstellung der Lösung einer Beispielinstanz von Modell M\textsubscript {~\ref {model:M1}}\relax }{figure.caption.19}{}}
\newlabel{fig:example_2_M1@cref}{{[figure][3][5]5.3}{[1][28][]29}}
\@writefile{lot}{\contentsline {table}{\numberline {5.1}{\ignorespaces Notation der Testinstanzen für die Modelle M\textsubscript  {\ref  {model:M1}} bis M\textsubscript  {\ref  {model:M3}}.\relax }}{29}{table.caption.21}\protected@file@percent }
\newlabel{tab:instances}{{5.1}{29}{Notation der Testinstanzen für die Modelle M\textsubscript {\ref {model:M1}} bis M\textsubscript {\ref {model:M3}}.\relax }{table.caption.21}{}}
\newlabel{tab:instances@cref}{{[table][1][5]5.1}{[1][28][]29}}
\@writefile{lot}{\contentsline {table}{\numberline {5.2}{\ignorespaces Berechnungsergebnisse der Instanzen für Modell M\textsubscript  {\ref  {model:M1}}.\relax }}{31}{table.caption.23}\protected@file@percent }
\newlabel{tab:results_M1}{{5.2}{31}{Berechnungsergebnisse der Instanzen für Modell M\textsubscript {\ref {model:M1}}.\relax }{table.caption.23}{}}
\newlabel{tab:results_M1@cref}{{[table][2][5]5.2}{[1][29][]31}}
\@writefile{lot}{\contentsline {table}{\numberline {5.3}{\ignorespaces Berechnungsergebnisse der Instanzen für Modell M\textsubscript  {\ref  {model:M1}}.\relax }}{32}{table.caption.25}\protected@file@percent }
\newlabel{tab:results_M1_2}{{5.3}{32}{Berechnungsergebnisse der Instanzen für Modell M\textsubscript {\ref {model:M1}}.\relax }{table.caption.25}{}}
\newlabel{tab:results_M1_2@cref}{{[table][3][5]5.3}{[1][29][]32}}
\@writefile{toc}{\contentsline {section}{\numberline {5.2}Lösung von Modell M\textsubscript  {\ref  {model:M2}}}{33}{section.5.2}\protected@file@percent }
\@writefile{toc}{\contentsline {section}{\numberline {5.3}Lösung von Modell M\textsubscript  {\ref  {model:M3}}}{33}{section.5.3}\protected@file@percent }
\bibstyle{agsm}
\bibdata{thesisref}
\@writefile{toc}{\contentsline {chapter}{\numberline {6}Zusammenfassung}{34}{chapter.6}\protected@file@percent }
\@writefile{lof}{\addvspace {10\p@ }}
\@writefile{lot}{\addvspace {10\p@ }}
\newlabel{chap:summary}{{6}{34}{Zusammenfassung}{chapter.6}{}}
\newlabel{chap:summary@cref}{{[chapter][6][]6}{[1][34][]34}}
\glsxtr@record{agv}{}{page}{glsnumberformat}{34}
\glsxtr@record{agv}{}{page}{glsnumberformat}{34}
\glsxtr@record{agv}{}{page}{glsnumberformat}{34}
\glsxtr@record{agv}{}{page}{glsnumberformat}{34}
\glsxtr@record{agv}{}{page}{glsnumberformat}{34}
\glsxtr@record{tsp}{}{page}{glsnumberformat}{34}
\glsxtr@record{agv}{}{page}{glsnumberformat}{34}
\glsxtr@record{vrp}{}{page}{glsnumberformat}{34}
\glsxtr@record{milp}{}{page}{glsnumberformat}{34}
\glsxtr@record{agv}{}{page}{glsnumberformat}{34}
\glsxtr@record{agv}{}{page}{glsnumberformat}{35}
\glsxtr@record{agv}{}{page}{glsnumberformat}{35}
\glsxtr@record{agv}{}{page}{glsnumberformat}{35}
\glsxtr@record{agv}{}{page}{glsnumberformat}{35}
\glsxtr@record{agv}{}{page}{glsnumberformat}{35}
\glsxtr@record{agv}{}{page}{glsnumberformat}{35}
\glsxtr@record{agv}{}{page}{glsnumberformat}{35}
\bibcite{dantzig1959truck}{{1}{1959}{{Dantzig \&\ Ramser}}{{}}}
\bibcite{domschke2015}{{2}{2015}{{Domschke et~al.}}{{Domschke, Drexl, Klein \&\ Scholl}}}
\bibcite{fisher1981}{{3}{1981}{{Fisher \&\ Jaikumar}}{{}}}
\bibcite{furmans2009}{{4}{2009}{{Furmans et~al.}}{{Furmans, Huber \&\ Wisser}}}
\bibcite{ganesharajah1998design}{{5}{1998}{{Ganesharajah et~al.}}{{Ganesharajah, Hall \&\ Sriskandarajah}}}
\bibcite{huang2012}{{6}{2012}{{Huang et~al.}}{{Huang, Chang \&\ Lin}}}
\bibcite{jianyang2003conflict}{{7}{2003}{{Jianyang \&\ Wen-Jing}}{{}}}
\bibcite{miller1960}{{8}{1960}{{Miller et~al.}}{{Miller, Tucker \&\ Zemlin}}}
\bibcite{pisuchpen2012}{{9}{2012}{{Pisuchpen}}{{}}}
\bibcite{ratliff1983order}{{10}{1983}{{Ratliff \&\ Rosenthal}}{{}}}
\bibcite{solomon1988survey}{{11}{1988}{{Solomon \&\ Desrosiers}}{{}}}
\bibcite{soylu2000self}{{12}{2000}{{Soylu et~al.}}{{Soylu, {\"O}zdemirel \&\ Kayaligil}}}
\bibcite{tothandvigo2002}{{13}{2002}{{Toth \&\ Vigo}}{{}}}
\bibcite{ullrich2015automated}{{14}{2015}{{Ullrich et~al.}}{{}}}
\bibcite{vis2006survey}{{15}{2006}{{Vis}}{{}}}
\bibcite{wang2014multi}{{16}{2014}{{Wang \&\ Chan}}{{}}}
\newlabel{LastPage}{{}{37}{}{page.37}{}}
\xdef\lastpage@lastpage{37}
\xdef\lastpage@lastpageHy{37}
