{
	"JSON": {
		"ID": "1ee80a44-6c21-6502-b02c-00678e9f1f40",
		"label": "",
		"comment": "UUID6 is used"
	},
	"instrument": {
		"name": "raspberry_pi",
		"type": "single_board_computer",
		"manufacturer": "Raspberry Pi Foundation",
		"model": "Raspberry Pi 4 Model B Rev 1.5",
		"serial": "1000000097cc0e21",
		"operating_system": "Raspberry Pi OS"
		
	}
}