{
	"JSON": {
		"ID": "1ee809ee-496a-6c68-b1ac-24925961eec5",
		"label": "",
		"comment": "UUID6 is used"
	},
	"sensor": {
		"name": "Temperature_Sensor",
		"type": "DS18B20",
		"manufacturer": "keyestudio",
		"serial": "3ce104574e20",
		"comment": "Sensor Cup, warm",
		"range": {
			"min": 0,
			"max": 0,
			"units": "Grad in Celsius"
		},
		"accuracy": {
			"value": 0.0,
			"type": "0,5(relative/absolute/fromMaximum)",
			"unit": "Grad in Celsius(degree_celsius/percent)"
		}
	}
}
