{
	"JSON": {
		"ID": "1ee80a82-989d-6296-b925-652756f61363",
		"label": "",
		"comment": "UUID6 is used"
	},
    "comment": "here you can write down something important about this setup file",
    "info": "List below ALL components, you used in your experiment. By using the UUID there is no possibility to mix something up.",
	"setup": {
		"1ee80a55-c676-6588-abea-3fd201035103": {
            "type": "group_info",
			"name": "group_info",
            "comment": ""
        },
		"1ee80a44-6c21-6502-b02c-00678e9f1f40": {
            "type": "instrument",
			"name": "raspberry_pi",
            "comment": ""
        },
		"1ee809ee-496a-6c68-b1ac-24925961eec5": {
            "type": "sensor",
			"name": "temperature_environment",
            "comment": "2"
        },
		"1ee80a58-b31c-61d9-bc14-1054e242c842": {
            "type": "probecapacity",
			"name": "probe_description",
            "comment": ""
        },    
		"1ee809f4-469b-61f3-b8b0-e35af6ea279e": {
			"type": "sensor",
			"name": "temperature_cup",
			"comment": "1"
		}
	}
}