{
    "assembly": {
        "uuid": "kpi-a916d88c-61cd-49e2-8f28-91aa3887f4d7",
        "properties": {
            "label": "scooter",
            "manufacturer": "FST",
            "comment": "Faster! Harder! Car!",
            "mass [g]": 160.29999999999998,
            "price [Euro]": 51.36100000000001,
            "delivery time [days]": 13
        },
        "layer": "kpi-SYSTEM",
        "components": [
            {
                "component": {
                    "uuid": "kpi-50e44769-7dff-447c-8f62-e850903e926d",
                    "properties": {
                        "label": "battery2",
                        "item number": "88000-1",
                        "item description": "Lego AAA Battery Box",
                        "category": "battery",
                        "price [Euro]": 30,
                        "mass [g]": 97.24,
                        "delivery time [days]": 6,
                        "data source": "https://www.brickowl.de/catalog/lego-aaa-battery-box-set-88000",
                        "output voltage [V]": 9.0,
                        "dimensions [cm]": "15,3 x 15,1 x 3,9"
                    },
                    "layer": "kpi-COMPONENT"
                }
            }
        ],
        "assemblies": [
            {
                "assembly": {
                    "uuid": "kpi-2bcd525b-e93d-4ca1-a041-175544279ee5",
                    "properties": {
                        "label": "chasis assembly2"
                    },
                    "layer": "kpi-SUBASSEMBLY",
                    "components": [
                        {
                            "component": {
                                "uuid": "kpi-37adc76f-ef6e-4744-880e-2092ad2a6bbb",
                                "properties": {
                                    "label": "frame_right2",
                                    "item number": 3895,
                                    "item description": "Technic, Brick 1 x 12 with Holes",
                                    "category": "frame",
                                    "price [Euro]": 0.03,
                                    "mass [g]": 4.2,
                                    "delivery time [days]": 5,
                                    "data source": "https://www.bricklink.com/v2/catalog/catalogitem.page?P=3895#T=C",
                                    "dimension [studs]": "1 x 12 x 1"
                                },
                                "layer": "kpi-COMPONENT"
                            }
                        },
                        {
                            "component": {
                                "uuid": "kpi-04543dad-f694-4a55-a3bd-4130cffd9fa1",
                                "properties": {
                                    "label": "frame_left2",
                                    "item number": 3895,
                                    "item description": "Technic, Brick 1 x 12 with Holes",
                                    "category": "frame",
                                    "price [Euro]": 0.03,
                                    "mass [g]": 4.2,
                                    "delivery time [days]": 5,
                                    "data source": "https://www.bricklink.com/v2/catalog/catalogitem.page?P=3895#T=C",
                                    "dimension [studs]": "1 x 12 x 1"
                                },
                                "layer": "kpi-COMPONENT"
                            }
                        }
                    ],
                    "assemblies": [
                        {
                            "assembly": {
                                "uuid": "kpi-b630a3eb-67d3-4928-b0da-d9ae4ea1f235",
                                "properties": {
                                    "label": "front wheel assembly2",
                                    "assembly_method": "stick together like lego blocks"
                                },
                                "layer": "kpi-SUBASSEMBLY",
                                "components": [
                                    {
                                        "component": {
                                            "uuid": "kpi-e303eee1-d068-4f5d-8bbf-344eb1efdf2d",
                                            "properties": {
                                                "label": "front wheel right2",
                                                "item number": "3482c01",
                                                "item description": "wheel 24",
                                                "category": "wheel",
                                                "related items": 3483,
                                                "price [Euro]": 0.01,
                                                "mass [g]": 3.0,
                                                "delivery time [days]": 5,
                                                "data source": "https://www.bricklink.com/v2/catalog/catalogitem.page?P=3482c01#T=C",
                                                "diameter [mm]": 24.0
                                            },
                                            "layer": "kpi-COMPONENT"
                                        }
                                    },
                                    {
                                        "component": {
                                            "uuid": "kpi-0f4f75f3-1294-49e1-9c15-a61c468af7f6",
                                            "properties": {
                                                "label": "gear_axle",
                                                "item number": 32269,
                                                "item description": "Gear 20 Tooth",
                                                "category": "gear",
                                                "price [Euro]": 0.36,
                                                "mass [g]": 1.4,
                                                "delivery time [days]": 13,
                                                "data source": "https://www.bricklink.com/v2/catalog/catalogitem.page?P=32269#T=C"
                                            },
                                            "layer": "kpi-COMPONENT"
                                        }
                                    },
                                    {
                                        "component": {
                                            "uuid": "kpi-fe62101a-db5c-4785-991f-22c90deb3dae",
                                            "properties": {
                                                "label": "front axle2",
                                                "item number": 44294,
                                                "item description": "Axle 7 studs",
                                                "category": "axle",
                                                "price [Euro]": 0.01,
                                                "mass [g]": 1.05,
                                                "delivery time [days]": 3,
                                                "data source": "https://www.bricklink.com/v2/catalog/catalogitem.page?P=44294#T=S&O={%22iconly%22:0}",
                                                "dimension [studs]": 7,
                                                "color": "grey"
                                            },
                                            "layer": "kpi-COMPONENT"
                                        }
                                    },
                                    {
                                        "component": {
                                            "uuid": "kpi-3e2e0c33-1bd1-4e71-819b-b52c9f237f68",
                                            "properties": {
                                                "label": "front wheel left2",
                                                "item number": "3482c01",
                                                "item description": "wheel 24",
                                                "category": "wheel",
                                                "related items": 3483,
                                                "price [Euro]": 0.01,
                                                "mass [g]": 3.0,
                                                "delivery time [days]": 5,
                                                "data source": "https://www.bricklink.com/v2/catalog/catalogitem.page?P=3482c01#T=C",
                                                "diameter [mm]": 24.0
                                            },
                                            "layer": "kpi-COMPONENT"
                                        }
                                    }
                                ],
                                "assemblies": []
                            }
                        },
                        {
                            "assembly": {
                                "uuid": "kpi-43e2e258-54c7-4f34-a5e0-7e450eafacc8",
                                "properties": {
                                    "label": "back wheel assembly2"
                                },
                                "layer": "kpi-SUBASSEMBLY",
                                "components": [
                                    {
                                        "component": {
                                            "uuid": "kpi-0819dffc-c728-421e-b2fc-308b2b09c979",
                                            "properties": {
                                                "label": "back wheel right2",
                                                "item number": "3482c01",
                                                "item description": "wheel 24",
                                                "category": "wheel",
                                                "related items": 3483,
                                                "price [Euro]": 0.01,
                                                "mass [g]": 3.0,
                                                "delivery time [days]": 5,
                                                "data source": "https://www.bricklink.com/v2/catalog/catalogitem.page?P=3482c01#T=C",
                                                "diameter [mm]": 24.0
                                            },
                                            "layer": "kpi-COMPONENT"
                                        }
                                    },
                                    {
                                        "component": {
                                            "uuid": "kpi-c748894f-77e0-4bff-b955-9cebf00e3921",
                                            "properties": {
                                                "label": "back axle2",
                                                "item number": 44294,
                                                "item description": "Axle 7 studs",
                                                "category": "axle",
                                                "price [Euro]": 0.01,
                                                "mass [g]": 1.05,
                                                "delivery time [days]": 3,
                                                "data source": "https://www.bricklink.com/v2/catalog/catalogitem.page?P=44294#T=S&O={%22iconly%22:0}",
                                                "dimension [studs]": 7,
                                                "color": "grey"
                                            },
                                            "layer": "kpi-COMPONENT"
                                        }
                                    },
                                    {
                                        "component": {
                                            "uuid": "kpi-a7088fcc-6e57-4c86-987a-baff9933bfba",
                                            "properties": {
                                                "label": "back wheel left2",
                                                "item number": "3482c01",
                                                "item description": "wheel 24",
                                                "category": "wheel",
                                                "related items": 3483,
                                                "price [Euro]": 0.01,
                                                "mass [g]": 3.0,
                                                "delivery time [days]": 5,
                                                "data source": "https://www.bricklink.com/v2/catalog/catalogitem.page?P=3482c01#T=C",
                                                "diameter [mm]": 24.0
                                            },
                                            "layer": "kpi-COMPONENT"
                                        }
                                    }
                                ],
                                "assemblies": []
                            }
                        }
                    ]
                }
            },
            {
                "assembly": {
                    "uuid": "kpi-62c03017-de4b-4f08-856a-f7f7ad4131ac",
                    "properties": {
                        "label": "drivetrain assembly2"
                    },
                    "layer": "kpi-SUBASSEMBLY",
                    "components": [
                        {
                            "component": {
                                "uuid": "kpi-85541dac-b101-4560-ac7c-a64eb75c1ece",
                                "properties": {
                                    "label": "engine",
                                    "item number": "8883-1",
                                    "item description": "Power Functions M-Motor",
                                    "category": "motor",
                                    "related items": "8881, 8878, 45517, 88000",
                                    "idle current [mA]": 65,
                                    "idle speed [rev per min]": 405,
                                    "locking torque [Ncm]": 11,
                                    "price [Euro]": 20,
                                    "mass [g]": 35.0,
                                    "delivery time [days]": 5,
                                    "data source": "https://www.bricklink.com/v2/catalog/catalogitem.page?S=8883-1&name=Power%20Functions%20M-Motor&category=%5BPower%20Functions%5D#T=S&O={%22iconly%22:0}",
                                    "compatible battery": "8881, 8878, 45517, 88000",
                                    "input voltage [V]": 9,
                                    "dimensions [cm]": "13.8 x 11.9 x 2.3"
                                },
                                "layer": "kpi-COMPONENT"
                            }
                        }
                    ],
                    "assemblies": [
                        {
                            "assembly": {
                                "uuid": "kpi-74efaf13-7fb8-42fc-842c-40d5af367993",
                                "properties": {
                                    "label": "gear assembly2"
                                },
                                "layer": "kpi-SUBASSEMBLY",
                                "components": [
                                    {
                                        "component": {
                                            "uuid": "kpi-0ecb51a0-bad8-4115-986b-b55a434bb559",
                                            "properties": {
                                                "label": "axle_engine",
                                                "item number": 32073,
                                                "item description": "Axle 5 studs",
                                                "category": "axle",
                                                "price [Euro]": 0.001,
                                                "mass [g]": 0.66,
                                                "delivery time [days]": 3,
                                                "data source": "https://www.bricklink.com/v2/catalog/catalogitem.page?P=32073#T=S&O={%22iconly%22:0}",
                                                "dimension [studs]": 5
                                            },
                                            "layer": "kpi-COMPONENT"
                                        }
                                    },
                                    {
                                        "component": {
                                            "uuid": "kpi-73ed3ba8-5200-44a7-ae0c-e165952c4e55",
                                            "properties": {
                                                "label": "gear_engine",
                                                "item number": 32498,
                                                "item description": "Gear 36 Tooth",
                                                "category": "gear",
                                                "price [Euro]": 0.88,
                                                "mass [g]": 3.5,
                                                "delivery time [days]": 12,
                                                "data source": "https://www.bricklink.com/v2/catalog/catalogitem.page?P=32498#T=C",
                                                "color": "blue"
                                            },
                                            "layer": "kpi-COMPONENT"
                                        }
                                    }
                                ],
                                "assemblies": []
                            }
                        }
                    ]
                }
            }
        ]
    }
}