{
	"JSON": {
		"ID": "1ee8239b-46ec-63dc-8aa4-b8751ac37fd3",
		"label": "",
		"comment": "UUID6 is used"
	},
	"actor": {
		"name": "brushless DC motor",
		"type": "57BLF03",
		"manufacturer": "ACT-Motor",
		"max rpms": "3000",
		"power_supply": {
			"voltage": "24",
			"type": "DC voltage"
		}
	}
}